synapse-dev mailing list archives

Site index · List index
Message view « Date » · « Thread »
Top « Date » · « Thread »
From Apache Jenkins Server <jenk...@builds.apache.org>
Subject Build failed in Jenkins: Synapse - Trunk #4054
Date Mon, 19 Dec 2011 09:11:40 GMT
See <https://builds.apache.org/job/Synapse%20-%20Trunk/4054/changes>

Changes:

[hiranya] Fixing SYNAPSE-809

[hiranya] Fixing SYNAPSE-743

[hiranya] Payload factory sample - SYNASPE-821

[hiranya] Fixing xalan duplication issue

------------------------------------------
[...truncated 2744 lines...]
[INFO] [INFO] Installing <https://builds.apache.org/job/Synapse%20-%20Trunk/ws/java/modules/packaging/package-skeleton/pom.xml>
to <https://builds.apache.org/job/Synapse%20-%20Trunk/ws/.repository/org/apache/synapse/synapse-package-skeleton/2.1.0-SNAPSHOT/synapse-package-skeleton-2.1.0-SNAPSHOT.pom>
[INFO] Installing <https://builds.apache.org/job/Synapse%20-%20Trunk/ws/java/modules/packaging/package-skeleton/target/synapse-package-skeleton-2.1.0-SNAPSHOT.zip>
to <https://builds.apache.org/job/Synapse%20-%20Trunk/ws/.repository/org/apache/synapse/synapse-package-skeleton/2.1.0-SNAPSHOT/synapse-package-skeleton-2.1.0-SNAPSHOT.zip>

[INFO] --- maven-install-plugin:2.3:install (default-install) @ synapse-package-skeleton ---
[INFO] 
[INFO] --- maven-site-plugin:2.0-beta-6:site (default-site) @ synapse-package-skeleton ---
[INFO] Unable to load parent project from a relative path: 1 problem was encountered while
building the effective model
[FATAL] Non-readable POM <https://builds.apache.org/job/Synapse%20-%20Trunk/ws/java/../pom.xml>:
<https://builds.apache.org/job/Synapse%20-%20Trunk/ws/java/../pom.xml> (No such file
or directory) @ 
 for project  at <https://builds.apache.org/job/Synapse%20-%20Trunk/ws/java/../pom.xml>
for project  at <https://builds.apache.org/job/Synapse%20-%20Trunk/ws/java/../pom.xml>
[INFO] Parent project loaded from repository.
[FINDBUGS] Using set difference to compute new warnings
[FINDBUGS] Not changing build status, since no threshold has been exceeded
[JENKINS] Archiving site from <https://builds.apache.org/job/Synapse%20-%20Trunk/ws/java/modules/packaging/package-skeleton/target/site>
to /home/hudson/hudson/jobs/Synapse - Trunk/site/synapse-package-skeleton
[JENKINS] Archiving <https://builds.apache.org/job/Synapse%20-%20Trunk/ws/java/modules/packaging/package-skeleton/pom.xml>
to /home/hudson/hudson/jobs/Synapse - Trunk/modules/org.apache.synapse$synapse-package-skeleton/builds/2011-12-19_09-01-51/archive/org.apache.synapse/synapse-package-skeleton/2.1.0-SNAPSHOT/synapse-package-skeleton-2.1.0-SNAPSHOT.pom
[JENKINS] Archiving <https://builds.apache.org/job/Synapse%20-%20Trunk/ws/java/modules/packaging/package-skeleton/target/synapse-package-skeleton-2.1.0-SNAPSHOT.zip>
to /home/hudson/hudson/jobs/Synapse - Trunk/modules/org.apache.synapse$synapse-package-skeleton/builds/2011-12-19_09-01-51/archive/org.apache.synapse/synapse-package-skeleton/2.1.0-SNAPSHOT/synapse-package-skeleton-2.1.0-SNAPSHOT.zip
[INFO]                                                                         
[INFO] ------------------------------------------------------------------------
[INFO] Building Apache Synapse - Package archetype 2.1.0-SNAPSHOT
[INFO] ------------------------------------------------------------------------
[INFO] 
[INFO] Deleting directory <https://builds.apache.org/job/Synapse%20-%20Trunk/ws/java/modules/packaging/package-archetype/target>
[INFO] --- maven-clean-plugin:2.2:clean (default-clean) @ synapse-package-archetype ---
[INFO] 
[INFO] --- maven-remote-resources-plugin:1.1:process (default) @ synapse-package-archetype
---
[INFO] Setting property: classpath.resource.loader.class => 'org.codehaus.plexus.velocity.ContextClassLoaderResourceLoader'.
[INFO] Setting property: velocimacro.messages.on => 'false'.
[INFO] Setting property: resource.loader => 'classpath'.
[INFO] Setting property: resource.manager.logwhenfound => 'false'.
Downloading: http://people.apache.org/repo/m2-snapshot-repository/net/sf/saxon/saxon-xqj/8.9/saxon-xqj-8.9.pom
Downloading: http://dist.wso2.org/maven2/net/sf/saxon/saxon-xqj/8.9/saxon-xqj-8.9.pom
Downloading: http://repo1.maven.org/maven2/net/sf/saxon/saxon-xqj/8.9/saxon-xqj-8.9.pom
Downloading: http://people.apache.org/repo/m2-snapshot-repository/JLex/JLex/0.0/JLex-0.0.pom
Downloading: http://dist.wso2.org/maven2/JLex/JLex/0.0/JLex-0.0.pom
Downloading: http://repo1.maven.org/maven2/JLex/JLex/0.0/JLex-0.0.pom
Downloading: http://people.apache.org/repo/m2-snapshot-repository/net/sf/saxon/saxon/8.9/saxon-8.9.pom
Downloading: http://dist.wso2.org/maven2/net/sf/saxon/saxon/8.9/saxon-8.9.pom
Downloading: http://repo1.maven.org/maven2/net/sf/saxon/saxon/8.9/saxon-8.9.pom
Downloading: http://people.apache.org/repo/m2-snapshot-repository/java-cup/java-cup/0.0/java-cup-0.0.pom
Downloading: http://dist.wso2.org/maven2/java-cup/java-cup/0.0/java-cup-0.0.pom
Downloading: http://repo1.maven.org/maven2/java-cup/java-cup/0.0/java-cup-0.0.pom
[INFO] 
[INFO] --- maven-resources-plugin:2.3:resources (default-resources) @ synapse-package-archetype
---
[INFO] Using 'UTF-8' encoding to copy filtered resources.
[INFO] Copying 7 resources
[INFO] Copying 3 resources
[INFO] [INFO] Using 'UTF-8' encoding to copy filtered resources.
[INFO] skip non existing resourceDirectory <https://builds.apache.org/job/Synapse%20-%20Trunk/ws/java/modules/packaging/package-archetype/src/test/resources>
[INFO] Copying 3 resources

[INFO] --- maven-resources-plugin:2.3:testResources (default-testResources) @ synapse-package-archetype
---
[INFO] 
[INFO] --- maven-archetype-plugin:2.0-alpha-4:jar (default-jar) @ synapse-package-archetype
---
[INFO] Setting property: classpath.resource.loader.class => 'org.codehaus.plexus.velocity.ContextClassLoaderResourceLoader'.
[INFO] Setting property: velocimacro.messages.on => 'false'.
[INFO] Setting property: resource.loader => 'classpath'.
[INFO] Setting property: resource.manager.logwhenfound => 'false'.
[INFO] 
[INFO] --- maven-archetype-plugin:2.0-alpha-4:add-archetype-metadata (default-add-archetype-metadata)
@ synapse-package-archetype ---
[INFO] 
[INFO] --- maven-archetype-plugin:2.0-alpha-4:integration-test (default-integration-test)
@ synapse-package-archetype ---
[INFO] 
[INFO] --- maven-install-plugin:2.3:install (default-install) @ synapse-package-archetype
---
[INFO] Installing <https://builds.apache.org/job/Synapse%20-%20Trunk/ws/java/modules/packaging/package-archetype/target/synapse-package-archetype-2.1.0-SNAPSHOT.jar>
to <https://builds.apache.org/job/Synapse%20-%20Trunk/ws/.repository/org/apache/synapse/synapse-package-archetype/2.1.0-SNAPSHOT/synapse-package-archetype-2.1.0-SNAPSHOT.jar>
[INFO] Installing <https://builds.apache.org/job/Synapse%20-%20Trunk/ws/java/modules/packaging/package-archetype/pom.xml>
to <https://builds.apache.org/job/Synapse%20-%20Trunk/ws/.repository/org/apache/synapse/synapse-package-archetype/2.1.0-SNAPSHOT/synapse-package-archetype-2.1.0-SNAPSHOT.pom>
[INFO] 
[INFO] --- maven-archetype-plugin:2.0-alpha-4:update-local-catalog (default-update-local-catalog)
@ synapse-package-archetype ---
[INFO] 
[INFO] --- maven-site-plugin:2.0-beta-6:site (default-site) @ synapse-package-archetype ---
[INFO] Unable to load parent project from a relative path: 1 problem was encountered while
building the effective model
[FATAL] Non-readable POM <https://builds.apache.org/job/Synapse%20-%20Trunk/ws/java/../pom.xml>:
<https://builds.apache.org/job/Synapse%20-%20Trunk/ws/java/../pom.xml> (No such file
or directory) @ 
 for project  at <https://builds.apache.org/job/Synapse%20-%20Trunk/ws/java/../pom.xml>
for project  at <https://builds.apache.org/job/Synapse%20-%20Trunk/ws/java/../pom.xml>
[INFO] Parent project loaded from repository.
[FINDBUGS] Using set difference to compute new warnings
[FINDBUGS] Not changing build status, since no threshold has been exceeded
[JENKINS] Archiving site from <https://builds.apache.org/job/Synapse%20-%20Trunk/ws/java/modules/packaging/package-archetype/target/site>
to /home/hudson/hudson/jobs/Synapse - Trunk/site/synapse-package-archetype
[JENKINS] Archiving <https://builds.apache.org/job/Synapse%20-%20Trunk/ws/java/modules/packaging/package-archetype/pom.xml>
to /home/hudson/hudson/jobs/Synapse - Trunk/modules/org.apache.synapse$synapse-package-archetype/builds/2011-12-19_09-01-51/archive/org.apache.synapse/synapse-package-archetype/2.1.0-SNAPSHOT/synapse-package-archetype-2.1.0-SNAPSHOT.pom
[JENKINS] Archiving <https://builds.apache.org/job/Synapse%20-%20Trunk/ws/java/modules/packaging/package-archetype/target/synapse-package-archetype-2.1.0-SNAPSHOT.jar>
to /home/hudson/hudson/jobs/Synapse - Trunk/modules/org.apache.synapse$synapse-package-archetype/builds/2011-12-19_09-01-51/archive/org.apache.synapse/synapse-package-archetype/2.1.0-SNAPSHOT/synapse-package-archetype-2.1.0-SNAPSHOT.jar
[INFO] ------------------------------------------------------------------------
[INFO] Reactor Summary:
[INFO] 
[INFO] Apache Synapse - Secure vault ..................... SUCCESS [7.507s]
[INFO] Apache Synapse .................................... SUCCESS [18.425s]
[INFO] Apache Synapse - Commons classes .................. SUCCESS [13.338s]
[INFO] Apache Synapse - Transports ....................... SUCCESS [4.096s]
[INFO] Apache Synapse - Non-blocking HTTP/s Transport .... SUCCESS [13.940s]
[INFO] Apache Synapse - PIPE Transport ................... SUCCESS [3.756s]
[INFO] Apache Synapse - VFS Transport .................... SUCCESS [12.867s]
[INFO] Apache Synapse - Tasks classes .................... SUCCESS [3.200s]
[INFO] Apache Synapse - Core ............................. SUCCESS [2:09.493s]
[INFO] Apache Synapse - FIX Transport .................... SUCCESS [5.228s]
[INFO] Apache Synapse - Extensions ....................... SUCCESS [9.972s]
[INFO] Apache Synapse - Samples .......................... SUCCESS [9.898s]
[INFO] Apache Synapse - Patches .......................... SUCCESS [4.122s]
[INFO] Apache Synapse - Experimental code ................ SUCCESS [3.422s]
[INFO] Apache Synapse - Web Application .................. SUCCESS [9.766s]
[INFO] Apache Synapse - Handler Module ................... SUCCESS [4.561s]
[INFO] Apache Synapse - XAR Maven Plugin ................. SUCCESS [2.584s]
[INFO] Apache Synapse - Configuration Migrator ........... SUCCESS [3.969s]
[INFO] Apache Synapse - Distribution ..................... SUCCESS [59.188s]
[INFO] Apache Synapse - Package skeleton ZIP ............. SUCCESS [2.262s]
[INFO] Apache Synapse - Package archetype ................ SUCCESS [2.827s]
[INFO] ------------------------------------------------------------------------
[INFO] BUILD SUCCESS
[INFO] ------------------------------------------------------------------------
[INFO] Total time: 7:44.203s
[INFO] Finished at: Mon Dec 19 09:09:40 GMT 2011
[INFO] Final Memory: 89M/862M
[INFO] ------------------------------------------------------------------------
Waiting for Jenkins to finish collecting data
[FINDBUGS] Aggregating results of Apache Synapse - Secure vault
[FINDBUGS] Using set difference to compute new warnings
[FINDBUGS] Not changing build status, since no threshold has been exceeded
[FINDBUGS] Aggregating results of Apache Synapse
[FINDBUGS] Using set difference to compute new warnings
[FINDBUGS] Not changing build status, since no threshold has been exceeded
[FINDBUGS] Aggregating results of Apache Synapse - Commons classes
[FINDBUGS] Using set difference to compute new warnings
[FINDBUGS] Not changing build status, since no threshold has been exceeded
[FINDBUGS] Aggregating results of Apache Synapse - Transports
[FINDBUGS] Using set difference to compute new warnings
[FINDBUGS] Not changing build status, since no threshold has been exceeded
[FINDBUGS] Aggregating results of Apache Synapse - Non-blocking HTTP/s Transport
[FINDBUGS] Using set difference to compute new warnings
[FINDBUGS] Not changing build status, since no threshold has been exceeded
[FINDBUGS] Aggregating results of Apache Synapse - PIPE Transport
[FINDBUGS] Using set difference to compute new warnings
[FINDBUGS] Not changing build status, since no threshold has been exceeded
[FINDBUGS] Aggregating results of Apache Synapse - VFS Transport
[FINDBUGS] Using set difference to compute new warnings
[FINDBUGS] Not changing build status, since no threshold has been exceeded
[FINDBUGS] Aggregating results of Apache Synapse - Tasks classes
[FINDBUGS] Using set difference to compute new warnings
[FINDBUGS] Not changing build status, since no threshold has been exceeded
[FINDBUGS] Aggregating results of Apache Synapse - Core
[FINDBUGS] Using set difference to compute new warnings
[FINDBUGS] Not changing build status, since no threshold has been exceeded
[FINDBUGS] Aggregating results of Apache Synapse - FIX Transport
[FINDBUGS] Using set difference to compute new warnings
[FINDBUGS] Not changing build status, since no threshold has been exceeded
[FINDBUGS] Aggregating results of Apache Synapse - Extensions
[FINDBUGS] Using set difference to compute new warnings
[FINDBUGS] Not changing build status, since no threshold has been exceeded
[FINDBUGS] Aggregating results of Apache Synapse - Samples
[FINDBUGS] Using set difference to compute new warnings
[FINDBUGS] Not changing build status, since no threshold has been exceeded
[FINDBUGS] Aggregating results of Apache Synapse - Patches
[FINDBUGS] Using set difference to compute new warnings
[FINDBUGS] Not changing build status, since no threshold has been exceeded
[FINDBUGS] Aggregating results of Apache Synapse - Experimental code
[FINDBUGS] Using set difference to compute new warnings
[FINDBUGS] Not changing build status, since no threshold has been exceeded
[FINDBUGS] Aggregating results of Apache Synapse - Web Application
[FINDBUGS] Using set difference to compute new warnings
[FINDBUGS] Not changing build status, since no threshold has been exceeded
[FINDBUGS] Aggregating results of Apache Synapse - Handler Module
[FINDBUGS] Using set difference to compute new warnings
[FINDBUGS] Not changing build status, since no threshold has been exceeded
[FINDBUGS] Aggregating results of Apache Synapse - XAR Maven Plugin
[FINDBUGS] Using set difference to compute new warnings
[FINDBUGS] Not changing build status, since no threshold has been exceeded
[FINDBUGS] Aggregating results of Apache Synapse - Configuration Migrator
[FINDBUGS] Using set difference to compute new warnings
[FINDBUGS] Not changing build status, since no threshold has been exceeded
[FINDBUGS] Aggregating results of Apache Synapse - Distribution
[FINDBUGS] Using set difference to compute new warnings
[FINDBUGS] Not changing build status, since no threshold has been exceeded
[FINDBUGS] Aggregating results of Apache Synapse - Package skeleton ZIP
[FINDBUGS] Using set difference to compute new warnings
[FINDBUGS] Not changing build status, since no threshold has been exceeded
[FINDBUGS] Aggregating results of Apache Synapse - Package archetype
[FINDBUGS] Using set difference to compute new warnings
[FINDBUGS] Not changing build status, since no threshold has been exceeded
channel stopped
[locks-and-latches] Releasing all the locks
[locks-and-latches] All the locks released
Maven RedeployPublished use remote ubuntu3 maven settings from : /home/jenkins/.m2/settings.xml
[ERROR] uniqueVersion == false is not anymore supported in maven 3
[INFO] Deployment in https://repository.apache.org/content/repositories/snapshots (id=apache.snapshots.https,uniqueVersion=false)
Deploying the main artifact Apache-Synapse-2.1.0-SNAPSHOT.pom
Downloading: https://repository.apache.org/content/repositories/snapshots/org/apache/synapse/Apache-Synapse/2.1.0-SNAPSHOT/maven-metadata.xml
Downloaded: https://repository.apache.org/content/repositories/snapshots/org/apache/synapse/Apache-Synapse/2.1.0-SNAPSHOT/maven-metadata.xml
(611 B at 0.2 KB/sec)
Uploading: https://repository.apache.org/content/repositories/snapshots/org/apache/synapse/Apache-Synapse/2.1.0-SNAPSHOT/Apache-Synapse-2.1.0-20111219.090944-59.pom
Uploaded: https://repository.apache.org/content/repositories/snapshots/org/apache/synapse/Apache-Synapse/2.1.0-SNAPSHOT/Apache-Synapse-2.1.0-20111219.090944-59.pom
(78 KB at 339.0 KB/sec)
Uploading: https://repository.apache.org/content/repositories/snapshots/org/apache/synapse/Apache-Synapse/2.1.0-SNAPSHOT/Apache-Synapse-2.1.0-20111219.090944-59.pom
Uploaded: https://repository.apache.org/content/repositories/snapshots/org/apache/synapse/Apache-Synapse/2.1.0-SNAPSHOT/Apache-Synapse-2.1.0-20111219.090944-59.pom
(78 KB at 233.1 KB/sec)
Downloading: https://repository.apache.org/content/repositories/snapshots/org/apache/synapse/Apache-Synapse/maven-metadata.xml
Downloaded: https://repository.apache.org/content/repositories/snapshots/org/apache/synapse/Apache-Synapse/maven-metadata.xml
(292 B at 5.4 KB/sec)
Uploading: https://repository.apache.org/content/repositories/snapshots/org/apache/synapse/Apache-Synapse/2.1.0-SNAPSHOT/maven-metadata.xml
Uploading: https://repository.apache.org/content/repositories/snapshots/org/apache/synapse/Apache-Synapse/maven-metadata.xml
Uploaded: https://repository.apache.org/content/repositories/snapshots/org/apache/synapse/Apache-Synapse/maven-metadata.xml
(584 B at 0.0 KB/sec)
ERROR: Failed to deploy metadata: Could not transfer metadata org.apache.synapse:Apache-Synapse:2.1.0-SNAPSHOT/maven-metadata.xml
from/to apache.snapshots.https (https://repository.apache.org/content/repositories/snapshots):
Read timed out
org.apache.maven.artifact.deployer.ArtifactDeploymentException: Failed to deploy metadata:
Could not transfer metadata org.apache.synapse:Apache-Synapse:2.1.0-SNAPSHOT/maven-metadata.xml
from/to apache.snapshots.https (https://repository.apache.org/content/repositories/snapshots):
Read timed out
	at org.apache.maven.artifact.deployer.DefaultArtifactDeployer.deploy(DefaultArtifactDeployer.java:141)
	at hudson.maven.reporters.MavenArtifactRecord.deploy(MavenArtifactRecord.java:189)
	at hudson.maven.RedeployPublisher.perform(RedeployPublisher.java:158)
	at hudson.tasks.BuildStepMonitor$1.perform(BuildStepMonitor.java:19)
	at hudson.model.AbstractBuild$AbstractRunner.perform(AbstractBuild.java:693)
	at hudson.model.AbstractBuild$AbstractRunner.performAllBuildSteps(AbstractBuild.java:668)
	at hudson.maven.MavenModuleSetBuild$RunnerImpl.post2(MavenModuleSetBuild.java:953)
	at hudson.model.AbstractBuild$AbstractRunner.post(AbstractBuild.java:615)
	at hudson.model.Run.run(Run.java:1401)
	at hudson.maven.MavenModuleSetBuild.run(MavenModuleSetBuild.java:474)
	at hudson.model.ResourceController.execute(ResourceController.java:88)
	at hudson.model.Executor.run(Executor.java:230)
Caused by: org.sonatype.aether.deployment.DeploymentException: Failed to deploy metadata:
Could not transfer metadata org.apache.synapse:Apache-Synapse:2.1.0-SNAPSHOT/maven-metadata.xml
from/to apache.snapshots.https (https://repository.apache.org/content/repositories/snapshots):
Read timed out
	at org.sonatype.aether.impl.internal.DefaultDeployer.deploy(DefaultDeployer.java:315)
	at org.sonatype.aether.impl.internal.DefaultDeployer.deploy(DefaultDeployer.java:215)
	at org.sonatype.aether.impl.internal.DefaultRepositorySystem.deploy(DefaultRepositorySystem.java:480)
	at org.apache.maven.artifact.deployer.DefaultArtifactDeployer.deploy(DefaultArtifactDeployer.java:137)
	... 11 more
Caused by: org.sonatype.aether.transfer.MetadataTransferException: Could not transfer metadata
org.apache.synapse:Apache-Synapse:2.1.0-SNAPSHOT/maven-metadata.xml from/to apache.snapshots.https
(https://repository.apache.org/content/repositories/snapshots): Read timed out
	at org.sonatype.aether.connector.wagon.WagonRepositoryConnector$3.wrap(WagonRepositoryConnector.java:932)
	at org.sonatype.aether.connector.wagon.WagonRepositoryConnector$3.wrap(WagonRepositoryConnector.java:923)
	at org.sonatype.aether.connector.wagon.WagonRepositoryConnector$PutTask.flush(WagonRepositoryConnector.java:864)
	at org.sonatype.aether.connector.wagon.WagonRepositoryConnector.put(WagonRepositoryConnector.java:475)
	at org.sonatype.aether.impl.internal.DefaultDeployer.deploy(DefaultDeployer.java:309)
	... 14 more
Caused by: org.apache.maven.wagon.TransferFailedException: Read timed out
	at org.apache.maven.wagon.shared.http.AbstractHttpClientWagon.put(AbstractHttpClientWagon.java:336)
	at org.apache.maven.wagon.shared.http.AbstractHttpClientWagon.put(AbstractHttpClientWagon.java:280)
	at org.sonatype.aether.connector.wagon.WagonRepositoryConnector$PutTask.run(WagonRepositoryConnector.java:825)
	at org.sonatype.aether.connector.wagon.WagonRepositoryConnector.put(WagonRepositoryConnector.java:474)
	... 15 more
Caused by: java.net.SocketTimeoutException: Read timed out
	at java.net.SocketInputStream.socketRead0(Native Method)
	at java.net.SocketInputStream.read(SocketInputStream.java:129)
	at com.sun.net.ssl.internal.ssl.InputRecord.readFully(InputRecord.java:293)
	at com.sun.net.ssl.internal.ssl.InputRecord.read(InputRecord.java:331)
	at com.sun.net.ssl.internal.ssl.SSLSocketImpl.readRecord(SSLSocketImpl.java:798)
	at com.sun.net.ssl.internal.ssl.SSLSocketImpl.readDataRecord(SSLSocketImpl.java:755)
	at com.sun.net.ssl.internal.ssl.AppInputStream.read(AppInputStream.java:75)
	at java.io.BufferedInputStream.fill(BufferedInputStream.java:218)
	at java.io.BufferedInputStream.read(BufferedInputStream.java:237)
	at org.apache.commons.httpclient.HttpParser.readRawLine(HttpParser.java:78)
	at org.apache.commons.httpclient.HttpParser.readLine(HttpParser.java:106)
	at org.apache.commons.httpclient.HttpConnection.readLine(HttpConnection.java:1116)
	at org.apache.commons.httpclient.MultiThreadedHttpConnectionManager$HttpConnectionAdapter.readLine(MultiThreadedHttpConnectionManager.java:1413)
	at org.apache.commons.httpclient.HttpMethodBase.readStatusLine(HttpMethodBase.java:1973)
	at org.apache.commons.httpclient.HttpMethodBase.readResponse(HttpMethodBase.java:1735)
	at org.apache.commons.httpclient.HttpMethodBase.execute(HttpMethodBase.java:1098)
	at org.apache.commons.httpclient.HttpMethodDirector.executeWithRetry(HttpMethodDirector.java:398)
	at org.apache.commons.httpclient.HttpMethodDirector.executeMethod(HttpMethodDirector.java:171)
	at org.apache.commons.httpclient.HttpClient.executeMethod(HttpClient.java:397)
	at org.apache.commons.httpclient.HttpClient.executeMethod(HttpClient.java:323)
	at org.apache.maven.wagon.shared.http.AbstractHttpClientWagon.execute(AbstractHttpClientWagon.java:446)
	at org.apache.maven.wagon.shared.http.AbstractHttpClientWagon.put(AbstractHttpClientWagon.java:330)
	... 18 more
[INFO] Deployment failed after 1 min 58 sec
Build step 'Deploy artifacts to Maven repository' changed build result to FAILURE


---------------------------------------------------------------------
To unsubscribe, e-mail: dev-unsubscribe@synapse.apache.org
For additional commands, e-mail: dev-help@synapse.apache.org


Mime
View raw message