synapse-dev mailing list archives

Site index · List index
Message view « Date » · « Thread »
Top « Date » · « Thread »
From Hiranya Jayathilaka <hiranya...@gmail.com>
Subject Re: Build failed in Jenkins: Synapse - Trunk #4330
Date Mon, 16 Jul 2012 10:09:36 GMT
Hi Sadeep,

I believe this project is no longer maintained. So SNAPSHOT dependencies
might go missing. Can we use a released version of the eventing library?

Thanks,
Hiranya

On Mon, Jul 16, 2012 at 6:38 AM, Sadeep Jayasumana <gayansadeep@gmail.com>wrote:

> Hi,
>
> This is caused by a missing JAR,
> org.wso2.eventing:wso2eventing-api:jar:SNAPSHOT [1]. I'm able to reproduce
> the error locally. It is fixed by manually installing the JAR.
>
> Any idea why this JAR went missing from the repo?
>
> [1] Caused by: org.apache.maven.project.
> DependencyResolutionException: Could not resolve dependencies for project
> org.apache.synapse:synapse-core:bundle:2.2.0-SNAPSHOT: Could not find
> artifact org.wso2.eventing:wso2eventing-api:jar:SNAPSHOT in
> wso2-m2-snapshots (http://dist.wso2.org/snapshots/maven2/)
>
>
> Thanks,
> Sadeep
>
>
> On Mon, Jul 16, 2012 at 12:26 AM, Apache Jenkins Server <
> jenkins@builds.apache.org> wrote:
>
>> See <https://builds.apache.org/job/Synapse%20-%20Trunk/4330/changes>
>>
>> Changes:
>>
>> [sadeep] SYNAPSE-838: Introducing Bean and EJB mediators.
>>
>> ------------------------------------------
>> [...truncated 5448 lines...]
>> [INFO] Generating "Dependencies" report    ---
>> maven-project-info-reports-plugin:2.2
>> [INFO] Generating "Project License" report    ---
>> maven-project-info-reports-plugin:2.2
>> [INFO] Generating "Project Team" report    ---
>> maven-project-info-reports-plugin:2.2
>> [INFO] Generating "Continuous Integration" report    ---
>> maven-project-info-reports-plugin:2.2
>> mojoSucceeded org.apache.maven.plugins:maven-site-plugin:3.0(default-site)
>> [FINDBUGS] No report found for mojo site
>> [JENKINS] Archiving site from <
>> https://builds.apache.org/job/Synapse%20-%20Trunk/ws/java/modules/tasks/target/site>
>> to /home/hudson/hudson/jobs/Synapse - Trunk/site/synapse-tasks
>> projectSucceeded org.apache.synapse:synapse-tasks:2.2.0-SNAPSHOT
>> projectStarted org.apache.synapse:synapse-core:2.2.0-SNAPSHOT
>> [INFO]
>> Downloading:
>> http://repo1.maven.org/maven2/org/apache/maven/plugins/maven-jar-plugin/2.3.2/maven-jar-plugin-2.3.2.jar
>> [INFO]
>> ------------------------------------------------------------------------
>> [INFO] Building Apache Synapse - Core 2.2.0-SNAPSHOT
>> [INFO]
>> ------------------------------------------------------------------------
>> Downloaded:
>> http://repo1.maven.org/maven2/org/apache/maven/plugins/maven-jar-plugin/2.3.2/maven-jar-plugin-2.3.2.jar(32
KB at 888.5 KB/sec)
>> Downloading:
>> http://repo1.maven.org/maven2/org/apache/maven/plugins/maven-antrun-plugin/1.7/maven-antrun-plugin-1.7.jar
>> Downloaded:
>> http://repo1.maven.org/maven2/org/apache/maven/plugins/maven-antrun-plugin/1.7/maven-antrun-plugin-1.7.jar(31
KB at 1402.8 KB/sec)
>> Downloading:
>> http://dist.wso2.org/snapshots/maven2/org/wso2/eventing/wso2eventing-api/SNAPSHOT/wso2eventing-api-SNAPSHOT.pom
>> Downloading:
>> http://repository.apache.org/snapshots/org/wso2/eventing/wso2eventing-api/SNAPSHOT/wso2eventing-api-SNAPSHOT.pom
>> [WARNING] The POM for org.wso2.eventing:wso2eventing-api:jar:SNAPSHOT is
>> missing, no dependency information available
>> Downloading:
>> http://dist.wso2.org/maven2/com/sun/xml/ws/jaxws-tools/2.1.3/jaxws-tools-2.1.3.pom
>> Downloading:
>> https://server.oosnmp.net/dist/release/com/sun/xml/ws/jaxws-tools/2.1.3/jaxws-tools-2.1.3.pom
>> Downloading:
>> http://repo1.maven.org/maven2/com/sun/xml/ws/jaxws-tools/2.1.3/jaxws-tools-2.1.3.pom
>> Downloaded:
>> http://repo1.maven.org/maven2/com/sun/xml/ws/jaxws-tools/2.1.3/jaxws-tools-2.1.3.pom(3
KB at 7.0 KB/sec)
>> Downloading:
>> http://snapshots.maven.codehaus.org/maven2/org/apache/axis2/axis2-saaj/1.7.0-SNAPSHOT/maven-metadata.xml
>> Downloading:
>> http://dist.wso2.org/maven2/org/apache/axis2/axis2-saaj/1.7.0-SNAPSHOT/maven-metadata.xml
>> [WARNING] Could not transfer metadata
>> org.apache.axis2:axis2-saaj:1.7.0-SNAPSHOT/maven-metadata.xml from/to
>> wso2-maven2-repository-snapshot (http://dist.wso2.org/snapshots/maven2):
>> No connector available to access repository wso2-maven2-repository-snapshot
>> (http://dist.wso2.org/snapshots/maven2) of type legacy using the
>> available factories WagonRepositoryConnectorFactory
>> [WARNING] Could not transfer metadata
>> org.apache.axis2:axis2-saaj:1.7.0-SNAPSHOT/maven-metadata.xml from/to
>> apache-zones (http://ws.zones.apache.org/repository): No connector
>> available to access repository apache-zones (
>> http://ws.zones.apache.org/repository) of type legacy using the
>> available factories WagonRepositoryConnectorFactory
>> Downloading:
>> http://dist.wso2.org/maven2/org/apache/geronimo/specs/geronimo-saaj_1.3_spec/1.0.1/geronimo-saaj_1.3_spec-1.0.1.pom
>> Downloaded:
>> http://dist.wso2.org/maven2/org/apache/geronimo/specs/geronimo-saaj_1.3_spec/1.0.1/geronimo-saaj_1.3_spec-1.0.1.pom(3
KB at 11.6 KB/sec)
>> Downloading:
>> http://dist.wso2.org/maven2/org/apache/geronimo/specs/specs-parent/1.5/specs-parent-1.5.pom
>> Downloaded:
>> http://dist.wso2.org/maven2/org/apache/geronimo/specs/specs-parent/1.5/specs-parent-1.5.pom(6
KB at 20.8 KB/sec)
>> Downloading:
>> http://dist.wso2.org/maven2/org/apache/geronimo/genesis/config/project-config/1.4/project-config-1.4.pom
>> Downloaded:
>> http://dist.wso2.org/maven2/org/apache/geronimo/genesis/config/project-config/1.4/project-config-1.4.pom(19
KB at 54.3 KB/sec)
>> Downloading:
>> http://dist.wso2.org/maven2/org/apache/geronimo/genesis/config/config/1.4/config-1.4.pom
>> Downloaded:
>> http://dist.wso2.org/maven2/org/apache/geronimo/genesis/config/config/1.4/config-1.4.pom(4
KB at 17.3 KB/sec)
>> Downloading:
>> http://dist.wso2.org/maven2/org/apache/geronimo/genesis/genesis/1.4/genesis-1.4.pom
>> Downloaded:
>> http://dist.wso2.org/maven2/org/apache/geronimo/genesis/genesis/1.4/genesis-1.4.pom(12
KB at 51.4 KB/sec)
>> Downloading:
>> http://dist.wso2.org/maven2/org/apache/axis2/axis2-clustering/1.7.0-SNAPSHOT/maven-metadata.xml
>> Downloading:
>> http://snapshots.maven.codehaus.org/maven2/org/apache/axis2/axis2-clustering/1.7.0-SNAPSHOT/maven-metadata.xml
>> [WARNING] Could not transfer metadata
>> org.apache.axis2:axis2-clustering:1.7.0-SNAPSHOT/maven-metadata.xml from/to
>> wso2-maven2-repository-snapshot (http://dist.wso2.org/snapshots/maven2):
>> No connector available to access repository wso2-maven2-repository-snapshot
>> (http://dist.wso2.org/snapshots/maven2) of type legacy using the
>> available factories WagonRepositoryConnectorFactory
>> [WARNING] Could not transfer metadata
>> org.apache.axis2:axis2-clustering:1.7.0-SNAPSHOT/maven-metadata.xml from/to
>> apache-zones (http://ws.zones.apache.org/repository): No connector
>> available to access repository apache-zones (
>> http://ws.zones.apache.org/repository) of type legacy using the
>> available factories WagonRepositoryConnectorFactory
>> Downloading:
>> http://dist.wso2.org/maven2/org/apache/tomcat/tribes/6.0.16/tribes-6.0.16.pom
>> Downloaded:
>> http://dist.wso2.org/maven2/org/apache/tomcat/tribes/6.0.16/tribes-6.0.16.pom(2 KB
at 6.0 KB/sec)
>> Downloading:
>> http://dist.wso2.org/maven2/org/apache/tomcat/juli/6.0.16/juli-6.0.16.pom
>> Downloaded:
>> http://dist.wso2.org/maven2/org/apache/tomcat/juli/6.0.16/juli-6.0.16.pom(2 KB at
6.2 KB/sec)
>> Downloading:
>> http://dist.wso2.org/maven2/commons-logging/commons-logging/1.1/commons-logging-1.1.pom
>> Downloaded:
>> http://dist.wso2.org/maven2/commons-logging/commons-logging/1.1/commons-logging-1.1.pom(7
KB at 25.1 KB/sec)
>> Downloading:
>> http://dist.wso2.org/maven2/logkit/logkit/1.0.1/logkit-1.0.1.pom
>> Downloaded:
>> http://dist.wso2.org/maven2/logkit/logkit/1.0.1/logkit-1.0.1.pom (147 B
>> at 0.8 KB/sec)
>> Downloading:
>> http://dist.wso2.org/maven2/avalon-framework/avalon-framework/4.1.3/avalon-framework-4.1.3.pom
>> Downloaded:
>> http://dist.wso2.org/maven2/avalon-framework/avalon-framework/4.1.3/avalon-framework-4.1.3.pom(167
B at 0.8 KB/sec)
>> Downloading:
>> http://dist.wso2.org/maven2/xalan/serializer/2.7.1/serializer-2.7.1.pom
>> Downloaded:
>> http://dist.wso2.org/maven2/xalan/serializer/2.7.1/serializer-2.7.1.pom(2 KB at 6.3
KB/sec)
>> Downloading:
>> http://dist.wso2.org/maven2/net/sf/saxon/saxon/8.9/saxon-8.9.pom
>> Downloading:
>> https://server.oosnmp.net/dist/release/net/sf/saxon/saxon/8.9/saxon-8.9.pom
>> Downloading:
>> http://repo1.maven.org/maven2/net/sf/saxon/saxon/8.9/saxon-8.9.pom
>> [WARNING] The POM for net.sf.saxon:saxon:jar:8.9 is missing, no
>> dependency information available
>> Downloading:
>> http://dist.wso2.org/maven2/org/apache/geronimo/specs/geronimo-jta_1.0.1B_spec/1.0/geronimo-jta_1.0.1B_spec-1.0.pom
>> Downloaded:
>> http://dist.wso2.org/maven2/org/apache/geronimo/specs/geronimo-jta_1.0.1B_spec/1.0/geronimo-jta_1.0.1B_spec-1.0.pom(181
B at 0.9 KB/sec)
>> Downloading:
>> http://dist.wso2.org/maven2/javax/mail/mail/1.4.1/mail-1.4.1.pom
>> Downloading:
>> https://server.oosnmp.net/dist/release/javax/mail/mail/1.4.1/mail-1.4.1.pom
>> Downloading:
>> http://repo1.maven.org/maven2/javax/mail/mail/1.4.1/mail-1.4.1.pom
>> Downloaded:
>> http://repo1.maven.org/maven2/javax/mail/mail/1.4.1/mail-1.4.1.pom (995
>> B at 44.2 KB/sec)
>> Downloading:
>> http://dist.wso2.org/snapshots/maven2/org/wso2/eventing/wso2eventing-api/SNAPSHOT/wso2eventing-api-SNAPSHOT.jar
>> Downloading:
>> http://repository.apache.org/snapshots/org/wso2/eventing/wso2eventing-api/SNAPSHOT/wso2eventing-api-SNAPSHOT.jar
>> Downloading:
>> http://repository.apache.org/snapshots/org/apache/sandesha2/sandesha2-core/1.7.0-SNAPSHOT/sandesha2-core-1.7.0-20120703.201906-205.jar
>> Downloading:
>> http://repository.apache.org/snapshots/org/apache/axis2/axis2-codegen/1.7.0-SNAPSHOT/axis2-codegen-1.7.0-20120712.230721-898.jar
>> Downloading:
>> http://repository.apache.org/snapshots/org/apache/axis2/axis2-adb/1.7.0-SNAPSHOT/axis2-adb-1.7.0-20120712.230721-908.jar
>> Downloading:
>> http://repository.apache.org/snapshots/org/apache/axis2/axis2-mtompolicy/1.7.0-SNAPSHOT/axis2-mtompolicy-1.7.0-20120712.230721-837.jar
>> Downloading:
>> http://repository.apache.org/snapshots/org/apache/axis2/axis2-saaj/1.7.0-SNAPSHOT/axis2-saaj-1.7.0-20120712.230721-870.jar
>> Downloaded:
>> http://repository.apache.org/snapshots/org/apache/axis2/axis2-saaj/1.7.0-SNAPSHOT/axis2-saaj-1.7.0-20120712.230721-870.jar(90
KB at 808.7 KB/sec)
>> Downloading:
>> http://repository.apache.org/snapshots/org/apache/axis2/axis2-clustering/1.7.0-SNAPSHOT/axis2-clustering-1.7.0-20120712.230721-883.jar
>> Downloaded:
>> http://repository.apache.org/snapshots/org/apache/axis2/axis2-mtompolicy/1.7.0-SNAPSHOT/axis2-mtompolicy-1.7.0-20120712.230721-837.jar(14
KB at 55.1 KB/sec)
>> Downloading:
>> http://repository.apache.org/snapshots/org/apache/axis2/axis2-transport-jms/1.7.0-SNAPSHOT/axis2-transport-jms-1.7.0-20120703.201606-457.jar
>> Downloaded:
>> http://repository.apache.org/snapshots/org/apache/sandesha2/sandesha2-core/1.7.0-SNAPSHOT/sandesha2-core-1.7.0-20120703.201906-205.jar(398
KB at 1542.3 KB/sec)
>> Downloading:
>> http://repository.apache.org/snapshots/org/apache/axis2/axis2-transport-mail/1.7.0-SNAPSHOT/axis2-transport-mail-1.7.0-20120703.201606-457.jar
>> Downloaded:
>> http://repository.apache.org/snapshots/org/apache/axis2/axis2-codegen/1.7.0-SNAPSHOT/axis2-codegen-1.7.0-20120712.230721-898.jar(254
KB at 957.5 KB/sec)
>> Downloading:
>> http://repository.apache.org/snapshots/org/apache/axis2/axis2-transport-local/1.7.0-SNAPSHOT/axis2-transport-local-1.7.0-20120712.230721-904.jar
>> Downloaded:
>> http://repository.apache.org/snapshots/org/apache/axis2/axis2-transport-local/1.7.0-SNAPSHOT/axis2-transport-local-1.7.0-20120712.230721-904.jar(20
KB at 481.8 KB/sec)
>> Downloading:
>> http://repository.apache.org/snapshots/org/apache/ws/commons/axiom/axiom-dom/1.2.14-SNAPSHOT/axiom-dom-1.2.14-20120715.013020-235.jar
>> Downloaded:
>> http://repository.apache.org/snapshots/org/apache/axis2/axis2-transport-mail/1.7.0-SNAPSHOT/axis2-transport-mail-1.7.0-20120703.201606-457.jar(41
KB at 287.3 KB/sec)
>> Downloaded:
>> http://repository.apache.org/snapshots/org/apache/axis2/axis2-adb/1.7.0-SNAPSHOT/axis2-adb-1.7.0-20120712.230721-908.jar(661
KB at 1642.0 KB/sec)
>> Downloaded:
>> http://repository.apache.org/snapshots/org/apache/ws/commons/axiom/axiom-dom/1.2.14-SNAPSHOT/axiom-dom-1.2.14-20120715.013020-235.jar(207
KB at 2044.8 KB/sec)
>> Downloaded:
>> http://repository.apache.org/snapshots/org/apache/axis2/axis2-clustering/1.7.0-SNAPSHOT/axis2-clustering-1.7.0-20120712.230721-883.jar(105
KB at 308.5 KB/sec)
>> Downloaded:
>> http://repository.apache.org/snapshots/org/apache/axis2/axis2-transport-jms/1.7.0-SNAPSHOT/axis2-transport-jms-1.7.0-20120703.201606-457.jar(79
KB at 309.7 KB/sec)
>> Downloading:
>> http://dist.wso2.org/maven2/com/sun/xml/ws/jaxws-tools/2.1.3/jaxws-tools-2.1.3.jar
>> Downloading:
>> http://dist.wso2.org/maven2/org/wso2/caching/wso2caching-core/3.5.0/wso2caching-core-3.5.0.jar
>> Downloading:
>> http://dist.wso2.org/maven2/org/apache/geronimo/specs/geronimo-saaj_1.3_spec/1.0.1/geronimo-saaj_1.3_spec-1.0.1.jar
>> Downloading:
>> http://dist.wso2.org/maven2/org/apache/tomcat/tribes/6.0.16/tribes-6.0.16.jar
>> Downloading:
>> http://dist.wso2.org/maven2/org/apache/tomcat/juli/6.0.16/juli-6.0.16.jar
>> Downloading:
>> http://dist.wso2.org/maven2/org/wso2/uri/template/wso2-uri-templates/1.0.0/wso2-uri-templates-1.0.0.jar
>> Downloaded:
>> http://dist.wso2.org/maven2/org/apache/geronimo/specs/geronimo-saaj_1.3_spec/1.0.1/geronimo-saaj_1.3_spec-1.0.1.jar(29
KB at 68.0 KB/sec)
>> Downloading:
>> http://dist.wso2.org/maven2/xalan/xalan/2.7.1/xalan-2.7.1.jar
>> Downloaded:
>> http://dist.wso2.org/maven2/org/apache/tomcat/juli/6.0.16/juli-6.0.16.jar(19 KB at
37.8 KB/sec)
>> Downloading:
>> http://dist.wso2.org/maven2/xalan/serializer/2.7.1/serializer-2.7.1.jar
>> Downloaded:
>> http://dist.wso2.org/maven2/org/wso2/caching/wso2caching-core/3.5.0/wso2caching-core-3.5.0.jar(26
KB at 51.2 KB/sec)
>> Downloading:
>> http://dist.wso2.org/maven2/net/sf/saxon/saxon/8.9/saxon-8.9.jar
>> Downloaded:
>> http://dist.wso2.org/maven2/org/apache/tomcat/tribes/6.0.16/tribes-6.0.16.jar(223
KB at 261.2 KB/sec)
>> Downloading:
>> http://dist.wso2.org/maven2/net/sf/saxon/saxon-dom/8.9/saxon-dom-8.9.jar
>> Downloaded:
>> http://dist.wso2.org/maven2/org/wso2/uri/template/wso2-uri-templates/1.0.0/wso2-uri-templates-1.0.0.jar(18
KB at 25.5 KB/sec)
>> Downloading:
>> http://dist.wso2.org/maven2/org/apache/geronimo/specs/geronimo-jms_1.1_spec/1.1/geronimo-jms_1.1_spec-1.1.jar
>> Downloaded:
>> http://dist.wso2.org/maven2/net/sf/saxon/saxon-dom/8.9/saxon-dom-8.9.jar(88 KB at
64.3 KB/sec)
>> Downloading:
>> http://dist.wso2.org/maven2/org/apache/geronimo/specs/geronimo-jta_1.0.1B_spec/1.0/geronimo-jta_1.0.1B_spec-1.0.jar
>> Downloaded:
>> http://dist.wso2.org/maven2/xalan/serializer/2.7.1/serializer-2.7.1.jar(272 KB at
151.4 KB/sec)
>> Downloading:
>> http://dist.wso2.org/maven2/org/apache/derby/derby/10.4.2.0/derby-10.4.2.0.jar
>> Downloaded:
>> http://dist.wso2.org/maven2/org/apache/geronimo/specs/geronimo-jms_1.1_spec/1.1/geronimo-jms_1.1_spec-1.1.jar(32
KB at 25.7 KB/sec)
>> Downloading:
>> http://dist.wso2.org/maven2/javax/mail/mail/1.4.1/mail-1.4.1.jar
>> Downloaded:
>> http://dist.wso2.org/maven2/org/apache/geronimo/specs/geronimo-jta_1.0.1B_spec/1.0/geronimo-jta_1.0.1B_spec-1.0.jar(12
KB at 17.8 KB/sec)
>> Downloaded:
>> http://dist.wso2.org/maven2/org/apache/derby/derby/10.4.2.0/derby-10.4.2.0.jar(2390
KB at 360.1 KB/sec)
>> Downloaded: http://dist.wso2.org/maven2/xalan/xalan/2.7.1/xalan-2.7.1.jar(3102 KB
at 271.5 KB/sec)
>> Downloaded:
>> http://dist.wso2.org/maven2/net/sf/saxon/saxon/8.9/saxon-8.9.jar (3642
>> KB at 272.7 KB/sec)
>> Downloading:
>> https://server.oosnmp.net/dist/release/com/sun/xml/ws/jaxws-tools/2.1.3/jaxws-tools-2.1.3.jar
>> Downloading:
>> https://server.oosnmp.net/dist/release/javax/mail/mail/1.4.1/mail-1.4.1.jar
>> Downloading:
>> http://repo1.maven.org/maven2/com/sun/xml/ws/jaxws-tools/2.1.3/jaxws-tools-2.1.3.jar
>> Downloading:
>> http://repo1.maven.org/maven2/javax/mail/mail/1.4.1/mail-1.4.1.jar
>> Downloaded:
>> http://repo1.maven.org/maven2/javax/mail/mail/1.4.1/mail-1.4.1.jar (438
>> KB at 3238.4 KB/sec)
>> Downloaded:
>> http://repo1.maven.org/maven2/com/sun/xml/ws/jaxws-tools/2.1.3/jaxws-tools-2.1.3.jar(498
KB at 1150.9 KB/sec)
>> projectFailed org.apache.synapse:synapse-core:2.2.0-SNAPSHOT
>> sessionEnded
>> [INFO]
>> ------------------------------------------------------------------------
>> [INFO] Reactor Summary:
>> [INFO]
>> [INFO] Apache Synapse .................................... SUCCESS
>> [1:27.667s]
>> [INFO] Apache Synapse - Secure Vault ..................... SUCCESS
>> [25.042s]
>> [INFO] Apache Synapse - Commons .......................... SUCCESS
>> [22.764s]
>> [INFO] Apache Synapse - Transports ....................... SUCCESS
>> [19.115s]
>> [INFO] Apache Synapse - Non-blocking HTTP/s Transport .... SUCCESS
>> [30.716s]
>> [INFO] Apache Synapse - PIPE Transport ................... SUCCESS
>> [6.853s]
>> [INFO] Apache Synapse - VFS Transport .................... SUCCESS
>> [17.983s]
>> [INFO] Apache Synapse - FIX Transport .................... SUCCESS
>> [24.754s]
>> [INFO] Apache Synapse - Tasks ............................ SUCCESS
>> [6.956s]
>> [INFO] Apache Synapse - Core ............................. FAILURE
>> [21.183s]
>> [INFO] Apache Synapse - Extensions ....................... SKIPPED
>> [INFO] Apache Synapse - Samples .......................... SKIPPED
>> [INFO] Apache Synapse - Patches .......................... SKIPPED
>> [INFO] Apache Synapse - Experimental code ................ SKIPPED
>> [INFO] Apache Synapse - Documentation .................... SKIPPED
>> [INFO] Apache Synapse - Web Application .................. SKIPPED
>> [INFO] Apache Synapse - Handler Module ................... SKIPPED
>> [INFO] Apache Synapse - XAR Maven Plugin ................. SKIPPED
>> [INFO] Apache Synapse - Configuration Migrator ........... SKIPPED
>> [INFO] Apache Synapse - Distribution ..................... SKIPPED
>> [INFO] Apache Synapse - Package skeleton ZIP ............. SKIPPED
>> [INFO] Apache Synapse - Package archetype ................ SKIPPED
>> [INFO] Apache Synapse - Integration ...................... SKIPPED
>> [INFO]
>> ------------------------------------------------------------------------
>> [INFO] BUILD FAILURE
>> [INFO]
>> ------------------------------------------------------------------------
>> [INFO] Total time: 4:30.758s
>> [INFO] Finished at: Sun Jul 15 14:26:09 UTC 2012
>> [INFO] Final Memory: 86M/322M
>> [INFO]
>> ------------------------------------------------------------------------
>> Projects to build: [MavenProject:
>> org.apache.synapse:Apache-Synapse:2.2.0-SNAPSHOT @ <
>> https://builds.apache.org/job/Synapse%20-%20Trunk/ws/java/pom.xml,>
>> MavenProject: org.apache.synapse:synapse-securevault:2.2.0-SNAPSHOT @ <
>> https://builds.apache.org/job/Synapse%20-%20Trunk/ws/java/modules/securevault/pom.xml,>
>> MavenProject: org.apache.synapse:synapse-commons:2.2.0-SNAPSHOT @ <
>> https://builds.apache.org/job/Synapse%20-%20Trunk/ws/java/modules/commons/pom.xml,>
>> MavenProject: org.apache.synapse:synapse-transports:2.2.0-SNAPSHOT @ <
>> https://builds.apache.org/job/Synapse%20-%20Trunk/ws/java/modules/transports/pom.xml,>
>> MavenProject: org.apache.synapse:synapse-nhttp-transport:2.2.0-SNAPSHOT @ <
>> https://builds.apache.org/job/Synapse%20-%20Trunk/ws/java/modules/transports/core/nhttp/pom.xml,>
>> MavenProject: org.apache.synapse:synapse-pipe-transport:2.2.0-SNAPSHOT @ <
>> https://builds.apache.org/job/Synapse%20-%20Trunk/ws/java/modules/transports/core/pipe/pom.xml,>
>> MavenProject: org.apache.synapse:synapse-vfs-transport:2.2.0-SNAPSHOT @ <
>> https://builds.apache.org/job/Synapse%20-%20Trunk/ws/java/modules/transports/core/vfs/pom.xml,>
>> MavenProject: org.apache.synapse:synapse-fix-transport:2.2.0-SNAPSHOT @ <
>> https://builds.apache.org/job/Synapse%20-%20Trunk/ws/java/modules/transports/optional/fix/pom.xml,>
>> MavenProject: org.apache.synapse:synapse-tasks:2.2.0-SNAPSHOT @ <
>> https://builds.apache.org/job/Synapse%20-%20Trunk/ws/java/modules/tasks/pom.xml,>
>> MavenProject: org.apache.synapse:synapse-core:2.2.0-SNAPSHOT @ <
>> https://builds.apache.org/job/Synapse%20-%20Trunk/ws/java/modules/core/pom.xml,>
>> MavenProject: org.apache.synapse:synapse-extensions:2.2.0-SNAPSHOT @ <
>> https://builds.apache.org/job/Synapse%20-%20Trunk/ws/java/modules/extensions/pom.xml,>
>> MavenProject: org.apache.synapse:synapse-samples:2.2.0-SNAPSHOT @ <
>> https://builds.apache.org/job/Synapse%20-%20Trunk/ws/java/modules/samples/pom.xml,>
>> MavenProject: org.apache.synapse:synapse-patches:2.2.0-SNAPSHOT @ <
>> https://builds.apache.org/job/Synapse%20-%20Trunk/ws/java/modules/patches/pom.xml,>
>> MavenProject: org.apache.synapse:synapse-experimental:2.2.0-SNAPSHOT @ <
>> https://builds.apache.org/job/Synapse%20-%20Trunk/ws/java/modules/experimental/pom.xml,>
>> MavenProject: org.apache.synapse:synapse-documentation:2.2.0-SNAPSHOT @ <
>> https://builds.apache.org/job/Synapse%20-%20Trunk/ws/java/modules/documentation/pom.xml,>
>> MavenProject: org.apache.synapse:synapse-war:2.2.0-SNAPSHOT @ <
>> https://builds.apache.org/job/Synapse%20-%20Trunk/ws/java/modules/war/pom.xml,>
>> MavenProject: org.apache.synapse:synapse-handler:2.2.0-SNAPSHOT @ <
>> https://builds.apache.org/job/Synapse%20-%20Trunk/ws/java/modules/handler/pom.xml,>
>> MavenProject: org.apache.synapse:synapse-xar-maven-plugin:2.2.0-SNAPSHOT @ <
>> https://builds.apache.org/job/Synapse%20-%20Trunk/ws/java/modules/xar-maven-plugin/pom.xml,>
>> MavenProject: org.apache.synapse:synapse-config-migrator:2.2.0-SNAPSHOT @ <
>> https://builds.apache.org/job/Synapse%20-%20Trunk/ws/java/modules/migrator/pom.xml,>
>> MavenProject: org.apache.synapse:synapse-distribution:2.2.0-SNAPSHOT @ <
>> https://builds.apache.org/job/Synapse%20-%20Trunk/ws/java/modules/distribution/pom.xml,>
>> MavenProject: org.apache.synapse:synapse-package-skeleton:2.2.0-SNAPSHOT @ <
>> https://builds.apache.org/job/Synapse%20-%20Trunk/ws/java/modules/packaging/package-skeleton/pom.xml,>
>> MavenProject: org.apache.synapse:synapse-package-archetype:2.2.0-SNAPSHOT @
>> <
>> https://builds.apache.org/job/Synapse%20-%20Trunk/ws/java/modules/packaging/package-archetype/pom.xml,>
>> MavenProject: org.apache.synapse:synapse-integration:2.2.0-SNAPSHOT @ <
>> https://builds.apache.org/job/Synapse%20-%20Trunk/ws/java/modules/integration/pom.xml
>> ]>
>> [JENKINS] Archiving <
>> https://builds.apache.org/job/Synapse%20-%20Trunk/ws/java/modules/migrator/pom.xml>
>> to /home/hudson/hudson/jobs/Synapse -
>> Trunk/modules/org.apache.synapse$synapse-config-migrator/builds/2012-07-15_14-21-32/archive/org.apache.synapse/synapse-config-migrator/2.2.0-SNAPSHOT/synapse-config-migrator-2.2.0-SNAPSHOT.pom
>> [JENKINS] Archiving <
>> https://builds.apache.org/job/Synapse%20-%20Trunk/ws/java/modules/core/pom.xml>
>> to /home/hudson/hudson/jobs/Synapse -
>> Trunk/modules/org.apache.synapse$synapse-core/builds/2012-07-15_14-21-32/archive/org.apache.synapse/synapse-core/2.2.0-SNAPSHOT/synapse-core-2.2.0-SNAPSHOT.pom
>> [JENKINS] Archiving <
>> https://builds.apache.org/job/Synapse%20-%20Trunk/ws/java/modules/integration/pom.xml>
>> to /home/hudson/hudson/jobs/Synapse -
>> Trunk/modules/org.apache.synapse$synapse-integration/builds/2012-07-15_14-21-32/archive/org.apache.synapse/synapse-integration/2.2.0-SNAPSHOT/synapse-integration-2.2.0-SNAPSHOT.pom
>> [JENKINS] Archiving <
>> https://builds.apache.org/job/Synapse%20-%20Trunk/ws/java/modules/packaging/package-skeleton/pom.xml>
>> to /home/hudson/hudson/jobs/Synapse -
>> Trunk/modules/org.apache.synapse$synapse-package-skeleton/builds/2012-07-15_14-21-32/archive/org.apache.synapse/synapse-package-skeleton/2.2.0-SNAPSHOT/synapse-package-skeleton-2.2.0-SNAPSHOT.pom
>> [JENKINS] Archiving <
>> https://builds.apache.org/job/Synapse%20-%20Trunk/ws/java/modules/securevault/pom.xml>
>> to /home/hudson/hudson/jobs/Synapse -
>> Trunk/modules/org.apache.synapse$synapse-securevault/builds/2012-07-15_14-21-32/archive/org.apache.synapse/synapse-securevault/2.2.0-SNAPSHOT/synapse-securevault-2.2.0-SNAPSHOT.pom
>> [JENKINS] Archiving <
>> https://builds.apache.org/job/Synapse%20-%20Trunk/ws/java/modules/securevault/target/synapse-securevault-2.2.0-SNAPSHOT.jar>
>> to /home/hudson/hudson/jobs/Synapse -
>> Trunk/modules/org.apache.synapse$synapse-securevault/builds/2012-07-15_14-21-32/archive/org.apache.synapse/synapse-securevault/2.2.0-SNAPSHOT/synapse-securevault-2.2.0-SNAPSHOT.jar
>> [JENKINS] Archiving <
>> https://builds.apache.org/job/Synapse%20-%20Trunk/ws/java/modules/packaging/package-archetype/pom.xml>
>> to /home/hudson/hudson/jobs/Synapse -
>> Trunk/modules/org.apache.synapse$synapse-package-archetype/builds/2012-07-15_14-21-32/archive/org.apache.synapse/synapse-package-archetype/2.2.0-SNAPSHOT/synapse-package-archetype-2.2.0-SNAPSHOT.pom
>> [JENKINS] Archiving <
>> https://builds.apache.org/job/Synapse%20-%20Trunk/ws/java/modules/commons/pom.xml>
>> to /home/hudson/hudson/jobs/Synapse -
>> Trunk/modules/org.apache.synapse$synapse-commons/builds/2012-07-15_14-21-32/archive/org.apache.synapse/synapse-commons/2.2.0-SNAPSHOT/synapse-commons-2.2.0-SNAPSHOT.pom
>> [JENKINS] Archiving <
>> https://builds.apache.org/job/Synapse%20-%20Trunk/ws/java/modules/commons/target/synapse-commons-2.2.0-SNAPSHOT.jar>
>> to /home/hudson/hudson/jobs/Synapse -
>> Trunk/modules/org.apache.synapse$synapse-commons/builds/2012-07-15_14-21-32/archive/org.apache.synapse/synapse-commons/2.2.0-SNAPSHOT/synapse-commons-2.2.0-SNAPSHOT.jar
>> [JENKINS] Archiving <
>> https://builds.apache.org/job/Synapse%20-%20Trunk/ws/java/modules/extensions/pom.xml>
>> to /home/hudson/hudson/jobs/Synapse -
>> Trunk/modules/org.apache.synapse$synapse-extensions/builds/2012-07-15_14-21-32/archive/org.apache.synapse/synapse-extensions/2.2.0-SNAPSHOT/synapse-extensions-2.2.0-SNAPSHOT.pom
>> [JENKINS] Archiving <
>> https://builds.apache.org/job/Synapse%20-%20Trunk/ws/java/modules/samples/pom.xml>
>> to /home/hudson/hudson/jobs/Synapse -
>> Trunk/modules/org.apache.synapse$synapse-samples/builds/2012-07-15_14-21-32/archive/org.apache.synapse/synapse-samples/2.2.0-SNAPSHOT/synapse-samples-2.2.0-SNAPSHOT.pom
>> [JENKINS] Archiving <
>> https://builds.apache.org/job/Synapse%20-%20Trunk/ws/java/modules/xar-maven-plugin/pom.xml>
>> to /home/hudson/hudson/jobs/Synapse -
>> Trunk/modules/org.apache.synapse$synapse-xar-maven-plugin/builds/2012-07-15_14-21-32/archive/org.apache.synapse/synapse-xar-maven-plugin/2.2.0-SNAPSHOT/synapse-xar-maven-plugin-2.2.0-SNAPSHOT.pom
>> [JENKINS] Archiving <
>> https://builds.apache.org/job/Synapse%20-%20Trunk/ws/java/modules/documentation/pom.xml>
>> to /home/hudson/hudson/jobs/Synapse -
>> Trunk/modules/org.apache.synapse$synapse-documentation/builds/2012-07-15_14-21-32/archive/org.apache.synapse/synapse-documentation/2.2.0-SNAPSHOT/synapse-documentation-2.2.0-SNAPSHOT.pom
>> [JENKINS] Archiving <
>> https://builds.apache.org/job/Synapse%20-%20Trunk/ws/java/modules/transports/core/nhttp/pom.xml>
>> to /home/hudson/hudson/jobs/Synapse -
>> Trunk/modules/org.apache.synapse$synapse-nhttp-transport/builds/2012-07-15_14-21-32/archive/org.apache.synapse/synapse-nhttp-transport/2.2.0-SNAPSHOT/synapse-nhttp-transport-2.2.0-SNAPSHOT.pom
>> [JENKINS] Archiving <
>> https://builds.apache.org/job/Synapse%20-%20Trunk/ws/java/modules/transports/core/nhttp/target/synapse-nhttp-transport-2.2.0-SNAPSHOT.jar>
>> to /home/hudson/hudson/jobs/Synapse -
>> Trunk/modules/org.apache.synapse$synapse-nhttp-transport/builds/2012-07-15_14-21-32/archive/org.apache.synapse/synapse-nhttp-transport/2.2.0-SNAPSHOT/synapse-nhttp-transport-2.2.0-SNAPSHOT.jar
>> [JENKINS] Archiving <
>> https://builds.apache.org/job/Synapse%20-%20Trunk/ws/java/modules/transports/core/nhttp/target/synapse-nhttp-transport-2.2.0-SNAPSHOT-testkit-logs.zip>
>> to /home/hudson/hudson/jobs/Synapse -
>> Trunk/modules/org.apache.synapse$synapse-nhttp-transport/builds/2012-07-15_14-21-32/archive/org.apache.synapse/synapse-nhttp-transport/2.2.0-SNAPSHOT/synapse-nhttp-transport-2.2.0-SNAPSHOT-testkit-logs.zip
>> [JENKINS] Archiving <
>> https://builds.apache.org/job/Synapse%20-%20Trunk/ws/java/modules/transports/core/pipe/pom.xml>
>> to /home/hudson/hudson/jobs/Synapse -
>> Trunk/modules/org.apache.synapse$synapse-pipe-transport/builds/2012-07-15_14-21-32/archive/org.apache.synapse/synapse-pipe-transport/2.2.0-SNAPSHOT/synapse-pipe-transport-2.2.0-SNAPSHOT.pom
>> [JENKINS] Archiving <
>> https://builds.apache.org/job/Synapse%20-%20Trunk/ws/java/modules/transports/core/pipe/target/synapse-pipe-transport-2.2.0-SNAPSHOT.jar>
>> to /home/hudson/hudson/jobs/Synapse -
>> Trunk/modules/org.apache.synapse$synapse-pipe-transport/builds/2012-07-15_14-21-32/archive/org.apache.synapse/synapse-pipe-transport/2.2.0-SNAPSHOT/synapse-pipe-transport-2.2.0-SNAPSHOT.jar
>> [JENKINS] Archiving <
>> https://builds.apache.org/job/Synapse%20-%20Trunk/ws/java/modules/transports/optional/fix/pom.xml>
>> to /home/hudson/hudson/jobs/Synapse -
>> Trunk/modules/org.apache.synapse$synapse-fix-transport/builds/2012-07-15_14-21-32/archive/org.apache.synapse/synapse-fix-transport/2.2.0-SNAPSHOT/synapse-fix-transport-2.2.0-SNAPSHOT.pom
>> [JENKINS] Archiving <
>> https://builds.apache.org/job/Synapse%20-%20Trunk/ws/java/modules/transports/optional/fix/target/synapse-fix-transport-2.2.0-SNAPSHOT.jar>
>> to /home/hudson/hudson/jobs/Synapse -
>> Trunk/modules/org.apache.synapse$synapse-fix-transport/builds/2012-07-15_14-21-32/archive/org.apache.synapse/synapse-fix-transport/2.2.0-SNAPSHOT/synapse-fix-transport-2.2.0-SNAPSHOT.jar
>> [JENKINS] Archiving <
>> https://builds.apache.org/job/Synapse%20-%20Trunk/ws/java/modules/transports/pom.xml>
>> to /home/hudson/hudson/jobs/Synapse -
>> Trunk/modules/org.apache.synapse$synapse-transports/builds/2012-07-15_14-21-32/archive/org.apache.synapse/synapse-transports/2.2.0-SNAPSHOT/synapse-transports-2.2.0-SNAPSHOT.pom
>> [JENKINS] Archiving <
>> https://builds.apache.org/job/Synapse%20-%20Trunk/ws/java/modules/war/pom.xml>
>> to /home/hudson/hudson/jobs/Synapse -
>> Trunk/modules/org.apache.synapse$synapse-war/builds/2012-07-15_14-21-32/archive/org.apache.synapse/synapse-war/2.2.0-SNAPSHOT/synapse-war-2.2.0-SNAPSHOT.pom
>> [JENKINS] Archiving <
>> https://builds.apache.org/job/Synapse%20-%20Trunk/ws/java/pom.xml> to
>> /home/hudson/hudson/jobs/Synapse -
>> Trunk/modules/org.apache.synapse$Apache-Synapse/builds/2012-07-15_14-21-32/archive/org.apache.synapse/Apache-Synapse/2.2.0-SNAPSHOT/Apache-Synapse-2.2.0-SNAPSHOT.pom
>> [JENKINS] Archiving <
>> https://builds.apache.org/job/Synapse%20-%20Trunk/ws/java/modules/transports/core/vfs/pom.xml>
>> to /home/hudson/hudson/jobs/Synapse -
>> Trunk/modules/org.apache.synapse$synapse-vfs-transport/builds/2012-07-15_14-21-32/archive/org.apache.synapse/synapse-vfs-transport/2.2.0-SNAPSHOT/synapse-vfs-transport-2.2.0-SNAPSHOT.pom
>> [JENKINS] Archiving <
>> https://builds.apache.org/job/Synapse%20-%20Trunk/ws/java/modules/transports/core/vfs/target/synapse-vfs-transport-2.2.0-SNAPSHOT.jar>
>> to /home/hudson/hudson/jobs/Synapse -
>> Trunk/modules/org.apache.synapse$synapse-vfs-transport/builds/2012-07-15_14-21-32/archive/org.apache.synapse/synapse-vfs-transport/2.2.0-SNAPSHOT/synapse-vfs-transport-2.2.0-SNAPSHOT.jar
>> [JENKINS] Archiving <
>> https://builds.apache.org/job/Synapse%20-%20Trunk/ws/java/modules/transports/core/vfs/target/synapse-vfs-transport-2.2.0-SNAPSHOT-testkit-logs.zip>
>> to /home/hudson/hudson/jobs/Synapse -
>> Trunk/modules/org.apache.synapse$synapse-vfs-transport/builds/2012-07-15_14-21-32/archive/org.apache.synapse/synapse-vfs-transport/2.2.0-SNAPSHOT/synapse-vfs-transport-2.2.0-SNAPSHOT-testkit-logs.zip
>> [JENKINS] Archiving <
>> https://builds.apache.org/job/Synapse%20-%20Trunk/ws/java/modules/patches/pom.xml>
>> to /home/hudson/hudson/jobs/Synapse -
>> Trunk/modules/org.apache.synapse$synapse-patches/builds/2012-07-15_14-21-32/archive/org.apache.synapse/synapse-patches/2.2.0-SNAPSHOT/synapse-patches-2.2.0-SNAPSHOT.pom
>> [JENKINS] Archiving <
>> https://builds.apache.org/job/Synapse%20-%20Trunk/ws/java/modules/experimental/pom.xml>
>> to /home/hudson/hudson/jobs/Synapse -
>> Trunk/modules/org.apache.synapse$synapse-experimental/builds/2012-07-15_14-21-32/archive/org.apache.synapse/synapse-experimental/2.2.0-SNAPSHOT/synapse-experimental-2.2.0-SNAPSHOT.pom
>> [JENKINS] Archiving <
>> https://builds.apache.org/job/Synapse%20-%20Trunk/ws/java/modules/tasks/pom.xml>
>> to /home/hudson/hudson/jobs/Synapse -
>> Trunk/modules/org.apache.synapse$synapse-tasks/builds/2012-07-15_14-21-32/archive/org.apache.synapse/synapse-tasks/2.2.0-SNAPSHOT/synapse-tasks-2.2.0-SNAPSHOT.pom
>> [JENKINS] Archiving <
>> https://builds.apache.org/job/Synapse%20-%20Trunk/ws/java/modules/tasks/target/synapse-tasks-2.2.0-SNAPSHOT.jar>
>> to /home/hudson/hudson/jobs/Synapse -
>> Trunk/modules/org.apache.synapse$synapse-tasks/builds/2012-07-15_14-21-32/archive/org.apache.synapse/synapse-tasks/2.2.0-SNAPSHOT/synapse-tasks-2.2.0-SNAPSHOT.jar
>> [JENKINS] Archiving <
>> https://builds.apache.org/job/Synapse%20-%20Trunk/ws/java/modules/handler/pom.xml>
>> to /home/hudson/hudson/jobs/Synapse -
>> Trunk/modules/org.apache.synapse$synapse-handler/builds/2012-07-15_14-21-32/archive/org.apache.synapse/synapse-handler/2.2.0-SNAPSHOT/synapse-handler-2.2.0-SNAPSHOT.pom
>> [JENKINS] Archiving <
>> https://builds.apache.org/job/Synapse%20-%20Trunk/ws/java/modules/distribution/pom.xml>
>> to /home/hudson/hudson/jobs/Synapse -
>> Trunk/modules/org.apache.synapse$synapse-distribution/builds/2012-07-15_14-21-32/archive/org.apache.synapse/synapse-distribution/2.2.0-SNAPSHOT/synapse-distribution-2.2.0-SNAPSHOT.pom
>> Waiting for Jenkins to finish collecting data
>> mavenExecutionResult exceptions not empty
>> message : Failed to execute goal on project synapse-core: Could not
>> resolve dependencies for project
>> org.apache.synapse:synapse-core:bundle:2.2.0-SNAPSHOT: Could not find
>> artifact org.wso2.eventing:wso2eventing-api:jar:SNAPSHOT in
>> wso2-m2-snapshots (http://dist.wso2.org/snapshots/maven2/)
>> cause : Could not resolve dependencies for project
>> org.apache.synapse:synapse-core:bundle:2.2.0-SNAPSHOT: Could not find
>> artifact org.wso2.eventing:wso2eventing-api:jar:SNAPSHOT in
>> wso2-m2-snapshots (http://dist.wso2.org/snapshots/maven2/)
>> Stack trace :
>> org.apache.maven.lifecycle.LifecycleExecutionException: Failed to execute
>> goal on project synapse-core: Could not resolve dependencies for project
>> org.apache.synapse:synapse-core:bundle:2.2.0-SNAPSHOT: Could not find
>> artifact org.wso2.eventing:wso2eventing-api:jar:SNAPSHOT in
>> wso2-m2-snapshots (http://dist.wso2.org/snapshots/maven2/)
>>         at
>> org.apache.maven.lifecycle.internal.LifecycleDependencyResolver.getDependencies(LifecycleDependencyResolver.java:196)
>>         at
>> org.apache.maven.lifecycle.internal.LifecycleDependencyResolver.resolveProjectDependencies(LifecycleDependencyResolver.java:108)
>>         at
>> org.apache.maven.lifecycle.internal.MojoExecutor.ensureDependenciesAreResolved(MojoExecutor.java:258)
>>         at
>> org.apache.maven.lifecycle.internal.MojoExecutor.execute(MojoExecutor.java:201)
>>         at
>> org.apache.maven.lifecycle.internal.MojoExecutor.execute(MojoExecutor.java:153)
>>         at
>> org.apache.maven.lifecycle.internal.MojoExecutor.execute(MojoExecutor.java:145)
>>         at
>> org.apache.maven.lifecycle.internal.LifecycleModuleBuilder.buildProject(LifecycleModuleBuilder.java:84)
>>         at
>> org.apache.maven.lifecycle.internal.LifecycleModuleBuilder.buildProject(LifecycleModuleBuilder.java:59)
>>         at
>> org.apache.maven.lifecycle.internal.LifecycleStarter.singleThreadedBuild(LifecycleStarter.java:183)
>>         at
>> org.apache.maven.lifecycle.internal.LifecycleStarter.execute(LifecycleStarter.java:161)
>>         at org.apache.maven.DefaultMaven.doExecute(DefaultMaven.java:319)
>>         at org.apache.maven.DefaultMaven.execute(DefaultMaven.java:156)
>>         at
>> org.jvnet.hudson.maven3.launcher.Maven3Launcher.main(Maven3Launcher.java:79)
>>         at sun.reflect.NativeMethodAccessorImpl.invoke0(Native Method)
>>         at
>> sun.reflect.NativeMethodAccessorImpl.invoke(NativeMethodAccessorImpl.java:39)
>>         at
>> sun.reflect.DelegatingMethodAccessorImpl.invoke(DelegatingMethodAccessorImpl.java:25)
>>         at java.lang.reflect.Method.invoke(Method.java:597)
>>         at
>> org.codehaus.plexus.classworlds.launcher.Launcher.launchStandard(Launcher.java:329)
>>         at
>> org.codehaus.plexus.classworlds.launcher.Launcher.launch(Launcher.java:239)
>>         at
>> org.jvnet.hudson.maven3.agent.Maven3Main.launch(Maven3Main.java:158)
>>         at hudson.maven.Maven3Builder.call(Maven3Builder.java:98)
>>         at hudson.maven.Maven3Builder.call(Maven3Builder.java:64)
>>         at hudson.remoting.UserRequest.perform(UserRequest.java:118)
>>         at hudson.remoting.UserRequest.perform(UserRequest.java:48)
>>         at hudson.remoting.Request$2.run(Request.java:326)
>>         at
>> hudson.remoting.InterceptingExecutorService$1.call(InterceptingExecutorService.java:72)
>>         at
>> java.util.concurrent.FutureTask$Sync.innerRun(FutureTask.java:303)
>>         at java.util.concurrent.FutureTask.run(FutureTask.java:138)
>>         at
>> java.util.concurrent.ThreadPoolExecutor$Worker.runTask(ThreadPoolExecutor.java:886)
>>         at
>> java.util.concurrent.ThreadPoolExecutor$Worker.run(ThreadPoolExecutor.java:908)
>>         at java.lang.Thread.run(Thread.java:619)
>> Caused by: org.apache.maven.project.DependencyResolutionException: Could
>> not resolve dependencies for project
>> org.apache.synapse:synapse-core:bundle:2.2.0-SNAPSHOT: Could not find
>> artifact org.wso2.eventing:wso2eventing-api:jar:SNAPSHOT in
>> wso2-m2-snapshots (http://dist.wso2.org/snapshots/maven2/)
>>         at
>> org.apache.maven.project.DefaultProjectDependenciesResolver.resolve(DefaultProjectDependenciesResolver.java:170)
>>         at
>> org.apache.maven.lifecycle.internal.LifecycleDependencyResolver.getDependencies(LifecycleDependencyResolver.java:171)
>>         ... 30 more
>> Caused by: org.sonatype.aether.resolution.DependencyResolutionException:
>> Could not find artifact org.wso2.eventing:wso2eventing-api:jar:SNAPSHOT in
>> wso2-m2-snapshots (http://dist.wso2.org/snapshots/maven2/)
>>         at
>> org.sonatype.aether.impl.internal.DefaultRepositorySystem.resolveDependencies(DefaultRepositorySystem.java:412)
>>         at
>> org.apache.maven.project.DefaultProjectDependenciesResolver.resolve(DefaultProjectDependenciesResolver.java:164)
>>         ... 31 more
>> Caused by: org.sonatype.aether.resolution.ArtifactResolutionException:
>> Could not find artifact org.wso2.eventing:wso2eventing-api:jar:SNAPSHOT in
>> wso2-m2-snapshots (http://dist.wso2.org/snapshots/maven2/)
>>         at
>> org.sonatype.aether.impl.internal.DefaultArtifactResolver.resolve(DefaultArtifactResolver.java:541)
>>         at
>> org.sonatype.aether.impl.internal.DefaultArtifactResolver.resolveArtifacts(DefaultArtifactResolver.java:220)
>>         at
>> org.sonatype.aether.impl.internal.DefaultRepositorySystem.resolveDependencies(DefaultRepositorySystem.java:395)
>>         ... 32 more
>> Caused by: org.sonatype.aether.transfer.ArtifactNotFoundException: Could
>> not find artifact org.wso2.eventing:wso2eventing-api:jar:SNAPSHOT in
>> wso2-m2-snapshots (http://dist.wso2.org/snapshots/maven2/)
>>         at
>> org.sonatype.aether.connector.wagon.WagonRepositoryConnector$4.wrap(WagonRepositoryConnector.java:945)
>>         at
>> org.sonatype.aether.connector.wagon.WagonRepositoryConnector$4.wrap(WagonRepositoryConnector.java:940)
>>         at
>> org.sonatype.aether.connector.wagon.WagonRepositoryConnector$GetTask.flush(WagonRepositoryConnector.java:695)
>>         at
>> org.sonatype.aether.connector.wagon.WagonRepositoryConnector$GetTask.flush(WagonRepositoryConnector.java:689)
>>         at
>> org.sonatype.aether.connector.wagon.WagonRepositoryConnector.get(WagonRepositoryConnector.java:445)
>>         at
>> org.sonatype.aether.impl.internal.DefaultArtifactResolver.resolve(DefaultArtifactResolver.java:460)
>>         ... 34 more
>> Sending e-mails to: dev@synapse.apache.org
>> channel stopped
>> [locks-and-latches] Releasing all the locks
>> [locks-and-latches] All the locks released
>> Updating SYNAPSE-838
>>
>> ---------------------------------------------------------------------
>> To unsubscribe, e-mail: dev-unsubscribe@synapse.apache.org
>> For additional commands, e-mail: dev-help@synapse.apache.org
>>
>>
>
>
> --
>
> Sadeep Jayasumana
>
> **
>
> Email: gayansadeep@gmail.com****
>
> Mobile: +61 4 1468 8521
>
>
>


-- 
Hiranya Jayathilaka
Associate Technical Lead;
WSO2 Inc.;  http://wso2.org
E-mail: hiranya@wso2.com;  Mobile: +94 77 633 3491
Blog: http://techfeast-hiranya.blogspot.com

Mime
View raw message