synapse-dev mailing list archives

Site index · List index
Message view « Date » · « Thread »
Top « Date » · « Thread »
From Apache Jenkins Server <jenk...@builds.apache.org>
Subject Build failed in Jenkins: Synapse - Trunk #4409
Date Thu, 30 Aug 2012 20:11:46 GMT
See <https://builds.apache.org/job/Synapse%20-%20Trunk/4409/>

------------------------------------------
[...truncated 2933 lines...]
[INFO] Apache Synapse - Commons .......................... SUCCESS [14.296s]
[INFO] Apache Synapse - Transports ....................... SUCCESS [6.999s]
[INFO] Apache Synapse - Non-blocking HTTP/s Transport .... SUCCESS [18.431s]
[INFO] Apache Synapse - PIPE Transport ................... SUCCESS [8.528s]
[INFO] Apache Synapse - VFS Transport .................... SUCCESS [17.440s]
[INFO] Apache Synapse - FIX Transport .................... SUCCESS [16.314s]
[INFO] Apache Synapse - Tasks ............................ SUCCESS [26.082s]
[INFO] Apache Synapse - Core ............................. SUCCESS [2:27.061s]
[INFO] Apache Synapse - Extensions ....................... SUCCESS [34.251s]
[INFO] Apache Synapse - Samples .......................... SUCCESS [19.001s]
[INFO] Apache Synapse - Patches .......................... SUCCESS [8.339s]
[INFO] Apache Synapse - Experimental code ................ SUCCESS [7.007s]
[INFO] Apache Synapse - Documentation .................... SUCCESS [12.051s]
[INFO] Apache Synapse - Web Application .................. SUCCESS [17.738s]
[INFO] Apache Synapse - Handler Module ................... SUCCESS [7.570s]
[INFO] Apache Synapse - XAR Maven Plugin ................. SUCCESS [7.209s]
[INFO] Apache Synapse - Configuration Migrator ........... SUCCESS [6.825s]
[INFO] Apache Synapse - Distribution ..................... FAILURE [1:14.439s]
[INFO] Apache Synapse - Package skeleton ZIP ............. SKIPPED
[INFO] Apache Synapse - Package archetype ................ SKIPPED
[INFO] Apache Synapse - Integration ...................... SKIPPED
[INFO] ------------------------------------------------------------------------
[INFO] BUILD FAILURE
[INFO] ------------------------------------------------------------------------
[INFO] Total time: 8:12.845s
[INFO] Finished at: Thu Aug 30 20:11:25 UTC 2012
[INFO] Final Memory: 102M/423M
[INFO] ------------------------------------------------------------------------
Projects to build: [MavenProject: org.apache.synapse:Apache-Synapse:2.2.0-SNAPSHOT @ <https://builds.apache.org/job/Synapse%20-%20Trunk/ws/java/pom.xml,>
MavenProject: org.apache.synapse:synapse-securevault:2.2.0-SNAPSHOT @ <https://builds.apache.org/job/Synapse%20-%20Trunk/ws/java/modules/securevault/pom.xml,>
MavenProject: org.apache.synapse:synapse-commons:2.2.0-SNAPSHOT @ <https://builds.apache.org/job/Synapse%20-%20Trunk/ws/java/modules/commons/pom.xml,>
MavenProject: org.apache.synapse:synapse-transports:2.2.0-SNAPSHOT @ <https://builds.apache.org/job/Synapse%20-%20Trunk/ws/java/modules/transports/pom.xml,>
MavenProject: org.apache.synapse:synapse-nhttp-transport:2.2.0-SNAPSHOT @ <https://builds.apache.org/job/Synapse%20-%20Trunk/ws/java/modules/transports/core/nhttp/pom.xml,>
MavenProject: org.apache.synapse:synapse-pipe-transport:2.2.0-SNAPSHOT @ <https://builds.apache.org/job/Synapse%20-%20Trunk/ws/java/modules/transports/core/pipe/pom.xml,>
MavenProject: org.apache.synapse:synapse-vfs-transport:2.2.0-SNAPSHOT @ <https://builds.apache.org/job/Synapse%20-%20Trunk/ws/java/modules/transports/core/vfs/pom.xml,>
MavenProject: org.apache.synapse:synapse-fix-transport:2.2.0-SNAPSHOT @ <https://builds.apache.org/job/Synapse%20-%20Trunk/ws/java/modules/transports/optional/fix/pom.xml,>
MavenProject: org.apache.synapse:synapse-tasks:2.2.0-SNAPSHOT @ <https://builds.apache.org/job/Synapse%20-%20Trunk/ws/java/modules/tasks/pom.xml,>
MavenProject: org.apache.synapse:synapse-core:2.2.0-SNAPSHOT @ <https://builds.apache.org/job/Synapse%20-%20Trunk/ws/java/modules/core/pom.xml,>
MavenProject: org.apache.synapse:synapse-extensions:2.2.0-SNAPSHOT @ <https://builds.apache.org/job/Synapse%20-%20Trunk/ws/java/modules/extensions/pom.xml,>
MavenProject: org.apache.synapse:synapse-samples:2.2.0-SNAPSHOT @ <https://builds.apache.org/job/Synapse%20-%20Trunk/ws/java/modules/samples/pom.xml,>
MavenProject: org.apache.synapse:synapse-patches:2.2.0-SNAPSHOT @ <https://builds.apache.org/job/Synapse%20-%20Trunk/ws/java/modules/patches/pom.xml,>
MavenProject: org.apache.synapse:synapse-experimental:2.2.0-SNAPSHOT @ <https://builds.apache.org/job/Synapse%20-%20Trunk/ws/java/modules/experimental/pom.xml,>
MavenProject: org.apache.synapse:synapse-documentation:2.2.0-SNAPSHOT @ <https://builds.apache.org/job/Synapse%20-%20Trunk/ws/java/modules/documentation/pom.xml,>
MavenProject: org.apache.synapse:synapse-war:2.2.0-SNAPSHOT @ <https://builds.apache.org/job/Synapse%20-%20Trunk/ws/java/modules/war/pom.xml,>
MavenProject: org.apache.synapse:synapse-handler:2.2.0-SNAPSHOT @ <https://builds.apache.org/job/Synapse%20-%20Trunk/ws/java/modules/handler/pom.xml,>
MavenProject: org.apache.synapse:synapse-xar-maven-plugin:2.2.0-SNAPSHOT @ <https://builds.apache.org/job/Synapse%20-%20Trunk/ws/java/modules/xar-maven-plugin/pom.xml,>
MavenProject: org.apache.synapse:synapse-config-migrator:2.2.0-SNAPSHOT @ <https://builds.apache.org/job/Synapse%20-%20Trunk/ws/java/modules/migrator/pom.xml,>
MavenProject: org.apache.synapse:synapse-distribution:2.2.0-SNAPSHOT @ <https://builds.apache.org/job/Synapse%20-%20Trunk/ws/java/modules/distribution/pom.xml,>
MavenProject: org.apache.synapse:synapse-package-skeleton:2.2.0-SNAPSHOT @ <https://builds.apache.org/job/Synapse%20-%20Trunk/ws/java/modules/packaging/package-skeleton/pom.xml,>
MavenProject: org.apache.synapse:synapse-package-archetype:2.2.0-SNAPSHOT @ <https://builds.apache.org/job/Synapse%20-%20Trunk/ws/java/modules/packaging/package-archetype/pom.xml,>
MavenProject: org.apache.synapse:synapse-integration:2.2.0-SNAPSHOT @ <https://builds.apache.org/job/Synapse%20-%20Trunk/ws/java/modules/integration/pom.xml]>
[JENKINS] Archiving <https://builds.apache.org/job/Synapse%20-%20Trunk/ws/java/modules/migrator/pom.xml>
to /home/hudson/hudson/jobs/Synapse - Trunk/modules/org.apache.synapse$synapse-config-migrator/builds/2012-08-30_20-03-06/archive/org.apache.synapse/synapse-config-migrator/2.2.0-SNAPSHOT/synapse-config-migrator-2.2.0-SNAPSHOT.pom
[JENKINS] Archiving <https://builds.apache.org/job/Synapse%20-%20Trunk/ws/java/modules/migrator/target/synapse-config-migrator-2.2.0-SNAPSHOT.jar>
to /home/hudson/hudson/jobs/Synapse - Trunk/modules/org.apache.synapse$synapse-config-migrator/builds/2012-08-30_20-03-06/archive/org.apache.synapse/synapse-config-migrator/2.2.0-SNAPSHOT/synapse-config-migrator-2.2.0-SNAPSHOT.jar
[JENKINS] Archiving <https://builds.apache.org/job/Synapse%20-%20Trunk/ws/java/modules/core/pom.xml>
to /home/hudson/hudson/jobs/Synapse - Trunk/modules/org.apache.synapse$synapse-core/builds/2012-08-30_20-03-06/archive/org.apache.synapse/synapse-core/2.2.0-SNAPSHOT/synapse-core-2.2.0-SNAPSHOT.pom
[JENKINS] Archiving <https://builds.apache.org/job/Synapse%20-%20Trunk/ws/java/modules/core/target/synapse-core-2.2.0-SNAPSHOT.jar>
to /home/hudson/hudson/jobs/Synapse - Trunk/modules/org.apache.synapse$synapse-core/builds/2012-08-30_20-03-06/archive/org.apache.synapse/synapse-core/2.2.0-SNAPSHOT/synapse-core-2.2.0-SNAPSHOT.jar
[JENKINS] Archiving <https://builds.apache.org/job/Synapse%20-%20Trunk/ws/java/modules/core/target/synapse-core-2.2.0-SNAPSHOT-tests.jar>
to /home/hudson/hudson/jobs/Synapse - Trunk/modules/org.apache.synapse$synapse-core/builds/2012-08-30_20-03-06/archive/org.apache.synapse/synapse-core/2.2.0-SNAPSHOT/synapse-core-2.2.0-SNAPSHOT-tests.jar
[JENKINS] Archiving <https://builds.apache.org/job/Synapse%20-%20Trunk/ws/java/modules/integration/pom.xml>
to /home/hudson/hudson/jobs/Synapse - Trunk/modules/org.apache.synapse$synapse-integration/builds/2012-08-30_20-03-06/archive/org.apache.synapse/synapse-integration/2.2.0-SNAPSHOT/synapse-integration-2.2.0-SNAPSHOT.pom
[JENKINS] Archiving <https://builds.apache.org/job/Synapse%20-%20Trunk/ws/java/modules/packaging/package-skeleton/pom.xml>
to /home/hudson/hudson/jobs/Synapse - Trunk/modules/org.apache.synapse$synapse-package-skeleton/builds/2012-08-30_20-03-06/archive/org.apache.synapse/synapse-package-skeleton/2.2.0-SNAPSHOT/synapse-package-skeleton-2.2.0-SNAPSHOT.pom
[JENKINS] Archiving <https://builds.apache.org/job/Synapse%20-%20Trunk/ws/java/modules/securevault/pom.xml>
to /home/hudson/hudson/jobs/Synapse - Trunk/modules/org.apache.synapse$synapse-securevault/builds/2012-08-30_20-03-06/archive/org.apache.synapse/synapse-securevault/2.2.0-SNAPSHOT/synapse-securevault-2.2.0-SNAPSHOT.pom
[JENKINS] Archiving <https://builds.apache.org/job/Synapse%20-%20Trunk/ws/java/modules/securevault/target/synapse-securevault-2.2.0-SNAPSHOT.jar>
to /home/hudson/hudson/jobs/Synapse - Trunk/modules/org.apache.synapse$synapse-securevault/builds/2012-08-30_20-03-06/archive/org.apache.synapse/synapse-securevault/2.2.0-SNAPSHOT/synapse-securevault-2.2.0-SNAPSHOT.jar
[JENKINS] Archiving <https://builds.apache.org/job/Synapse%20-%20Trunk/ws/java/modules/packaging/package-archetype/pom.xml>
to /home/hudson/hudson/jobs/Synapse - Trunk/modules/org.apache.synapse$synapse-package-archetype/builds/2012-08-30_20-03-06/archive/org.apache.synapse/synapse-package-archetype/2.2.0-SNAPSHOT/synapse-package-archetype-2.2.0-SNAPSHOT.pom
[JENKINS] Archiving <https://builds.apache.org/job/Synapse%20-%20Trunk/ws/java/modules/commons/pom.xml>
to /home/hudson/hudson/jobs/Synapse - Trunk/modules/org.apache.synapse$synapse-commons/builds/2012-08-30_20-03-06/archive/org.apache.synapse/synapse-commons/2.2.0-SNAPSHOT/synapse-commons-2.2.0-SNAPSHOT.pom
[JENKINS] Archiving <https://builds.apache.org/job/Synapse%20-%20Trunk/ws/java/modules/commons/target/synapse-commons-2.2.0-SNAPSHOT.jar>
to /home/hudson/hudson/jobs/Synapse - Trunk/modules/org.apache.synapse$synapse-commons/builds/2012-08-30_20-03-06/archive/org.apache.synapse/synapse-commons/2.2.0-SNAPSHOT/synapse-commons-2.2.0-SNAPSHOT.jar
[JENKINS] Archiving <https://builds.apache.org/job/Synapse%20-%20Trunk/ws/java/modules/extensions/pom.xml>
to /home/hudson/hudson/jobs/Synapse - Trunk/modules/org.apache.synapse$synapse-extensions/builds/2012-08-30_20-03-06/archive/org.apache.synapse/synapse-extensions/2.2.0-SNAPSHOT/synapse-extensions-2.2.0-SNAPSHOT.pom
[JENKINS] Archiving <https://builds.apache.org/job/Synapse%20-%20Trunk/ws/java/modules/extensions/target/synapse-extensions-2.2.0-SNAPSHOT.jar>
to /home/hudson/hudson/jobs/Synapse - Trunk/modules/org.apache.synapse$synapse-extensions/builds/2012-08-30_20-03-06/archive/org.apache.synapse/synapse-extensions/2.2.0-SNAPSHOT/synapse-extensions-2.2.0-SNAPSHOT.jar
[JENKINS] Archiving <https://builds.apache.org/job/Synapse%20-%20Trunk/ws/java/modules/samples/pom.xml>
to /home/hudson/hudson/jobs/Synapse - Trunk/modules/org.apache.synapse$synapse-samples/builds/2012-08-30_20-03-06/archive/org.apache.synapse/synapse-samples/2.2.0-SNAPSHOT/synapse-samples-2.2.0-SNAPSHOT.pom
[JENKINS] Archiving <https://builds.apache.org/job/Synapse%20-%20Trunk/ws/java/modules/samples/target/synapse-samples-2.2.0-SNAPSHOT.jar>
to /home/hudson/hudson/jobs/Synapse - Trunk/modules/org.apache.synapse$synapse-samples/builds/2012-08-30_20-03-06/archive/org.apache.synapse/synapse-samples/2.2.0-SNAPSHOT/synapse-samples-2.2.0-SNAPSHOT.jar
[JENKINS] Archiving <https://builds.apache.org/job/Synapse%20-%20Trunk/ws/java/modules/xar-maven-plugin/pom.xml>
to /home/hudson/hudson/jobs/Synapse - Trunk/modules/org.apache.synapse$synapse-xar-maven-plugin/builds/2012-08-30_20-03-06/archive/org.apache.synapse/synapse-xar-maven-plugin/2.2.0-SNAPSHOT/synapse-xar-maven-plugin-2.2.0-SNAPSHOT.pom
[JENKINS] Archiving <https://builds.apache.org/job/Synapse%20-%20Trunk/ws/java/modules/xar-maven-plugin/target/synapse-xar-maven-plugin-2.2.0-SNAPSHOT.jar>
to /home/hudson/hudson/jobs/Synapse - Trunk/modules/org.apache.synapse$synapse-xar-maven-plugin/builds/2012-08-30_20-03-06/archive/org.apache.synapse/synapse-xar-maven-plugin/2.2.0-SNAPSHOT/synapse-xar-maven-plugin-2.2.0-SNAPSHOT.jar
[JENKINS] Archiving <https://builds.apache.org/job/Synapse%20-%20Trunk/ws/java/modules/documentation/pom.xml>
to /home/hudson/hudson/jobs/Synapse - Trunk/modules/org.apache.synapse$synapse-documentation/builds/2012-08-30_20-03-06/archive/org.apache.synapse/synapse-documentation/2.2.0-SNAPSHOT/synapse-documentation-2.2.0-SNAPSHOT.pom
[JENKINS] Archiving <https://builds.apache.org/job/Synapse%20-%20Trunk/ws/java/modules/documentation/target/synapse-documentation-2.2.0-SNAPSHOT-docs.zip>
to /home/hudson/hudson/jobs/Synapse - Trunk/modules/org.apache.synapse$synapse-documentation/builds/2012-08-30_20-03-06/archive/org.apache.synapse/synapse-documentation/2.2.0-SNAPSHOT/synapse-documentation-2.2.0-SNAPSHOT-docs.zip
[JENKINS] Archiving <https://builds.apache.org/job/Synapse%20-%20Trunk/ws/java/modules/transports/core/nhttp/pom.xml>
to /home/hudson/hudson/jobs/Synapse - Trunk/modules/org.apache.synapse$synapse-nhttp-transport/builds/2012-08-30_20-03-06/archive/org.apache.synapse/synapse-nhttp-transport/2.2.0-SNAPSHOT/synapse-nhttp-transport-2.2.0-SNAPSHOT.pom
[JENKINS] Archiving <https://builds.apache.org/job/Synapse%20-%20Trunk/ws/java/modules/transports/core/nhttp/target/synapse-nhttp-transport-2.2.0-SNAPSHOT.jar>
to /home/hudson/hudson/jobs/Synapse - Trunk/modules/org.apache.synapse$synapse-nhttp-transport/builds/2012-08-30_20-03-06/archive/org.apache.synapse/synapse-nhttp-transport/2.2.0-SNAPSHOT/synapse-nhttp-transport-2.2.0-SNAPSHOT.jar
[JENKINS] Archiving <https://builds.apache.org/job/Synapse%20-%20Trunk/ws/java/modules/transports/core/nhttp/target/synapse-nhttp-transport-2.2.0-SNAPSHOT-testkit-logs.zip>
to /home/hudson/hudson/jobs/Synapse - Trunk/modules/org.apache.synapse$synapse-nhttp-transport/builds/2012-08-30_20-03-06/archive/org.apache.synapse/synapse-nhttp-transport/2.2.0-SNAPSHOT/synapse-nhttp-transport-2.2.0-SNAPSHOT-testkit-logs.zip
[JENKINS] Archiving <https://builds.apache.org/job/Synapse%20-%20Trunk/ws/java/modules/transports/core/pipe/pom.xml>
to /home/hudson/hudson/jobs/Synapse - Trunk/modules/org.apache.synapse$synapse-pipe-transport/builds/2012-08-30_20-03-06/archive/org.apache.synapse/synapse-pipe-transport/2.2.0-SNAPSHOT/synapse-pipe-transport-2.2.0-SNAPSHOT.pom
[JENKINS] Archiving <https://builds.apache.org/job/Synapse%20-%20Trunk/ws/java/modules/transports/core/pipe/target/synapse-pipe-transport-2.2.0-SNAPSHOT.jar>
to /home/hudson/hudson/jobs/Synapse - Trunk/modules/org.apache.synapse$synapse-pipe-transport/builds/2012-08-30_20-03-06/archive/org.apache.synapse/synapse-pipe-transport/2.2.0-SNAPSHOT/synapse-pipe-transport-2.2.0-SNAPSHOT.jar
[JENKINS] Archiving <https://builds.apache.org/job/Synapse%20-%20Trunk/ws/java/modules/transports/optional/fix/pom.xml>
to /home/hudson/hudson/jobs/Synapse - Trunk/modules/org.apache.synapse$synapse-fix-transport/builds/2012-08-30_20-03-06/archive/org.apache.synapse/synapse-fix-transport/2.2.0-SNAPSHOT/synapse-fix-transport-2.2.0-SNAPSHOT.pom
[JENKINS] Archiving <https://builds.apache.org/job/Synapse%20-%20Trunk/ws/java/modules/transports/optional/fix/target/synapse-fix-transport-2.2.0-SNAPSHOT.jar>
to /home/hudson/hudson/jobs/Synapse - Trunk/modules/org.apache.synapse$synapse-fix-transport/builds/2012-08-30_20-03-06/archive/org.apache.synapse/synapse-fix-transport/2.2.0-SNAPSHOT/synapse-fix-transport-2.2.0-SNAPSHOT.jar
[JENKINS] Archiving <https://builds.apache.org/job/Synapse%20-%20Trunk/ws/java/modules/transports/pom.xml>
to /home/hudson/hudson/jobs/Synapse - Trunk/modules/org.apache.synapse$synapse-transports/builds/2012-08-30_20-03-06/archive/org.apache.synapse/synapse-transports/2.2.0-SNAPSHOT/synapse-transports-2.2.0-SNAPSHOT.pom
[JENKINS] Archiving <https://builds.apache.org/job/Synapse%20-%20Trunk/ws/java/modules/war/pom.xml>
to /home/hudson/hudson/jobs/Synapse - Trunk/modules/org.apache.synapse$synapse-war/builds/2012-08-30_20-03-06/archive/org.apache.synapse/synapse-war/2.2.0-SNAPSHOT/synapse-war-2.2.0-SNAPSHOT.pom
[JENKINS] Archiving target/synapse.war to /home/hudson/hudson/jobs/Synapse - Trunk/modules/org.apache.synapse$synapse-war/builds/2012-08-30_20-03-06/archive/org.apache.synapse/synapse-war/2.2.0-SNAPSHOT/synapse-war-2.2.0-SNAPSHOT.war
[JENKINS] Archiving <https://builds.apache.org/job/Synapse%20-%20Trunk/ws/java/pom.xml>
to /home/hudson/hudson/jobs/Synapse - Trunk/modules/org.apache.synapse$Apache-Synapse/builds/2012-08-30_20-03-06/archive/org.apache.synapse/Apache-Synapse/2.2.0-SNAPSHOT/Apache-Synapse-2.2.0-SNAPSHOT.pom
[JENKINS] Archiving <https://builds.apache.org/job/Synapse%20-%20Trunk/ws/java/modules/transports/core/vfs/pom.xml>
to /home/hudson/hudson/jobs/Synapse - Trunk/modules/org.apache.synapse$synapse-vfs-transport/builds/2012-08-30_20-03-06/archive/org.apache.synapse/synapse-vfs-transport/2.2.0-SNAPSHOT/synapse-vfs-transport-2.2.0-SNAPSHOT.pom
[JENKINS] Archiving <https://builds.apache.org/job/Synapse%20-%20Trunk/ws/java/modules/transports/core/vfs/target/synapse-vfs-transport-2.2.0-SNAPSHOT.jar>
to /home/hudson/hudson/jobs/Synapse - Trunk/modules/org.apache.synapse$synapse-vfs-transport/builds/2012-08-30_20-03-06/archive/org.apache.synapse/synapse-vfs-transport/2.2.0-SNAPSHOT/synapse-vfs-transport-2.2.0-SNAPSHOT.jar
[JENKINS] Archiving <https://builds.apache.org/job/Synapse%20-%20Trunk/ws/java/modules/transports/core/vfs/target/synapse-vfs-transport-2.2.0-SNAPSHOT-testkit-logs.zip>
to /home/hudson/hudson/jobs/Synapse - Trunk/modules/org.apache.synapse$synapse-vfs-transport/builds/2012-08-30_20-03-06/archive/org.apache.synapse/synapse-vfs-transport/2.2.0-SNAPSHOT/synapse-vfs-transport-2.2.0-SNAPSHOT-testkit-logs.zip
[JENKINS] Archiving <https://builds.apache.org/job/Synapse%20-%20Trunk/ws/java/modules/patches/pom.xml>
to /home/hudson/hudson/jobs/Synapse - Trunk/modules/org.apache.synapse$synapse-patches/builds/2012-08-30_20-03-06/archive/org.apache.synapse/synapse-patches/2.2.0-SNAPSHOT/synapse-patches-2.2.0-SNAPSHOT.pom
[JENKINS] Archiving <https://builds.apache.org/job/Synapse%20-%20Trunk/ws/java/modules/patches/target/synapse-patches-2.2.0-SNAPSHOT.jar>
to /home/hudson/hudson/jobs/Synapse - Trunk/modules/org.apache.synapse$synapse-patches/builds/2012-08-30_20-03-06/archive/org.apache.synapse/synapse-patches/2.2.0-SNAPSHOT/synapse-patches-2.2.0-SNAPSHOT.jar
[JENKINS] Archiving <https://builds.apache.org/job/Synapse%20-%20Trunk/ws/java/modules/patches/target/synapse-patches-2.2.0-SNAPSHOT-jars.zip>
to /home/hudson/hudson/jobs/Synapse - Trunk/modules/org.apache.synapse$synapse-patches/builds/2012-08-30_20-03-06/archive/org.apache.synapse/synapse-patches/2.2.0-SNAPSHOT/synapse-patches-2.2.0-SNAPSHOT-jars.zip
[JENKINS] Archiving <https://builds.apache.org/job/Synapse%20-%20Trunk/ws/java/modules/experimental/pom.xml>
to /home/hudson/hudson/jobs/Synapse - Trunk/modules/org.apache.synapse$synapse-experimental/builds/2012-08-30_20-03-06/archive/org.apache.synapse/synapse-experimental/2.2.0-SNAPSHOT/synapse-experimental-2.2.0-SNAPSHOT.pom
[JENKINS] Archiving <https://builds.apache.org/job/Synapse%20-%20Trunk/ws/java/modules/experimental/target/synapse-experimental-2.2.0-SNAPSHOT.jar>
to /home/hudson/hudson/jobs/Synapse - Trunk/modules/org.apache.synapse$synapse-experimental/builds/2012-08-30_20-03-06/archive/org.apache.synapse/synapse-experimental/2.2.0-SNAPSHOT/synapse-experimental-2.2.0-SNAPSHOT.jar
[JENKINS] Archiving <https://builds.apache.org/job/Synapse%20-%20Trunk/ws/java/modules/tasks/pom.xml>
to /home/hudson/hudson/jobs/Synapse - Trunk/modules/org.apache.synapse$synapse-tasks/builds/2012-08-30_20-03-06/archive/org.apache.synapse/synapse-tasks/2.2.0-SNAPSHOT/synapse-tasks-2.2.0-SNAPSHOT.pom
[JENKINS] Archiving <https://builds.apache.org/job/Synapse%20-%20Trunk/ws/java/modules/tasks/target/synapse-tasks-2.2.0-SNAPSHOT.jar>
to /home/hudson/hudson/jobs/Synapse - Trunk/modules/org.apache.synapse$synapse-tasks/builds/2012-08-30_20-03-06/archive/org.apache.synapse/synapse-tasks/2.2.0-SNAPSHOT/synapse-tasks-2.2.0-SNAPSHOT.jar
[JENKINS] Archiving <https://builds.apache.org/job/Synapse%20-%20Trunk/ws/java/modules/handler/pom.xml>
to /home/hudson/hudson/jobs/Synapse - Trunk/modules/org.apache.synapse$synapse-handler/builds/2012-08-30_20-03-06/archive/org.apache.synapse/synapse-handler/2.2.0-SNAPSHOT/synapse-handler-2.2.0-SNAPSHOT.pom
[JENKINS] Archiving <https://builds.apache.org/job/Synapse%20-%20Trunk/ws/java/modules/handler/target/synapse-handler-2.2.0-SNAPSHOT.jar>
to /home/hudson/hudson/jobs/Synapse - Trunk/modules/org.apache.synapse$synapse-handler/builds/2012-08-30_20-03-06/archive/org.apache.synapse/synapse-handler/2.2.0-SNAPSHOT/synapse-handler-2.2.0-SNAPSHOT.jar
[JENKINS] Archiving <https://builds.apache.org/job/Synapse%20-%20Trunk/ws/java/modules/handler/target/synapse-handler-2.2.0-SNAPSHOT.mar>
to /home/hudson/hudson/jobs/Synapse - Trunk/modules/org.apache.synapse$synapse-handler/builds/2012-08-30_20-03-06/archive/org.apache.synapse/synapse-handler/2.2.0-SNAPSHOT/synapse-handler-2.2.0-SNAPSHOT.mar
[JENKINS] Archiving <https://builds.apache.org/job/Synapse%20-%20Trunk/ws/java/modules/distribution/pom.xml>
to /home/hudson/hudson/jobs/Synapse - Trunk/modules/org.apache.synapse$synapse-distribution/builds/2012-08-30_20-03-06/archive/org.apache.synapse/synapse-distribution/2.2.0-SNAPSHOT/synapse-distribution-2.2.0-SNAPSHOT.pom
Waiting for Jenkins to finish collecting data
mavenExecutionResult exceptions not empty
message : Failed to execute goal org.apache.maven.plugins:maven-remote-resources-plugin:1.1:process
(default) on project synapse-distribution: Failed to resolve dependencies for one or more
projects in the reactor. Reason: Unable to get dependency information for net.sf.saxon:saxon-xqj:jar:8.9:
Failed to retrieve POM for net.sf.saxon:saxon-xqj:jar:8.9: Could not transfer artifact net.sf.saxon:saxon-xqj:pom:8.9
from/to atlassian-developer-site (http://maven.atlassian.com/repository/public): Error transferring
file: Server returned HTTP response code: 502 for URL: http://maven.atlassian.com/repository/public/net/sf/saxon/saxon-xqj/8.9/saxon-xqj-8.9.pom
  net.sf.saxon:saxon-xqj:jar:8.9

from the specified remote repositories:
  atlassian-developer-site (http://maven.atlassian.com/repository/public, releases=true, snapshots=false),
  wso2-m2 (http://dist.wso2.org/maven2/, releases=true, snapshots=false),
  wso2-m2-snapshots (http://dist.wso2.org/snapshots/maven2/, releases=false, snapshots=true),
  snmp4j-repo (https://server.oosnmp.net/dist/release/, releases=true, snapshots=false),
  Nexus (http://repository.apache.org/snapshots, releases=false, snapshots=true),
  central (http://repo1.maven.org/maven2, releases=true, snapshots=false)
Path to dependency: 
	1) org.apache.synapse:synapse-distribution:pom:2.2.0-SNAPSHOT
	2) org.apache.synapse:synapse-extensions:jar:2.2.0-SNAPSHOT


cause : Failed to resolve dependencies for one or more projects in the reactor. Reason: Unable
to get dependency information for net.sf.saxon:saxon-xqj:jar:8.9: Failed to retrieve POM for
net.sf.saxon:saxon-xqj:jar:8.9: Could not transfer artifact net.sf.saxon:saxon-xqj:pom:8.9
from/to atlassian-developer-site (http://maven.atlassian.com/repository/public): Error transferring
file: Server returned HTTP response code: 502 for URL: http://maven.atlassian.com/repository/public/net/sf/saxon/saxon-xqj/8.9/saxon-xqj-8.9.pom
  net.sf.saxon:saxon-xqj:jar:8.9

from the specified remote repositories:
  atlassian-developer-site (http://maven.atlassian.com/repository/public, releases=true, snapshots=false),
  wso2-m2 (http://dist.wso2.org/maven2/, releases=true, snapshots=false),
  wso2-m2-snapshots (http://dist.wso2.org/snapshots/maven2/, releases=false, snapshots=true),
  snmp4j-repo (https://server.oosnmp.net/dist/release/, releases=true, snapshots=false),
  Nexus (http://repository.apache.org/snapshots, releases=false, snapshots=true),
  central (http://repo1.maven.org/maven2, releases=true, snapshots=false)
Path to dependency: 
	1) org.apache.synapse:synapse-distribution:pom:2.2.0-SNAPSHOT
	2) org.apache.synapse:synapse-extensions:jar:2.2.0-SNAPSHOT


Stack trace : 
org.apache.maven.lifecycle.LifecycleExecutionException: Failed to execute goal org.apache.maven.plugins:maven-remote-resources-plugin:1.1:process
(default) on project synapse-distribution: Failed to resolve dependencies for one or more
projects in the reactor. Reason: Unable to get dependency information for net.sf.saxon:saxon-xqj:jar:8.9:
Failed to retrieve POM for net.sf.saxon:saxon-xqj:jar:8.9: Could not transfer artifact net.sf.saxon:saxon-xqj:pom:8.9
from/to atlassian-developer-site (http://maven.atlassian.com/repository/public): Error transferring
file: Server returned HTTP response code: 502 for URL: http://maven.atlassian.com/repository/public/net/sf/saxon/saxon-xqj/8.9/saxon-xqj-8.9.pom
  net.sf.saxon:saxon-xqj:jar:8.9

from the specified remote repositories:
  atlassian-developer-site (http://maven.atlassian.com/repository/public, releases=true, snapshots=false),
  wso2-m2 (http://dist.wso2.org/maven2/, releases=true, snapshots=false),
  wso2-m2-snapshots (http://dist.wso2.org/snapshots/maven2/, releases=false, snapshots=true),
  snmp4j-repo (https://server.oosnmp.net/dist/release/, releases=true, snapshots=false),
  Nexus (http://repository.apache.org/snapshots, releases=false, snapshots=true),
  central (http://repo1.maven.org/maven2, releases=true, snapshots=false)
Path to dependency: 
	1) org.apache.synapse:synapse-distribution:pom:2.2.0-SNAPSHOT
	2) org.apache.synapse:synapse-extensions:jar:2.2.0-SNAPSHOT


	at org.apache.maven.lifecycle.internal.MojoExecutor.execute(MojoExecutor.java:217)
	at org.apache.maven.lifecycle.internal.MojoExecutor.execute(MojoExecutor.java:153)
	at org.apache.maven.lifecycle.internal.MojoExecutor.execute(MojoExecutor.java:145)
	at org.apache.maven.lifecycle.internal.LifecycleModuleBuilder.buildProject(LifecycleModuleBuilder.java:84)
	at org.apache.maven.lifecycle.internal.LifecycleModuleBuilder.buildProject(LifecycleModuleBuilder.java:59)
	at org.apache.maven.lifecycle.internal.LifecycleStarter.singleThreadedBuild(LifecycleStarter.java:183)
	at org.apache.maven.lifecycle.internal.LifecycleStarter.execute(LifecycleStarter.java:161)
	at org.apache.maven.DefaultMaven.doExecute(DefaultMaven.java:319)
	at org.apache.maven.DefaultMaven.execute(DefaultMaven.java:156)
	at org.jvnet.hudson.maven3.launcher.Maven3Launcher.main(Maven3Launcher.java:79)
	at sun.reflect.NativeMethodAccessorImpl.invoke0(Native Method)
	at sun.reflect.NativeMethodAccessorImpl.invoke(NativeMethodAccessorImpl.java:39)
	at sun.reflect.DelegatingMethodAccessorImpl.invoke(DelegatingMethodAccessorImpl.java:25)
	at java.lang.reflect.Method.invoke(Method.java:597)
	at org.codehaus.plexus.classworlds.launcher.Launcher.launchStandard(Launcher.java:329)
	at org.codehaus.plexus.classworlds.launcher.Launcher.launch(Launcher.java:239)
	at org.jvnet.hudson.maven3.agent.Maven3Main.launch(Maven3Main.java:158)
	at hudson.maven.Maven3Builder.call(Maven3Builder.java:98)
	at hudson.maven.Maven3Builder.call(Maven3Builder.java:64)
	at hudson.remoting.UserRequest.perform(UserRequest.java:118)
	at hudson.remoting.UserRequest.perform(UserRequest.java:48)
	at hudson.remoting.Request$2.run(Request.java:326)
	at hudson.remoting.InterceptingExecutorService$1.call(InterceptingExecutorService.java:72)
	at java.util.concurrent.FutureTask$Sync.innerRun(FutureTask.java:303)
	at java.util.concurrent.FutureTask.run(FutureTask.java:138)
	at java.util.concurrent.ThreadPoolExecutor$Worker.runTask(ThreadPoolExecutor.java:886)
	at java.util.concurrent.ThreadPoolExecutor$Worker.run(ThreadPoolExecutor.java:908)
	at java.lang.Thread.run(Thread.java:619)
Caused by: org.apache.maven.plugin.MojoExecutionException: Failed to resolve dependencies
for one or more projects in the reactor. Reason: Unable to get dependency information for
net.sf.saxon:saxon-xqj:jar:8.9: Failed to retrieve POM for net.sf.saxon:saxon-xqj:jar:8.9:
Could not transfer artifact net.sf.saxon:saxon-xqj:pom:8.9 from/to atlassian-developer-site
(http://maven.atlassian.com/repository/public): Error transferring file: Server returned HTTP
response code: 502 for URL: http://maven.atlassian.com/repository/public/net/sf/saxon/saxon-xqj/8.9/saxon-xqj-8.9.pom
  net.sf.saxon:saxon-xqj:jar:8.9

from the specified remote repositories:
  atlassian-developer-site (http://maven.atlassian.com/repository/public, releases=true, snapshots=false),
  wso2-m2 (http://dist.wso2.org/maven2/, releases=true, snapshots=false),
  wso2-m2-snapshots (http://dist.wso2.org/snapshots/maven2/, releases=false, snapshots=true),
  snmp4j-repo (https://server.oosnmp.net/dist/release/, releases=true, snapshots=false),
  Nexus (http://repository.apache.org/snapshots, releases=false, snapshots=true),
  central (http://repo1.maven.org/maven2, releases=true, snapshots=false)
Path to dependency: 
	1) org.apache.synapse:synapse-distribution:pom:2.2.0-SNAPSHOT
	2) org.apache.synapse:synapse-extensions:jar:2.2.0-SNAPSHOT


	at org.apache.maven.plugin.resources.remote.ProcessRemoteResourcesMojo.resolveProjectArtifacts(ProcessRemoteResourcesMojo.java:702)
	at org.apache.maven.plugin.resources.remote.ProcessRemoteResourcesMojo.getProjects(ProcessRemoteResourcesMojo.java:602)
	at org.apache.maven.plugin.resources.remote.ProcessRemoteResourcesMojo.configureVelocityContext(ProcessRemoteResourcesMojo.java:969)
	at org.apache.maven.plugin.resources.remote.ProcessRemoteResourcesMojo.execute(ProcessRemoteResourcesMojo.java:492)
	at org.apache.maven.plugin.DefaultBuildPluginManager.executeMojo(DefaultBuildPluginManager.java:101)
	at org.apache.maven.lifecycle.internal.MojoExecutor.execute(MojoExecutor.java:209)
	... 27 more
Caused by: org.apache.maven.artifact.resolver.ArtifactResolutionException: Unable to get dependency
information for net.sf.saxon:saxon-xqj:jar:8.9: Failed to retrieve POM for net.sf.saxon:saxon-xqj:jar:8.9:
Could not transfer artifact net.sf.saxon:saxon-xqj:pom:8.9 from/to atlassian-developer-site
(http://maven.atlassian.com/repository/public): Error transferring file: Server returned HTTP
response code: 502 for URL: http://maven.atlassian.com/repository/public/net/sf/saxon/saxon-xqj/8.9/saxon-xqj-8.9.pom
  net.sf.saxon:saxon-xqj:jar:8.9

from the specified remote repositories:
  atlassian-developer-site (http://maven.atlassian.com/repository/public, releases=true, snapshots=false),
  wso2-m2 (http://dist.wso2.org/maven2/, releases=true, snapshots=false),
  wso2-m2-snapshots (http://dist.wso2.org/snapshots/maven2/, releases=false, snapshots=true),
  snmp4j-repo (https://server.oosnmp.net/dist/release/, releases=true, snapshots=false),
  Nexus (http://repository.apache.org/snapshots, releases=false, snapshots=true),
  central (http://repo1.maven.org/maven2, releases=true, snapshots=false)
Path to dependency: 
	1) org.apache.synapse:synapse-distribution:pom:2.2.0-SNAPSHOT
	2) org.apache.synapse:synapse-extensions:jar:2.2.0-SNAPSHOT


	at org.apache.maven.repository.legacy.resolver.DefaultLegacyArtifactCollector.recurse(DefaultLegacyArtifactCollector.java:576)
	at org.apache.maven.repository.legacy.resolver.DefaultLegacyArtifactCollector.recurse(DefaultLegacyArtifactCollector.java:584)
	at org.apache.maven.repository.legacy.resolver.DefaultLegacyArtifactCollector.collect(DefaultLegacyArtifactCollector.java:144)
	at org.apache.maven.artifact.resolver.DefaultArtifactResolver.resolve(DefaultArtifactResolver.java:464)
	at org.apache.maven.artifact.resolver.DefaultArtifactResolver.resolveWithExceptions(DefaultArtifactResolver.java:320)
	at org.apache.maven.artifact.resolver.DefaultArtifactResolver.resolveTransitively(DefaultArtifactResolver.java:314)
	at org.apache.maven.artifact.resolver.DefaultArtifactResolver.resolveTransitively(DefaultArtifactResolver.java:293)
	at org.apache.maven.artifact.resolver.DefaultArtifactResolver.resolveTransitively(DefaultArtifactResolver.java:271)
	at org.apache.maven.shared.artifact.resolver.DefaultProjectDependenciesResolver.resolve(DefaultProjectDependenciesResolver.java:140)
	at org.apache.maven.shared.artifact.resolver.DefaultProjectDependenciesResolver.resolve(DefaultProjectDependenciesResolver.java:187)
	at org.apache.maven.plugin.resources.remote.ProcessRemoteResourcesMojo.resolveProjectArtifacts(ProcessRemoteResourcesMojo.java:697)
	... 32 more
Caused by: org.apache.maven.artifact.metadata.ArtifactMetadataRetrievalException: Failed to
retrieve POM for net.sf.saxon:saxon-xqj:jar:8.9: Could not transfer artifact net.sf.saxon:saxon-xqj:pom:8.9
from/to atlassian-developer-site (http://maven.atlassian.com/repository/public): Error transferring
file: Server returned HTTP response code: 502 for URL: http://maven.atlassian.com/repository/public/net/sf/saxon/saxon-xqj/8.9/saxon-xqj-8.9.pom
	at org.apache.maven.project.artifact.MavenMetadataSource.retrieveRelocatedProject(MavenMetadataSource.java:600)
	at org.apache.maven.project.artifact.MavenMetadataSource.retrieve(MavenMetadataSource.java:192)
	at org.apache.maven.repository.legacy.resolver.DefaultLegacyArtifactCollector.recurse(DefaultLegacyArtifactCollector.java:532)
	... 42 more
Caused by: org.sonatype.aether.resolution.ArtifactResolutionException: Could not transfer
artifact net.sf.saxon:saxon-xqj:pom:8.9 from/to atlassian-developer-site (http://maven.atlassian.com/repository/public):
Error transferring file: Server returned HTTP response code: 502 for URL: http://maven.atlassian.com/repository/public/net/sf/saxon/saxon-xqj/8.9/saxon-xqj-8.9.pom
	at org.sonatype.aether.impl.internal.DefaultArtifactResolver.resolve(DefaultArtifactResolver.java:541)
	at org.sonatype.aether.impl.internal.DefaultArtifactResolver.resolveArtifacts(DefaultArtifactResolver.java:220)
	at org.sonatype.aether.impl.internal.DefaultArtifactResolver.resolveArtifact(DefaultArtifactResolver.java:197)
	at org.sonatype.aether.impl.internal.DefaultRepositorySystem.resolveArtifact(DefaultRepositorySystem.java:323)
	at org.apache.maven.project.DefaultProjectBuilder.build(DefaultProjectBuilder.java:261)
	at org.apache.maven.project.DefaultProjectBuilder.build(DefaultProjectBuilder.java:243)
	at org.apache.maven.project.artifact.MavenMetadataSource.retrieveRelocatedProject(MavenMetadataSource.java:579)
	... 44 more
Caused by: org.sonatype.aether.transfer.ArtifactTransferException: Could not transfer artifact
net.sf.saxon:saxon-xqj:pom:8.9 from/to atlassian-developer-site (http://maven.atlassian.com/repository/public):
Error transferring file: Server returned HTTP response code: 502 for URL: http://maven.atlassian.com/repository/public/net/sf/saxon/saxon-xqj/8.9/saxon-xqj-8.9.pom
	at org.sonatype.aether.connector.wagon.WagonRepositoryConnector$4.wrap(WagonRepositoryConnector.java:949)
	at org.sonatype.aether.connector.wagon.WagonRepositoryConnector$4.wrap(WagonRepositoryConnector.java:940)
	at org.sonatype.aether.connector.wagon.WagonRepositoryConnector$GetTask.flush(WagonRepositoryConnector.java:695)
	at org.sonatype.aether.connector.wagon.WagonRepositoryConnector$GetTask.flush(WagonRepositoryConnector.java:689)
	at org.sonatype.aether.connector.wagon.WagonRepositoryConnector.get(WagonRepositoryConnector.java:445)
	at org.sonatype.aether.impl.internal.DefaultArtifactResolver.resolve(DefaultArtifactResolver.java:460)
	... 50 more
Caused by: org.apache.maven.wagon.TransferFailedException: Error transferring file: Server
returned HTTP response code: 502 for URL: http://maven.atlassian.com/repository/public/net/sf/saxon/saxon-xqj/8.9/saxon-xqj-8.9.pom
	at org.apache.maven.wagon.providers.http.LightweightHttpWagon.fillInputData(LightweightHttpWagon.java:143)
	at org.apache.maven.wagon.StreamWagon.getInputStream(StreamWagon.java:116)
	at org.apache.maven.wagon.StreamWagon.getIfNewer(StreamWagon.java:88)
	at org.apache.maven.wagon.StreamWagon.get(StreamWagon.java:61)
	at org.sonatype.aether.connector.wagon.WagonRepositoryConnector$GetTask.run(WagonRepositoryConnector.java:608)
	at org.sonatype.aether.util.concurrency.RunnableErrorForwarder$1.run(RunnableErrorForwarder.java:64)
	... 3 more
Caused by: java.io.IOException: Server returned HTTP response code: 502 for URL: http://maven.atlassian.com/repository/public/net/sf/saxon/saxon-xqj/8.9/saxon-xqj-8.9.pom
	at sun.reflect.NativeConstructorAccessorImpl.newInstance0(Native Method)
	at sun.reflect.NativeConstructorAccessorImpl.newInstance(NativeConstructorAccessorImpl.java:39)
	at sun.reflect.DelegatingConstructorAccessorImpl.newInstance(DelegatingConstructorAccessorImpl.java:27)
	at java.lang.reflect.Constructor.newInstance(Constructor.java:513)
	at sun.net.www.protocol.http.HttpURLConnection$6.run(HttpURLConnection.java:1368)
	at java.security.AccessController.doPrivileged(Native Method)
	at sun.net.www.protocol.http.HttpURLConnection.getChainedException(HttpURLConnection.java:1362)
	at sun.net.www.protocol.http.HttpURLConnection.getInputStream(HttpURLConnection.java:1016)
	at org.apache.maven.wagon.providers.http.LightweightHttpWagon.fillInputData(LightweightHttpWagon.java:122)
	... 8 more
Caused by: java.io.IOException: Server returned HTTP response code: 502 for URL: http://maven.atlassian.com/repository/public/net/sf/saxon/saxon-xqj/8.9/saxon-xqj-8.9.pom
	at sun.net.www.protocol.http.HttpURLConnection.getInputStream(HttpURLConnection.java:1313)
	at java.net.HttpURLConnection.getResponseCode(HttpURLConnection.java:373)
	at org.apache.maven.wagon.providers.http.LightweightHttpWagon.fillInputData(LightweightHttpWagon.java:115)
	... 8 more
Sending e-mails to: dev@synapse.apache.org
channel stopped
[locks-and-latches] Releasing all the locks
[locks-and-latches] All the locks released

---------------------------------------------------------------------
To unsubscribe, e-mail: dev-unsubscribe@synapse.apache.org
For additional commands, e-mail: dev-help@synapse.apache.org


Mime
View raw message