synapse-dev mailing list archives

Site index · List index
Message view « Date » · « Thread »
Top « Date » · « Thread »
From Apache Jenkins Server <jenk...@builds.apache.org>
Subject Build failed in Jenkins: Synapse - Trunk #4553
Date Tue, 18 Dec 2012 23:44:52 GMT
See <https://builds.apache.org/job/Synapse%20-%20Trunk/4553/>

------------------------------------------
[...truncated 3934 lines...]
Downloaded: http://dist.wso2.org/maven2/org/wso2/caching/wso2caching/3.5.0/wso2caching-3.5.0.pom
(8 KB at 45.5 KB/sec)
Downloading: http://dist.wso2.org/maven2/org/wso2/eventing/wso2eventing-api/2.1/wso2eventing-api-2.1.pom
Downloaded: http://dist.wso2.org/maven2/org/wso2/eventing/wso2eventing-api/2.1/wso2eventing-api-2.1.pom
(2 KB at 9.2 KB/sec)
Downloading: http://dist.wso2.org/maven2/org/wso2/eventing/wso2eventing-parent/2.1/wso2eventing-parent-2.1.pom
Downloaded: http://dist.wso2.org/maven2/org/wso2/eventing/wso2eventing-parent/2.1/wso2eventing-parent-2.1.pom
(2 KB at 19.5 KB/sec)
Downloading: http://dist.wso2.org/maven2/org/wso2/throttle/wso2throttle-core/3.2.1/wso2throttle-core-3.2.1.pom
Downloaded: http://dist.wso2.org/maven2/org/wso2/throttle/wso2throttle-core/3.2.1/wso2throttle-core-3.2.1.pom
(2 KB at 11.5 KB/sec)
Downloading: http://dist.wso2.org/maven2/org/wso2/throttle/wso2throttle-parent/3.2.1/wso2throttle-parent-3.2.1.pom
Downloaded: http://dist.wso2.org/maven2/org/wso2/throttle/wso2throttle-parent/3.2.1/wso2throttle-parent-3.2.1.pom
(8 KB at 65.8 KB/sec)
Downloading: http://dist.wso2.org/maven2/org/wso2/uri/template/wso2-uri-templates/1.0.0/wso2-uri-templates-1.0.0.pom
Downloaded: http://dist.wso2.org/maven2/org/wso2/uri/template/wso2-uri-templates/1.0.0/wso2-uri-templates-1.0.0.pom
(6 KB at 40.7 KB/sec)
Downloading: http://dist.wso2.org/maven2/quickfixj/quickfixj-all/1.4.0/quickfixj-all-1.4.0.pom
Downloading: https://server.oosnmp.net/dist/release/quickfixj/quickfixj-all/1.4.0/quickfixj-all-1.4.0.pom
Downloading: http://repo1.maven.org/maven2/quickfixj/quickfixj-all/1.4.0/quickfixj-all-1.4.0.pom
Downloading: http://dist.wso2.org/maven2/rhino/js/1.6R5/js-1.6R5.pom
Downloaded: http://dist.wso2.org/maven2/rhino/js/1.6R5/js-1.6R5.pom (786 B at 9.2 KB/sec)
Downloading: http://dist.wso2.org/maven2/wrapper/wrapper/3.2.3/wrapper-3.2.3.pom
Downloaded: http://dist.wso2.org/maven2/wrapper/wrapper/3.2.3/wrapper-3.2.3.pom (186 B at
2.0 KB/sec)
Downloading: http://dist.wso2.org/maven2/wsdl4j/wsdl4j/1.6.2/wsdl4j-1.6.2.pom
Downloading: https://server.oosnmp.net/dist/release/wsdl4j/wsdl4j/1.6.2/wsdl4j-1.6.2.pom
Downloading: http://repo1.maven.org/maven2/wsdl4j/wsdl4j/1.6.2/wsdl4j-1.6.2.pom
Downloaded: http://repo1.maven.org/maven2/wsdl4j/wsdl4j/1.6.2/wsdl4j-1.6.2.pom (939 B at 114.6
KB/sec)
Downloading: http://dist.wso2.org/maven2/xalan/xalan/2.7.1/xalan-2.7.1.pom
Downloaded: http://dist.wso2.org/maven2/xalan/xalan/2.7.1/xalan-2.7.1.pom (2 KB at 11.3 KB/sec)
Downloading: http://dist.wso2.org/maven2/xmlbeans/xbean/2.2.0/xbean-2.2.0.pom
Downloaded: http://dist.wso2.org/maven2/xmlbeans/xbean/2.2.0/xbean-2.2.0.pom (1002 B at 9.4
KB/sec)
Downloading: http://dist.wso2.org/maven2/de/schlichtherle/io/truezip/6.6/truezip-6.6.pom
Downloaded: http://dist.wso2.org/maven2/de/schlichtherle/io/truezip/6.6/truezip-6.6.pom (604
B at 3.6 KB/sec)
Downloading: http://dist.wso2.org/maven2/groovy/groovy-all/1.1-rc-1/groovy-all-1.1-rc-1.pom
Downloaded: http://dist.wso2.org/maven2/groovy/groovy-all/1.1-rc-1/groovy-all-1.1-rc-1.pom
(22 KB at 59.3 KB/sec)
Downloading: http://dist.wso2.org/maven2/junit/junit/3.8.2/junit-3.8.2.pom
Downloaded: http://dist.wso2.org/maven2/junit/junit/3.8.2/junit-3.8.2.pom (747 B at 10.3 KB/sec)
Downloading: http://dist.wso2.org/maven2/org/apache/activemq/activemq-core/5.2.0/activemq-core-5.2.0.pom
Downloading: https://server.oosnmp.net/dist/release/org/apache/activemq/activemq-core/5.2.0/activemq-core-5.2.0.pom
Downloading: http://repo1.maven.org/maven2/org/apache/activemq/activemq-core/5.2.0/activemq-core-5.2.0.pom
Downloaded: http://repo1.maven.org/maven2/org/apache/activemq/activemq-core/5.2.0/activemq-core-5.2.0.pom
(24 KB at 608.8 KB/sec)
Downloading: http://dist.wso2.org/maven2/org/apache/activemq/activemq-parent/5.2.0/activemq-parent-5.2.0.pom
Downloading: https://server.oosnmp.net/dist/release/org/apache/activemq/activemq-parent/5.2.0/activemq-parent-5.2.0.pom
Downloading: http://repo1.maven.org/maven2/org/apache/activemq/activemq-parent/5.2.0/activemq-parent-5.2.0.pom
Downloaded: http://repo1.maven.org/maven2/org/apache/activemq/activemq-parent/5.2.0/activemq-parent-5.2.0.pom
(45 KB at 2102.2 KB/sec)
Downloading: http://dist.wso2.org/snapshots/maven2/org/apache/axis2/axis2-transport-testkit/1.7.0-SNAPSHOT/maven-metadata.xml
Downloading: http://repository.apache.org/snapshots/org/apache/axis2/axis2-transport-testkit/1.7.0-SNAPSHOT/maven-metadata.xml
Downloaded: http://repository.apache.org/snapshots/org/apache/axis2/axis2-transport-testkit/1.7.0-SNAPSHOT/maven-metadata.xml
(377 B at 0.2 KB/sec)
Downloading: http://repository.apache.org/snapshots/org/apache/axis2/axis2-transport-testkit/1.7.0-SNAPSHOT/axis2-transport-testkit-1.7.0-20121218.180733-732.pom
Downloaded: http://repository.apache.org/snapshots/org/apache/axis2/axis2-transport-testkit/1.7.0-SNAPSHOT/axis2-transport-testkit-1.7.0-20121218.180733-732.pom
(10 KB at 35.1 KB/sec)
Downloading: http://dist.wso2.org/maven2/org/apache/derby/derby/10.4.2.0/derby-10.4.2.0.pom
Downloaded: http://dist.wso2.org/maven2/org/apache/derby/derby/10.4.2.0/derby-10.4.2.0.pom
(2 KB at 4.1 KB/sec)
Downloading: http://dist.wso2.org/maven2/org/apache/derby/derbyclient/10.4.2.0/derbyclient-10.4.2.0.pom
Downloading: https://server.oosnmp.net/dist/release/org/apache/derby/derbyclient/10.4.2.0/derbyclient-10.4.2.0.pom
Downloading: http://repo1.maven.org/maven2/org/apache/derby/derbyclient/10.4.2.0/derbyclient-10.4.2.0.pom
Downloaded: http://repo1.maven.org/maven2/org/apache/derby/derbyclient/10.4.2.0/derbyclient-10.4.2.0.pom
(2 KB at 22.2 KB/sec)
Downloading: http://dist.wso2.org/maven2/org/apache/derby/derbynet/10.4.2.0/derbynet-10.4.2.0.pom
Downloading: https://server.oosnmp.net/dist/release/org/apache/derby/derbynet/10.4.2.0/derbynet-10.4.2.0.pom
Downloading: http://repo1.maven.org/maven2/org/apache/derby/derbynet/10.4.2.0/derbynet-10.4.2.0.pom
Downloaded: http://repo1.maven.org/maven2/org/apache/derby/derbynet/10.4.2.0/derbynet-10.4.2.0.pom
(2 KB at 13.3 KB/sec)
Downloading: http://dist.wso2.org/maven2/org/apache/httpcomponents/httpclient/4.1/httpclient-4.1.pom
Downloading: https://server.oosnmp.net/dist/release/org/apache/httpcomponents/httpclient/4.1/httpclient-4.1.pom
Downloading: http://repo1.maven.org/maven2/org/apache/httpcomponents/httpclient/4.1/httpclient-4.1.pom
Downloaded: http://repo1.maven.org/maven2/org/apache/httpcomponents/httpclient/4.1/httpclient-4.1.pom
(6 KB at 81.9 KB/sec)
Downloading: http://dist.wso2.org/maven2/org/apache/httpcomponents/httpcomponents-client/4.1/httpcomponents-client-4.1.pom
Downloading: https://server.oosnmp.net/dist/release/org/apache/httpcomponents/httpcomponents-client/4.1/httpcomponents-client-4.1.pom
Downloading: http://repo1.maven.org/maven2/org/apache/httpcomponents/httpcomponents-client/4.1/httpcomponents-client-4.1.pom
Downloaded: http://repo1.maven.org/maven2/org/apache/httpcomponents/httpcomponents-client/4.1/httpcomponents-client-4.1.pom
(12 KB at 1836.6 KB/sec)
Downloading: http://dist.wso2.org/maven2/org/apache/httpcomponents/project/4.1.1/project-4.1.1.pom
Downloading: https://server.oosnmp.net/dist/release/org/apache/httpcomponents/project/4.1.1/project-4.1.1.pom
Downloading: http://repo1.maven.org/maven2/org/apache/httpcomponents/project/4.1.1/project-4.1.1.pom
Downloaded: http://repo1.maven.org/maven2/org/apache/httpcomponents/project/4.1.1/project-4.1.1.pom
(17 KB at 1819.4 KB/sec)
Downloading: http://dist.wso2.org/maven2/org/jruby/jruby-complete/1.3.0/jruby-complete-1.3.0.pom
Downloading: https://server.oosnmp.net/dist/release/org/jruby/jruby-complete/1.3.0/jruby-complete-1.3.0.pom
Downloading: http://repo1.maven.org/maven2/org/jruby/jruby-complete/1.3.0/jruby-complete-1.3.0.pom
Downloaded: http://repo1.maven.org/maven2/org/jruby/jruby-complete/1.3.0/jruby-complete-1.3.0.pom
(5 KB at 33.7 KB/sec)
Downloading: http://dist.wso2.org/maven2/org/jruby/shared/1.3.0/shared-1.3.0.pom
Downloading: https://server.oosnmp.net/dist/release/org/jruby/shared/1.3.0/shared-1.3.0.pom
Downloading: http://repo1.maven.org/maven2/org/jruby/shared/1.3.0/shared-1.3.0.pom
Downloaded: http://repo1.maven.org/maven2/org/jruby/shared/1.3.0/shared-1.3.0.pom (4 KB at
39.1 KB/sec)
Downloading: http://dist.wso2.org/maven2/xmlunit/xmlunit/1.3/xmlunit-1.3.pom
Downloading: https://server.oosnmp.net/dist/release/xmlunit/xmlunit/1.3/xmlunit-1.3.pom
Downloading: http://repo1.maven.org/maven2/xmlunit/xmlunit/1.3/xmlunit-1.3.pom
Downloaded: http://repo1.maven.org/maven2/xmlunit/xmlunit/1.3/xmlunit-1.3.pom (3 KB at 57.9
KB/sec)
[INFO] Generating "Dependencies" report    --- maven-project-info-reports-plugin:2.2
[INFO] Generating "Project License" report    --- maven-project-info-reports-plugin:2.2
[INFO] Generating "Project Modules" report    --- maven-project-info-reports-plugin:2.2
[INFO] Generating "Project Team" report    --- maven-project-info-reports-plugin:2.2
[INFO] Generating "Continuous Integration" report    --- maven-project-info-reports-plugin:2.2
mojoSucceeded org.apache.maven.plugins:maven-site-plugin:3.0(default-site)
[FINDBUGS] No report found for mojo site
[JENKINS] Archiving site from <https://builds.apache.org/job/Synapse%20-%20Trunk/ws/java/target/site>
to /home/hudson/hudson/jobs/Synapse - Trunk/site
Successfully loaded native POSIX impl.
projectSucceeded org.apache.synapse:Apache-Synapse:2.2.0-SNAPSHOT
projectStarted org.apache.synapse:synapse-securevault:2.2.0-SNAPSHOT
[INFO] Downloading: http://repo1.maven.org/maven2/org/apache/maven/plugins/maven-resources-plugin/2.5/maven-resources-plugin-2.5.jar
                                                                        
[INFO] ------------------------------------------------------------------------
[INFO] Building Apache Synapse - Secure Vault 2.2.0-SNAPSHOT
[INFO] ------------------------------------------------------------------------
Downloaded: http://repo1.maven.org/maven2/org/apache/maven/plugins/maven-resources-plugin/2.5/maven-resources-plugin-2.5.jar
(26 KB at 655.2 KB/sec)
Downloading: http://repo1.maven.org/maven2/org/apache/maven/plugins/maven-compiler-plugin/2.3.2/maven-compiler-plugin-2.3.2.jar
Downloaded: http://repo1.maven.org/maven2/org/apache/maven/plugins/maven-compiler-plugin/2.3.2/maven-compiler-plugin-2.3.2.jar
(29 KB at 3165.8 KB/sec)
Downloading: http://repo1.maven.org/maven2/org/apache/maven/plugins/maven-surefire-plugin/2.11/maven-surefire-plugin-2.11.jar
Downloaded: http://repo1.maven.org/maven2/org/apache/maven/plugins/maven-surefire-plugin/2.11/maven-surefire-plugin-2.11.jar
(31 KB at 733.0 KB/sec)
Downloading: http://dist.wso2.org/snapshots/maven2/org/apache/ws/commons/axiom/axiom-api/1.2.14-SNAPSHOT/axiom-api-1.2.14-SNAPSHOT.pom
Downloading: http://repository.apache.org/snapshots/org/apache/ws/commons/axiom/axiom-api/1.2.14-SNAPSHOT/axiom-api-1.2.14-SNAPSHOT.pom
[WARNING] The POM for org.apache.ws.commons.axiom:axiom-api:jar:1.2.14-SNAPSHOT is missing,
no dependency information available
Downloading: http://dist.wso2.org/snapshots/maven2/org/apache/ws/commons/axiom/axiom-impl/1.2.14-SNAPSHOT/axiom-impl-1.2.14-SNAPSHOT.pom
Downloading: http://repository.apache.org/snapshots/org/apache/ws/commons/axiom/axiom-impl/1.2.14-SNAPSHOT/axiom-impl-1.2.14-SNAPSHOT.pom
[WARNING] The POM for org.apache.ws.commons.axiom:axiom-impl:jar:1.2.14-SNAPSHOT is missing,
no dependency information available
Downloading: http://dist.wso2.org/snapshots/maven2/org/apache/ws/commons/axiom/axiom-api/1.2.14-SNAPSHOT/axiom-api-1.2.14-SNAPSHOT.jar
Downloading: http://dist.wso2.org/snapshots/maven2/org/apache/ws/commons/axiom/axiom-impl/1.2.14-SNAPSHOT/axiom-impl-1.2.14-SNAPSHOT.jar
Downloading: http://repository.apache.org/snapshots/org/apache/ws/commons/axiom/axiom-api/1.2.14-SNAPSHOT/axiom-api-1.2.14-SNAPSHOT.jar
Downloading: http://repository.apache.org/snapshots/org/apache/ws/commons/axiom/axiom-impl/1.2.14-SNAPSHOT/axiom-impl-1.2.14-SNAPSHOT.jar
Downloading: http://dist.wso2.org/maven2/log4j/log4j/1.2.14/log4j-1.2.14.jar
Downloading: http://dist.wso2.org/maven2/jline/jline/0.9.94/jline-0.9.94.jar
Downloading: http://dist.wso2.org/maven2/junit/junit/3.8.2/junit-3.8.2.jar
Downloading: http://dist.wso2.org/maven2/commons-cli/commons-cli/1.2/commons-cli-1.2.jar
Downloading: http://dist.wso2.org/maven2/commons-io/commons-io/2.1/commons-io-2.1.jar
Downloading: http://dist.wso2.org/maven2/commons-codec/commons-codec/1.6/commons-codec-1.6.jar
Downloaded: http://dist.wso2.org/maven2/junit/junit/3.8.2/junit-3.8.2.jar (118 KB at 665.6
KB/sec)
Downloaded: http://dist.wso2.org/maven2/jline/jline/0.9.94/jline-0.9.94.jar (86 KB at 479.1
KB/sec)
Downloaded: http://dist.wso2.org/maven2/log4j/log4j/1.2.14/log4j-1.2.14.jar (359 KB at 1594.8
KB/sec)
Downloading: https://server.oosnmp.net/dist/release/commons-cli/commons-cli/1.2/commons-cli-1.2.jar
Downloading: https://server.oosnmp.net/dist/release/commons-io/commons-io/2.1/commons-io-2.1.jar
Downloading: https://server.oosnmp.net/dist/release/commons-codec/commons-codec/1.6/commons-codec-1.6.jar
Downloading: http://repo1.maven.org/maven2/commons-cli/commons-cli/1.2/commons-cli-1.2.jar
Downloading: http://repo1.maven.org/maven2/commons-io/commons-io/2.1/commons-io-2.1.jar
Downloading: http://repo1.maven.org/maven2/commons-codec/commons-codec/1.6/commons-codec-1.6.jar
Downloaded: http://repo1.maven.org/maven2/commons-cli/commons-cli/1.2/commons-cli-1.2.jar
(41 KB at 1606.4 KB/sec)
Downloaded: http://repo1.maven.org/maven2/commons-codec/commons-codec/1.6/commons-codec-1.6.jar
(228 KB at 6314.3 KB/sec)
Downloaded: http://repo1.maven.org/maven2/commons-io/commons-io/2.1/commons-io-2.1.jar (160
KB at 4306.1 KB/sec)
projectFailed org.apache.synapse:synapse-securevault:2.2.0-SNAPSHOT
sessionEnded
[INFO] ------------------------------------------------------------------------
[INFO] Reactor Summary:
[INFO] 
[INFO] Apache Synapse .................................... SUCCESS [1:45.608s]
[INFO] Apache Synapse - Secure Vault ..................... FAILURE [1.429s]
[INFO] Apache Synapse - Commons .......................... SKIPPED
[INFO] Apache Synapse - Transports ....................... SKIPPED
[INFO] Apache Synapse - Non-blocking HTTP/s Transport .... SKIPPED
[INFO] Apache Synapse - PIPE Transport ................... SKIPPED
[INFO] Apache Synapse - VFS Transport .................... SKIPPED
[INFO] Apache Synapse - FIX Transport .................... SKIPPED
[INFO] Apache Synapse - Tasks ............................ SKIPPED
[INFO] Apache Synapse - Core ............................. SKIPPED
[INFO] Apache Synapse - Extensions ....................... SKIPPED
[INFO] Apache Synapse - Samples .......................... SKIPPED
[INFO] Apache Synapse - Patches .......................... SKIPPED
[INFO] Apache Synapse - Experimental code ................ SKIPPED
[INFO] Apache Synapse - Documentation .................... SKIPPED
[INFO] Apache Synapse - Web Application .................. SKIPPED
[INFO] Apache Synapse - Handler Module ................... SKIPPED
[INFO] Apache Synapse - XAR Maven Plugin ................. SKIPPED
[INFO] Apache Synapse - Configuration Migrator ........... SKIPPED
[INFO] Apache Synapse - Distribution ..................... SKIPPED
[INFO] Apache Synapse - Package skeleton ZIP ............. SKIPPED
[INFO] Apache Synapse - Package archetype ................ SKIPPED
[INFO] Apache Synapse - Integration ...................... SKIPPED
[INFO] ------------------------------------------------------------------------
[INFO] BUILD FAILURE
[INFO] ------------------------------------------------------------------------
[INFO] Total time: 1:53.318s
[INFO] Finished at: Tue Dec 18 23:44:34 UTC 2012
[INFO] Final Memory: 24M/122M
[INFO] ------------------------------------------------------------------------
Projects to build: [MavenProject: org.apache.synapse:Apache-Synapse:2.2.0-SNAPSHOT @ <https://builds.apache.org/job/Synapse%20-%20Trunk/ws/java/pom.xml,>
MavenProject: org.apache.synapse:synapse-securevault:2.2.0-SNAPSHOT @ <https://builds.apache.org/job/Synapse%20-%20Trunk/ws/java/modules/securevault/pom.xml,>
MavenProject: org.apache.synapse:synapse-commons:2.2.0-SNAPSHOT @ <https://builds.apache.org/job/Synapse%20-%20Trunk/ws/java/modules/commons/pom.xml,>
MavenProject: org.apache.synapse:synapse-transports:2.2.0-SNAPSHOT @ <https://builds.apache.org/job/Synapse%20-%20Trunk/ws/java/modules/transports/pom.xml,>
MavenProject: org.apache.synapse:synapse-nhttp-transport:2.2.0-SNAPSHOT @ <https://builds.apache.org/job/Synapse%20-%20Trunk/ws/java/modules/transports/core/nhttp/pom.xml,>
MavenProject: org.apache.synapse:synapse-pipe-transport:2.2.0-SNAPSHOT @ <https://builds.apache.org/job/Synapse%20-%20Trunk/ws/java/modules/transports/core/pipe/pom.xml,>
MavenProject: org.apache.synapse:synapse-vfs-transport:2.2.0-SNAPSHOT @ <https://builds.apache.org/job/Synapse%20-%20Trunk/ws/java/modules/transports/core/vfs/pom.xml,>
MavenProject: org.apache.synapse:synapse-fix-transport:2.2.0-SNAPSHOT @ <https://builds.apache.org/job/Synapse%20-%20Trunk/ws/java/modules/transports/optional/fix/pom.xml,>
MavenProject: org.apache.synapse:synapse-tasks:2.2.0-SNAPSHOT @ <https://builds.apache.org/job/Synapse%20-%20Trunk/ws/java/modules/tasks/pom.xml,>
MavenProject: org.apache.synapse:synapse-core:2.2.0-SNAPSHOT @ <https://builds.apache.org/job/Synapse%20-%20Trunk/ws/java/modules/core/pom.xml,>
MavenProject: org.apache.synapse:synapse-extensions:2.2.0-SNAPSHOT @ <https://builds.apache.org/job/Synapse%20-%20Trunk/ws/java/modules/extensions/pom.xml,>
MavenProject: org.apache.synapse:synapse-samples:2.2.0-SNAPSHOT @ <https://builds.apache.org/job/Synapse%20-%20Trunk/ws/java/modules/samples/pom.xml,>
MavenProject: org.apache.synapse:synapse-patches:2.2.0-SNAPSHOT @ <https://builds.apache.org/job/Synapse%20-%20Trunk/ws/java/modules/patches/pom.xml,>
MavenProject: org.apache.synapse:synapse-experimental:2.2.0-SNAPSHOT @ <https://builds.apache.org/job/Synapse%20-%20Trunk/ws/java/modules/experimental/pom.xml,>
MavenProject: org.apache.synapse:synapse-documentation:2.2.0-SNAPSHOT @ <https://builds.apache.org/job/Synapse%20-%20Trunk/ws/java/modules/documentation/pom.xml,>
MavenProject: org.apache.synapse:synapse-war:2.2.0-SNAPSHOT @ <https://builds.apache.org/job/Synapse%20-%20Trunk/ws/java/modules/war/pom.xml,>
MavenProject: org.apache.synapse:synapse-handler:2.2.0-SNAPSHOT @ <https://builds.apache.org/job/Synapse%20-%20Trunk/ws/java/modules/handler/pom.xml,>
MavenProject: org.apache.synapse:synapse-xar-maven-plugin:2.2.0-SNAPSHOT @ <https://builds.apache.org/job/Synapse%20-%20Trunk/ws/java/modules/xar-maven-plugin/pom.xml,>
MavenProject: org.apache.synapse:synapse-config-migrator:2.2.0-SNAPSHOT @ <https://builds.apache.org/job/Synapse%20-%20Trunk/ws/java/modules/migrator/pom.xml,>
MavenProject: org.apache.synapse:synapse-distribution:2.2.0-SNAPSHOT @ <https://builds.apache.org/job/Synapse%20-%20Trunk/ws/java/modules/distribution/pom.xml,>
MavenProject: org.apache.synapse:synapse-package-skeleton:2.2.0-SNAPSHOT @ <https://builds.apache.org/job/Synapse%20-%20Trunk/ws/java/modules/packaging/package-skeleton/pom.xml,>
MavenProject: org.apache.synapse:synapse-package-archetype:2.2.0-SNAPSHOT @ <https://builds.apache.org/job/Synapse%20-%20Trunk/ws/java/modules/packaging/package-archetype/pom.xml,>
MavenProject: org.apache.synapse:synapse-integration:2.2.0-SNAPSHOT @ <https://builds.apache.org/job/Synapse%20-%20Trunk/ws/java/modules/integration/pom.xml]>
[JENKINS] Archiving <https://builds.apache.org/job/Synapse%20-%20Trunk/ws/java/modules/migrator/pom.xml>
to /home/hudson/hudson/jobs/Synapse - Trunk/modules/org.apache.synapse$synapse-config-migrator/builds/2012-12-18_23-42-24/archive/org.apache.synapse/synapse-config-migrator/2.2.0-SNAPSHOT/synapse-config-migrator-2.2.0-SNAPSHOT.pom
[JENKINS] Archiving <https://builds.apache.org/job/Synapse%20-%20Trunk/ws/java/modules/core/pom.xml>
to /home/hudson/hudson/jobs/Synapse - Trunk/modules/org.apache.synapse$synapse-core/builds/2012-12-18_23-42-23/archive/org.apache.synapse/synapse-core/2.2.0-SNAPSHOT/synapse-core-2.2.0-SNAPSHOT.pom
[JENKINS] Archiving <https://builds.apache.org/job/Synapse%20-%20Trunk/ws/java/modules/integration/pom.xml>
to /home/hudson/hudson/jobs/Synapse - Trunk/modules/org.apache.synapse$synapse-integration/builds/2012-12-18_23-42-24/archive/org.apache.synapse/synapse-integration/2.2.0-SNAPSHOT/synapse-integration-2.2.0-SNAPSHOT.pom
[JENKINS] Archiving <https://builds.apache.org/job/Synapse%20-%20Trunk/ws/java/modules/packaging/package-skeleton/pom.xml>
to /home/hudson/hudson/jobs/Synapse - Trunk/modules/org.apache.synapse$synapse-package-skeleton/builds/2012-12-18_23-42-24/archive/org.apache.synapse/synapse-package-skeleton/2.2.0-SNAPSHOT/synapse-package-skeleton-2.2.0-SNAPSHOT.pom
[JENKINS] Archiving <https://builds.apache.org/job/Synapse%20-%20Trunk/ws/java/modules/securevault/pom.xml>
to /home/hudson/hudson/jobs/Synapse - Trunk/modules/org.apache.synapse$synapse-securevault/builds/2012-12-18_23-42-23/archive/org.apache.synapse/synapse-securevault/2.2.0-SNAPSHOT/synapse-securevault-2.2.0-SNAPSHOT.pom
[JENKINS] Archiving <https://builds.apache.org/job/Synapse%20-%20Trunk/ws/java/modules/packaging/package-archetype/pom.xml>
to /home/hudson/hudson/jobs/Synapse - Trunk/modules/org.apache.synapse$synapse-package-archetype/builds/2012-12-18_23-42-24/archive/org.apache.synapse/synapse-package-archetype/2.2.0-SNAPSHOT/synapse-package-archetype-2.2.0-SNAPSHOT.pom
[JENKINS] Archiving <https://builds.apache.org/job/Synapse%20-%20Trunk/ws/java/modules/commons/pom.xml>
to /home/hudson/hudson/jobs/Synapse - Trunk/modules/org.apache.synapse$synapse-commons/builds/2012-12-18_23-42-23/archive/org.apache.synapse/synapse-commons/2.2.0-SNAPSHOT/synapse-commons-2.2.0-SNAPSHOT.pom
[JENKINS] Archiving <https://builds.apache.org/job/Synapse%20-%20Trunk/ws/java/modules/extensions/pom.xml>
to /home/hudson/hudson/jobs/Synapse - Trunk/modules/org.apache.synapse$synapse-extensions/builds/2012-12-18_23-42-23/archive/org.apache.synapse/synapse-extensions/2.2.0-SNAPSHOT/synapse-extensions-2.2.0-SNAPSHOT.pom
[JENKINS] Archiving <https://builds.apache.org/job/Synapse%20-%20Trunk/ws/java/modules/samples/pom.xml>
to /home/hudson/hudson/jobs/Synapse - Trunk/modules/org.apache.synapse$synapse-samples/builds/2012-12-18_23-42-23/archive/org.apache.synapse/synapse-samples/2.2.0-SNAPSHOT/synapse-samples-2.2.0-SNAPSHOT.pom
[JENKINS] Archiving <https://builds.apache.org/job/Synapse%20-%20Trunk/ws/java/modules/xar-maven-plugin/pom.xml>
to /home/hudson/hudson/jobs/Synapse - Trunk/modules/org.apache.synapse$synapse-xar-maven-plugin/builds/2012-12-18_23-42-24/archive/org.apache.synapse/synapse-xar-maven-plugin/2.2.0-SNAPSHOT/synapse-xar-maven-plugin-2.2.0-SNAPSHOT.pom
[JENKINS] Archiving <https://builds.apache.org/job/Synapse%20-%20Trunk/ws/java/modules/documentation/pom.xml>
to /home/hudson/hudson/jobs/Synapse - Trunk/modules/org.apache.synapse$synapse-documentation/builds/2012-12-18_23-42-24/archive/org.apache.synapse/synapse-documentation/2.2.0-SNAPSHOT/synapse-documentation-2.2.0-SNAPSHOT.pom
[JENKINS] Archiving <https://builds.apache.org/job/Synapse%20-%20Trunk/ws/java/modules/transports/core/nhttp/pom.xml>
to /home/hudson/hudson/jobs/Synapse - Trunk/modules/org.apache.synapse$synapse-nhttp-transport/builds/2012-12-18_23-42-23/archive/org.apache.synapse/synapse-nhttp-transport/2.2.0-SNAPSHOT/synapse-nhttp-transport-2.2.0-SNAPSHOT.pom
[JENKINS] Archiving <https://builds.apache.org/job/Synapse%20-%20Trunk/ws/java/modules/transports/core/pipe/pom.xml>
to /home/hudson/hudson/jobs/Synapse - Trunk/modules/org.apache.synapse$synapse-pipe-transport/builds/2012-12-18_23-42-23/archive/org.apache.synapse/synapse-pipe-transport/2.2.0-SNAPSHOT/synapse-pipe-transport-2.2.0-SNAPSHOT.pom
[JENKINS] Archiving <https://builds.apache.org/job/Synapse%20-%20Trunk/ws/java/modules/transports/optional/fix/pom.xml>
to /home/hudson/hudson/jobs/Synapse - Trunk/modules/org.apache.synapse$synapse-fix-transport/builds/2012-12-18_23-42-23/archive/org.apache.synapse/synapse-fix-transport/2.2.0-SNAPSHOT/synapse-fix-transport-2.2.0-SNAPSHOT.pom
[JENKINS] Archiving <https://builds.apache.org/job/Synapse%20-%20Trunk/ws/java/modules/transports/pom.xml>
to /home/hudson/hudson/jobs/Synapse - Trunk/modules/org.apache.synapse$synapse-transports/builds/2012-12-18_23-42-23/archive/org.apache.synapse/synapse-transports/2.2.0-SNAPSHOT/synapse-transports-2.2.0-SNAPSHOT.pom
[JENKINS] Archiving <https://builds.apache.org/job/Synapse%20-%20Trunk/ws/java/modules/war/pom.xml>
to /home/hudson/hudson/jobs/Synapse - Trunk/modules/org.apache.synapse$synapse-war/builds/2012-12-18_23-42-24/archive/org.apache.synapse/synapse-war/2.2.0-SNAPSHOT/synapse-war-2.2.0-SNAPSHOT.pom
[JENKINS] Archiving <https://builds.apache.org/job/Synapse%20-%20Trunk/ws/java/pom.xml>
to /home/hudson/hudson/jobs/Synapse - Trunk/modules/org.apache.synapse$Apache-Synapse/builds/2012-12-18_23-42-23/archive/org.apache.synapse/Apache-Synapse/2.2.0-SNAPSHOT/Apache-Synapse-2.2.0-SNAPSHOT.pom
[JENKINS] Archiving <https://builds.apache.org/job/Synapse%20-%20Trunk/ws/java/modules/transports/core/vfs/pom.xml>
to /home/hudson/hudson/jobs/Synapse - Trunk/modules/org.apache.synapse$synapse-vfs-transport/builds/2012-12-18_23-42-23/archive/org.apache.synapse/synapse-vfs-transport/2.2.0-SNAPSHOT/synapse-vfs-transport-2.2.0-SNAPSHOT.pom
[JENKINS] Archiving <https://builds.apache.org/job/Synapse%20-%20Trunk/ws/java/modules/patches/pom.xml>
to /home/hudson/hudson/jobs/Synapse - Trunk/modules/org.apache.synapse$synapse-patches/builds/2012-12-18_23-42-23/archive/org.apache.synapse/synapse-patches/2.2.0-SNAPSHOT/synapse-patches-2.2.0-SNAPSHOT.pom
[JENKINS] Archiving <https://builds.apache.org/job/Synapse%20-%20Trunk/ws/java/modules/experimental/pom.xml>
to /home/hudson/hudson/jobs/Synapse - Trunk/modules/org.apache.synapse$synapse-experimental/builds/2012-12-18_23-42-24/archive/org.apache.synapse/synapse-experimental/2.2.0-SNAPSHOT/synapse-experimental-2.2.0-SNAPSHOT.pom
[JENKINS] Archiving <https://builds.apache.org/job/Synapse%20-%20Trunk/ws/java/modules/tasks/pom.xml>
to /home/hudson/hudson/jobs/Synapse - Trunk/modules/org.apache.synapse$synapse-tasks/builds/2012-12-18_23-42-23/archive/org.apache.synapse/synapse-tasks/2.2.0-SNAPSHOT/synapse-tasks-2.2.0-SNAPSHOT.pom
[JENKINS] Archiving <https://builds.apache.org/job/Synapse%20-%20Trunk/ws/java/modules/handler/pom.xml>
to /home/hudson/hudson/jobs/Synapse - Trunk/modules/org.apache.synapse$synapse-handler/builds/2012-12-18_23-42-24/archive/org.apache.synapse/synapse-handler/2.2.0-SNAPSHOT/synapse-handler-2.2.0-SNAPSHOT.pom
[JENKINS] Archiving <https://builds.apache.org/job/Synapse%20-%20Trunk/ws/java/modules/distribution/pom.xml>
to /home/hudson/hudson/jobs/Synapse - Trunk/modules/org.apache.synapse$synapse-distribution/builds/2012-12-18_23-42-24/archive/org.apache.synapse/synapse-distribution/2.2.0-SNAPSHOT/synapse-distribution-2.2.0-SNAPSHOT.pom
Waiting for Jenkins to finish collecting data
mavenExecutionResult exceptions not empty
message : Failed to execute goal on project synapse-securevault: Could not resolve dependencies
for project org.apache.synapse:synapse-securevault:bundle:2.2.0-SNAPSHOT: The following artifacts
could not be resolved: org.apache.ws.commons.axiom:axiom-api:jar:1.2.14-SNAPSHOT, org.apache.ws.commons.axiom:axiom-impl:jar:1.2.14-SNAPSHOT:
Could not find artifact org.apache.ws.commons.axiom:axiom-api:jar:1.2.14-SNAPSHOT in wso2-m2-snapshots
(http://dist.wso2.org/snapshots/maven2/)
cause : Could not resolve dependencies for project org.apache.synapse:synapse-securevault:bundle:2.2.0-SNAPSHOT:
The following artifacts could not be resolved: org.apache.ws.commons.axiom:axiom-api:jar:1.2.14-SNAPSHOT,
org.apache.ws.commons.axiom:axiom-impl:jar:1.2.14-SNAPSHOT: Could not find artifact org.apache.ws.commons.axiom:axiom-api:jar:1.2.14-SNAPSHOT
in wso2-m2-snapshots (http://dist.wso2.org/snapshots/maven2/)
Stack trace : 
org.apache.maven.lifecycle.LifecycleExecutionException: Failed to execute goal on project
synapse-securevault: Could not resolve dependencies for project org.apache.synapse:synapse-securevault:bundle:2.2.0-SNAPSHOT:
The following artifacts could not be resolved: org.apache.ws.commons.axiom:axiom-api:jar:1.2.14-SNAPSHOT,
org.apache.ws.commons.axiom:axiom-impl:jar:1.2.14-SNAPSHOT: Could not find artifact org.apache.ws.commons.axiom:axiom-api:jar:1.2.14-SNAPSHOT
in wso2-m2-snapshots (http://dist.wso2.org/snapshots/maven2/)
	at org.apache.maven.lifecycle.internal.LifecycleDependencyResolver.getDependencies(LifecycleDependencyResolver.java:196)
	at org.apache.maven.lifecycle.internal.LifecycleDependencyResolver.resolveProjectDependencies(LifecycleDependencyResolver.java:108)
	at org.apache.maven.lifecycle.internal.MojoExecutor.ensureDependenciesAreResolved(MojoExecutor.java:258)
	at org.apache.maven.lifecycle.internal.MojoExecutor.execute(MojoExecutor.java:201)
	at org.apache.maven.lifecycle.internal.MojoExecutor.execute(MojoExecutor.java:153)
	at org.apache.maven.lifecycle.internal.MojoExecutor.execute(MojoExecutor.java:145)
	at org.apache.maven.lifecycle.internal.LifecycleModuleBuilder.buildProject(LifecycleModuleBuilder.java:84)
	at org.apache.maven.lifecycle.internal.LifecycleModuleBuilder.buildProject(LifecycleModuleBuilder.java:59)
	at org.apache.maven.lifecycle.internal.LifecycleStarter.singleThreadedBuild(LifecycleStarter.java:183)
	at org.apache.maven.lifecycle.internal.LifecycleStarter.execute(LifecycleStarter.java:161)
	at org.apache.maven.DefaultMaven.doExecute(DefaultMaven.java:319)
	at org.apache.maven.DefaultMaven.execute(DefaultMaven.java:156)
	at org.jvnet.hudson.maven3.launcher.Maven3Launcher.main(Maven3Launcher.java:79)
	at sun.reflect.NativeMethodAccessorImpl.invoke0(Native Method)
	at sun.reflect.NativeMethodAccessorImpl.invoke(NativeMethodAccessorImpl.java:39)
	at sun.reflect.DelegatingMethodAccessorImpl.invoke(DelegatingMethodAccessorImpl.java:25)
	at java.lang.reflect.Method.invoke(Method.java:597)
	at org.codehaus.plexus.classworlds.launcher.Launcher.launchStandard(Launcher.java:329)
	at org.codehaus.plexus.classworlds.launcher.Launcher.launch(Launcher.java:239)
	at org.jvnet.hudson.maven3.agent.Maven3Main.launch(Maven3Main.java:158)
	at hudson.maven.Maven3Builder.call(Maven3Builder.java:98)
	at hudson.maven.Maven3Builder.call(Maven3Builder.java:64)
	at hudson.remoting.UserRequest.perform(UserRequest.java:118)
	at hudson.remoting.UserRequest.perform(UserRequest.java:48)
	at hudson.remoting.Request$2.run(Request.java:326)
	at hudson.remoting.InterceptingExecutorService$1.call(InterceptingExecutorService.java:72)
	at java.util.concurrent.FutureTask$Sync.innerRun(FutureTask.java:303)
	at java.util.concurrent.FutureTask.run(FutureTask.java:138)
	at java.util.concurrent.ThreadPoolExecutor$Worker.runTask(ThreadPoolExecutor.java:886)
	at java.util.concurrent.ThreadPoolExecutor$Worker.run(ThreadPoolExecutor.java:908)
	at java.lang.Thread.run(Thread.java:619)
Caused by: org.apache.maven.project.DependencyResolutionException: Could not resolve dependencies
for project org.apache.synapse:synapse-securevault:bundle:2.2.0-SNAPSHOT: The following artifacts
could not be resolved: org.apache.ws.commons.axiom:axiom-api:jar:1.2.14-SNAPSHOT, org.apache.ws.commons.axiom:axiom-impl:jar:1.2.14-SNAPSHOT:
Could not find artifact org.apache.ws.commons.axiom:axiom-api:jar:1.2.14-SNAPSHOT in wso2-m2-snapshots
(http://dist.wso2.org/snapshots/maven2/)
	at org.apache.maven.project.DefaultProjectDependenciesResolver.resolve(DefaultProjectDependenciesResolver.java:170)
	at org.apache.maven.lifecycle.internal.LifecycleDependencyResolver.getDependencies(LifecycleDependencyResolver.java:171)
	... 30 more
Caused by: org.sonatype.aether.resolution.DependencyResolutionException: The following artifacts
could not be resolved: org.apache.ws.commons.axiom:axiom-api:jar:1.2.14-SNAPSHOT, org.apache.ws.commons.axiom:axiom-impl:jar:1.2.14-SNAPSHOT:
Could not find artifact org.apache.ws.commons.axiom:axiom-api:jar:1.2.14-SNAPSHOT in wso2-m2-snapshots
(http://dist.wso2.org/snapshots/maven2/)
	at org.sonatype.aether.impl.internal.DefaultRepositorySystem.resolveDependencies(DefaultRepositorySystem.java:412)
	at org.apache.maven.project.DefaultProjectDependenciesResolver.resolve(DefaultProjectDependenciesResolver.java:164)
	... 31 more
Caused by: org.sonatype.aether.resolution.ArtifactResolutionException: The following artifacts
could not be resolved: org.apache.ws.commons.axiom:axiom-api:jar:1.2.14-SNAPSHOT, org.apache.ws.commons.axiom:axiom-impl:jar:1.2.14-SNAPSHOT:
Could not find artifact org.apache.ws.commons.axiom:axiom-api:jar:1.2.14-SNAPSHOT in wso2-m2-snapshots
(http://dist.wso2.org/snapshots/maven2/)
	at org.sonatype.aether.impl.internal.DefaultArtifactResolver.resolve(DefaultArtifactResolver.java:541)
	at org.sonatype.aether.impl.internal.DefaultArtifactResolver.resolveArtifacts(DefaultArtifactResolver.java:220)
	at org.sonatype.aether.impl.internal.DefaultRepositorySystem.resolveDependencies(DefaultRepositorySystem.java:395)
	... 32 more
Caused by: org.sonatype.aether.transfer.ArtifactNotFoundException: Could not find artifact
org.apache.ws.commons.axiom:axiom-api:jar:1.2.14-SNAPSHOT in wso2-m2-snapshots (http://dist.wso2.org/snapshots/maven2/)
	at org.sonatype.aether.connector.wagon.WagonRepositoryConnector$4.wrap(WagonRepositoryConnector.java:945)
	at org.sonatype.aether.connector.wagon.WagonRepositoryConnector$4.wrap(WagonRepositoryConnector.java:940)
	at org.sonatype.aether.connector.wagon.WagonRepositoryConnector$GetTask.flush(WagonRepositoryConnector.java:695)
	at org.sonatype.aether.connector.wagon.WagonRepositoryConnector$GetTask.flush(WagonRepositoryConnector.java:689)
	at org.sonatype.aether.connector.wagon.WagonRepositoryConnector.get(WagonRepositoryConnector.java:445)
	at org.sonatype.aether.impl.internal.DefaultArtifactResolver.resolve(DefaultArtifactResolver.java:460)
	... 34 more
Sending e-mails to: dev@synapse.apache.org
channel stopped
[locks-and-latches] Releasing all the locks
[locks-and-latches] All the locks released

---------------------------------------------------------------------
To unsubscribe, e-mail: dev-unsubscribe@synapse.apache.org
For additional commands, e-mail: dev-help@synapse.apache.org


Mime
View raw message