synapse-dev mailing list archives

Site index · List index
Message view « Date » · « Thread »
Top « Date » · « Thread »
From Apache Jenkins Server <jenk...@builds.apache.org>
Subject Build failed in Jenkins: Synapse - Trunk #4675
Date Sat, 03 Aug 2013 01:49:03 GMT
See <https://builds.apache.org/job/Synapse%20-%20Trunk/4675/changes>

Changes:

[hiranya] Adding a JMX MBean to monitor the synapse call back store - SYNAPSE-528

------------------------------------------
[...truncated 8870 lines...]
	at java.util.concurrent.ThreadPoolExecutor$Worker.run(ThreadPoolExecutor.java:908)
	at java.lang.Thread.run(Thread.java:619)
2013-08-03 01:48:20,224 [-] [main]  INFO Sample10001 An exception was thrown as expected.
2013-08-03 01:48:20,224 [-] [main]  INFO Sample10001 Sample 10001 is finished
2013-08-03 01:48:20,224 [-] [synapse10001]  INFO SynapseProcessController Shutting down Synapse...
2013-08-03 01:48:20,224 [-] [synapse10001]  INFO SynapseTaskManager Shutting down the task
manager
2013-08-03 01:48:20,224 [-] [synapse10001]  INFO PassThroughHttpSSLListener Stopping pass-through
HTTPS listener..
2013-08-03 01:48:20,224 [-] [PassThroughHTTPSListener]  INFO PassThroughHttpSSLListener HTTPS
listener shutdown.
2013-08-03 01:48:20,224 [-] [synapse10001]  INFO PassThroughHttpListener Stopping pass-through
HTTP listener..
2013-08-03 01:48:20,225 [-] [PassThroughHTTPListener]  INFO PassThroughHttpListener HTTP listener
shutdown.
2013-08-03 01:48:20,225 [-] [PassThroughHTTPSSender]  INFO PassThroughHttpSSLSender HTTPS
sender shutdown
2013-08-03 01:48:20,226 [-] [PassThroughHTTPSender]  INFO PassThroughHttpSender HTTP sender
shutdown
2013-08-03 01:48:20,226 [-] [synapse10001]  INFO Axis2SynapseController Undeploying the Synapse
service...
2013-08-03 01:48:20,226 [-] [synapse10001]  INFO Axis2SynapseController Undeploying Proxy
services...
2013-08-03 01:48:20,226 [-] [synapse10001]  INFO Axis2SynapseController Undeploying EventSources...
2013-08-03 01:48:20,227 [-] [synapse10001]  INFO API Destroying API: StockQuoteAPI
2013-08-03 01:48:20,227 [-] [synapse10001]  INFO PassThroughHttpSSLListener Destroying pass-through
HTTPS listener
2013-08-03 01:48:20,227 [-] [synapse10001]  INFO PassThroughHttpListener Destroying pass-through
HTTP listener
2013-08-03 01:48:20,227 [-] [main]  INFO Sample10001 Stopping Server: 0
2013-08-03 01:48:20,227 [-] [axis2-0]  INFO Axis2BackEndServerController Shutting down Axis2
server...
2013-08-03 01:48:20,228 [-] [HttpCoreNIOListener]  INFO HttpCoreNIOListener HTTPS Listener
Shutdown
2013-08-03 01:48:20,229 [-] [HttpCoreNIOListener]  INFO HttpCoreNIOListener HTTP Listener
Shutdown
2013-08-03 01:48:20,229 [-] [HttpCoreNIOSender]  INFO HttpCoreNIOSender HTTPS Sender Shutdown
2013-08-03 01:48:20,230 [-] [HttpCoreNIOSender]  INFO HttpCoreNIOSender HTTP Sender Shutdown
Tests run: 64, Failures: 0, Errors: 0, Skipped: 0, Time elapsed: 111.68 sec

Results :

Tests run: 64, Failures: 0, Errors: 0, Skipped: 0

[JENKINS] Recording test results
[INFO] [jar:jar {execution: default-jar}]
[INFO] Building jar: <https://builds.apache.org/job/Synapse%20-%20Trunk/ws/java/modules/integration/target/synapse-integration-2.2.0-SNAPSHOT.jar>
[INFO] [install:install {execution: default-install}]
[INFO] Installing <https://builds.apache.org/job/Synapse%20-%20Trunk/ws/java/modules/integration/target/synapse-integration-2.2.0-SNAPSHOT.jar>
to <https://builds.apache.org/job/Synapse%20-%20Trunk/ws/.repository/org/apache/synapse/synapse-integration/2.2.0-SNAPSHOT/synapse-integration-2.2.0-SNAPSHOT.jar>
[INFO] Preparing surefire-report:report-only
[INFO] No goals needed for project - skipping
[INFO] Preparing surefire-report:failsafe-report-only
[INFO] No goals needed for project - skipping
[INFO] Preparing surefire-report:report
[JENKINS] Archiving <https://builds.apache.org/job/Synapse%20-%20Trunk/ws/java/modules/integration/pom.xml>
to /home/hudson/hudson/jobs/Synapse - Trunk/modules/org.apache.synapse$synapse-integration/builds/2013-08-03_01-30-42/archive/org.apache.synapse/synapse-integration/2.2.0-SNAPSHOT/synapse-integration-2.2.0-SNAPSHOT.pom
[JENKINS] Archiving <https://builds.apache.org/job/Synapse%20-%20Trunk/ws/java/modules/integration/target/synapse-integration-2.2.0-SNAPSHOT.jar>
to /home/hudson/hudson/jobs/Synapse - Trunk/modules/org.apache.synapse$synapse-integration/builds/2013-08-03_01-30-42/archive/org.apache.synapse/synapse-integration/2.2.0-SNAPSHOT/synapse-integration-2.2.0-SNAPSHOT.jar
[INFO] [remote-resources:process {execution: default}]
[WARNING] org.apache.velocity.runtime.exception.ReferenceException: reference : template =
META-INF/DEPENDENCIES.vm [line 40,column 14] : $license.name is not a valid reference.
[debug] execute contextualize
[INFO] [resources:resources {execution: default-resources}]
[INFO] Using 'UTF-8' encoding to copy filtered resources.
[INFO] skip non existing resourceDirectory <https://builds.apache.org/job/Synapse%20-%20Trunk/ws/java/modules/integration/src/main/resources>
[INFO] Copying 3 resources
[INFO] Copying 3 resources
[INFO] [compiler:compile {execution: default-compile}]
[INFO] No sources to compile
[WARNING] DEPRECATED [tasks]: Use target instead
[INFO] [antrun:run {execution: create_repo}]
[WARNING] Parameter tasks is deprecated, use target instead
[INFO] Executing tasks

main:
     [echo] *** Creating testing repositories for synapse samples
    [mkdir] Created dir: <https://builds.apache.org/job/Synapse%20-%20Trunk/ws/java/modules/integration/target/temp/classes>
    [javac] Compiling 9 source files to <https://builds.apache.org/job/Synapse%20-%20Trunk/ws/java/modules/integration/target/temp/classes>
    [mkdir] Created dir: <https://builds.apache.org/job/Synapse%20-%20Trunk/ws/java/modules/integration/target/temp/SimpleStockQuote>
    [mkdir] Created dir: <https://builds.apache.org/job/Synapse%20-%20Trunk/ws/java/modules/integration/target/temp/SimpleStockQuote/META-INF>
     [copy] Copying 1 file to <https://builds.apache.org/job/Synapse%20-%20Trunk/ws/java/modules/integration/target/temp/SimpleStockQuote/META-INF>
     [copy] Copying 9 files to <https://builds.apache.org/job/Synapse%20-%20Trunk/ws/java/modules/integration/target/temp/SimpleStockQuote>
      [jar] Building jar: <https://builds.apache.org/job/Synapse%20-%20Trunk/ws/java/modules/integration/target/test_repos/axis2Server/services/SimpleStockQuoteService.aar>
   [delete] Deleting directory <https://builds.apache.org/job/Synapse%20-%20Trunk/ws/java/modules/integration/target/temp>
    [mkdir] Created dir: <https://builds.apache.org/job/Synapse%20-%20Trunk/ws/java/modules/integration/target/temp>
    [mkdir] Created dir: <https://builds.apache.org/job/Synapse%20-%20Trunk/ws/java/modules/integration/target/temp/classes>
    [javac] Compiling 9 source files to <https://builds.apache.org/job/Synapse%20-%20Trunk/ws/java/modules/integration/target/temp/classes>
    [mkdir] Created dir: <https://builds.apache.org/job/Synapse%20-%20Trunk/ws/java/modules/integration/target/temp/SecureStockQuoteService>
    [mkdir] Created dir: <https://builds.apache.org/job/Synapse%20-%20Trunk/ws/java/modules/integration/target/temp/SecureStockQuoteService/META-INF>
     [copy] Copying 1 file to <https://builds.apache.org/job/Synapse%20-%20Trunk/ws/java/modules/integration/target/temp/SecureStockQuoteService/META-INF>
     [copy] Copying 1 file to <https://builds.apache.org/job/Synapse%20-%20Trunk/ws/java/modules/integration/target/temp/SecureStockQuoteService>
     [copy] Copying 9 files to <https://builds.apache.org/job/Synapse%20-%20Trunk/ws/java/modules/integration/target/temp/SecureStockQuoteService>
      [jar] Building jar: <https://builds.apache.org/job/Synapse%20-%20Trunk/ws/java/modules/integration/target/test_repos/axis2Server/services/SecureStockQuoteService.aar>
   [delete] Deleting directory <https://builds.apache.org/job/Synapse%20-%20Trunk/ws/java/modules/integration/target/temp>
    [mkdir] Created dir: <https://builds.apache.org/job/Synapse%20-%20Trunk/ws/java/modules/integration/target/temp>
    [mkdir] Created dir: <https://builds.apache.org/job/Synapse%20-%20Trunk/ws/java/modules/integration/target/temp/classes>
    [javac] Compiling 1 source file to <https://builds.apache.org/job/Synapse%20-%20Trunk/ws/java/modules/integration/target/temp/classes>
    [mkdir] Created dir: <https://builds.apache.org/job/Synapse%20-%20Trunk/ws/java/modules/integration/target/temp/MTOMSwASampleService>
    [mkdir] Created dir: <https://builds.apache.org/job/Synapse%20-%20Trunk/ws/java/modules/integration/target/temp/MTOMSwASampleService/META-INF>
     [copy] Copying 1 file to <https://builds.apache.org/job/Synapse%20-%20Trunk/ws/java/modules/integration/target/temp/MTOMSwASampleService/META-INF>
     [copy] Copying 1 file to <https://builds.apache.org/job/Synapse%20-%20Trunk/ws/java/modules/integration/target/temp/MTOMSwASampleService>
      [jar] Building jar: <https://builds.apache.org/job/Synapse%20-%20Trunk/ws/java/modules/integration/target/test_repos/axis2Server/services/MTOMSwASampleService.aar>
   [delete] Deleting directory <https://builds.apache.org/job/Synapse%20-%20Trunk/ws/java/modules/integration/target/temp>
    [mkdir] Created dir: <https://builds.apache.org/job/Synapse%20-%20Trunk/ws/java/modules/integration/target/temp>
    [mkdir] Created dir: <https://builds.apache.org/job/Synapse%20-%20Trunk/ws/java/modules/integration/target/temp/classes>
    [javac] Compiling 4 source files to <https://builds.apache.org/job/Synapse%20-%20Trunk/ws/java/modules/integration/target/temp/classes>
    [mkdir] Created dir: <https://builds.apache.org/job/Synapse%20-%20Trunk/ws/java/modules/integration/target/temp/ReliableStockQuoteService>
    [mkdir] Created dir: <https://builds.apache.org/job/Synapse%20-%20Trunk/ws/java/modules/integration/target/temp/ReliableStockQuoteService/META-INF>
     [copy] Copying 1 file to <https://builds.apache.org/job/Synapse%20-%20Trunk/ws/java/modules/integration/target/temp/ReliableStockQuoteService/META-INF>
     [copy] Copying 4 files to <https://builds.apache.org/job/Synapse%20-%20Trunk/ws/java/modules/integration/target/temp/ReliableStockQuoteService>
      [jar] Building jar: <https://builds.apache.org/job/Synapse%20-%20Trunk/ws/java/modules/integration/target/test_repos/axis2Server/services/ReliableStockQuoteService.aar>
   [delete] Deleting directory <https://builds.apache.org/job/Synapse%20-%20Trunk/ws/java/modules/integration/target/temp>
    [mkdir] Created dir: <https://builds.apache.org/job/Synapse%20-%20Trunk/ws/java/modules/integration/target/temp>
    [mkdir] Created dir: <https://builds.apache.org/job/Synapse%20-%20Trunk/ws/java/modules/integration/target/temp/classes>
    [javac] Compiling 2 source files to <https://builds.apache.org/job/Synapse%20-%20Trunk/ws/java/modules/integration/target/temp/classes>
    [mkdir] Created dir: <https://builds.apache.org/job/Synapse%20-%20Trunk/ws/java/modules/integration/target/temp/LBService1>
    [mkdir] Created dir: <https://builds.apache.org/job/Synapse%20-%20Trunk/ws/java/modules/integration/target/temp/LBService1/META-INF>
     [copy] Copying 1 file to <https://builds.apache.org/job/Synapse%20-%20Trunk/ws/java/modules/integration/target/temp/LBService1/META-INF>
     [copy] Copying 1 file to <https://builds.apache.org/job/Synapse%20-%20Trunk/ws/java/modules/integration/target/temp/LBService1>
      [jar] Building jar: <https://builds.apache.org/job/Synapse%20-%20Trunk/ws/java/modules/integration/target/test_repos/axis2Server/services/LBService1.aar>
    [mkdir] Created dir: <https://builds.apache.org/job/Synapse%20-%20Trunk/ws/java/modules/integration/target/temp/LBService2>
    [mkdir] Created dir: <https://builds.apache.org/job/Synapse%20-%20Trunk/ws/java/modules/integration/target/temp/LBService2/META-INF>
     [copy] Copying 1 file to <https://builds.apache.org/job/Synapse%20-%20Trunk/ws/java/modules/integration/target/temp/LBService2/META-INF>
     [copy] Copying 1 file to <https://builds.apache.org/job/Synapse%20-%20Trunk/ws/java/modules/integration/target/temp/LBService2>
      [jar] Building jar: <https://builds.apache.org/job/Synapse%20-%20Trunk/ws/java/modules/integration/target/test_repos/axis2Server/services/LBService2.aar>
[INFO] Executed tasks
[INFO] [dependency:copy {execution: copy}]
[INFO] Configured Artifact: org.apache.axis2:addressing:1.7.0-SNAPSHOT:mar
[INFO] Configured Artifact: org.apache.rampart:rampart:1.7.0-SNAPSHOT:mar
[INFO] Configured Artifact: org.apache.sandesha2:sandesha2:1.7.0-SNAPSHOT:mar
[INFO] Configured Artifact: org.apache.axis2:addressing:1.7.0-SNAPSHOT:mar
[INFO] Configured Artifact: org.apache.rampart:rampart:1.7.0-SNAPSHOT:mar
[INFO] Configured Artifact: org.apache.axis2:addressing:1.7.0-SNAPSHOT:mar
[INFO] Configured Artifact: org.apache.rampart:rampart:1.7.0-SNAPSHOT:mar
[INFO] Configured Artifact: org.apache.sandesha2:sandesha2:1.7.0-SNAPSHOT:mar
[INFO] org.apache.axis2:addressing:1.7.0-SNAPSHOT:mar already exists in <https://builds.apache.org/job/Synapse%20-%20Trunk/ws/java/modules/integration/target/test_repos/axis2Server/modules>
[INFO] org.apache.rampart:rampart:1.7.0-SNAPSHOT:mar already exists in <https://builds.apache.org/job/Synapse%20-%20Trunk/ws/java/modules/integration/target/test_repos/axis2Server/modules>
[INFO] org.apache.sandesha2:sandesha2:1.7.0-SNAPSHOT:mar already exists in <https://builds.apache.org/job/Synapse%20-%20Trunk/ws/java/modules/integration/target/test_repos/axis2Server/modules>
[INFO] org.apache.axis2:addressing:1.7.0-SNAPSHOT:mar already exists in <https://builds.apache.org/job/Synapse%20-%20Trunk/ws/java/modules/integration/target/test_repos/axis2Client/modules>
[INFO] org.apache.rampart:rampart:1.7.0-SNAPSHOT:mar already exists in <https://builds.apache.org/job/Synapse%20-%20Trunk/ws/java/modules/integration/target/test_repos/axis2Client/modules>
[INFO] org.apache.axis2:addressing:1.7.0-SNAPSHOT:mar already exists in <https://builds.apache.org/job/Synapse%20-%20Trunk/ws/java/modules/integration/target/test_repos/synapse/modules>
[INFO] org.apache.rampart:rampart:1.7.0-SNAPSHOT:mar already exists in <https://builds.apache.org/job/Synapse%20-%20Trunk/ws/java/modules/integration/target/test_repos/synapse/modules>
[INFO] org.apache.sandesha2:sandesha2:1.7.0-SNAPSHOT:mar already exists in <https://builds.apache.org/job/Synapse%20-%20Trunk/ws/java/modules/integration/target/test_repos/synapse/modules>
[debug] execute contextualize
[INFO] [resources:testResources {execution: default-testResources}]
[INFO] Using 'UTF-8' encoding to copy filtered resources.
[INFO] Copying 83 resources
[INFO] Copying 3 resources
[INFO] Copying 3 resources
[INFO] [compiler:testCompile {execution: default-testCompile}]
[INFO] Nothing to compile - all classes are up to date
[INFO] [surefire:test {execution: default-test}]
[INFO] Skipping execution of surefire because it has already been run for this configuration
[JENKINS] Recording test results
ERROR: Could not find local repository for 2.2.1
[INFO] [site:site {execution: default-site}]
[INFO] Parent project loaded from repository: org.apache:apache:pom:9
[INFO] Relativizing decoration links with respect to project URL: http://synapse.apache.org/modules/synapse-integration
[INFO] Rendering site with org.apache.maven.skins:maven-default-skin:jar:1.0 skin.
[INFO] Skipped "Surefire Report" report, file "sample_automation.html" already exists for
the English version.
[INFO] Generating "About" report.
[INFO] Generating "Source Repository" report.
[INFO] Generating "Plugin Management" report.
[INFO] Generating "Mailing Lists" report.
[INFO] Generating "Issue Tracking" report.
[INFO] Generating "Project Plugins" report.
[INFO] Generating "Dependency Convergence" report.
[INFO] Generating "Project Summary" report.
[INFO] Generating "Dependency Management" report.
[INFO] Generating "Dependencies" report.
[INFO] Generating "Project License" report.
[INFO] Generating "Project Team" report.
[INFO] Generating "Continuous Integration" report.
[INFO] Generating "Surefire Report" report.
[WARNING] Unable to locate Test Source XRef to link to - DISABLED
[FINDBUGS] No report found for mojo site
[JENKINS] Archiving site from <https://builds.apache.org/job/Synapse%20-%20Trunk/ws/java/modules/integration/target/site>
to /home/hudson/hudson/jobs/Synapse - Trunk/site/synapse-integration
[INFO] 
[INFO] 
[INFO] ------------------------------------------------------------------------
[INFO] Reactor Summary:
[INFO] ------------------------------------------------------------------------
[INFO] Apache Synapse ........................................ SUCCESS [57.066s]
[INFO] Apache Synapse - Secure Vault ......................... SUCCESS [11.017s]
[INFO] Apache Synapse - Commons .............................. SUCCESS [14.874s]
[INFO] Apache Synapse - Transports ........................... SUCCESS [3.926s]
[INFO] Apache Synapse - Non-blocking HTTP/s Transport ........ SUCCESS [42.933s]
[INFO] Apache Synapse - PIPE Transport ....................... SUCCESS [4.610s]
[INFO] Apache Synapse - VFS Transport ........................ SUCCESS [13.544s]
[INFO] Apache Synapse - FIX Transport ........................ SUCCESS [7.350s]
[INFO] Apache Synapse - AMQP Transport ....................... SUCCESS [6.274s]
[INFO] Apache Synapse - Tasks ................................ SUCCESS [5.597s]
[INFO] Apache Synapse - Core ................................. SUCCESS [2:47.482s]
[INFO] Apache Synapse - Extensions ........................... SUCCESS [31.469s]
[INFO] Apache Synapse - Samples .............................. SUCCESS [14.921s]
[INFO] Apache Synapse - Patches .............................. SUCCESS [6.989s]
[INFO] Apache Synapse - Experimental code .................... SUCCESS [4.048s]
[INFO] Apache Synapse - Documentation ........................ SUCCESS [15.702s]
[INFO] Apache Synapse - Web Application ...................... SUCCESS [17.369s]
[INFO] Apache Synapse - Handler Module ....................... SUCCESS [4.488s]
[INFO] Apache Synapse - XAR Maven Plugin ..................... SUCCESS [4.838s]
[INFO] Apache Synapse - Configuration Migrator ............... SUCCESS [3.942s]
[INFO] Apache Synapse - Distribution ......................... SUCCESS [29.191s]
[INFO] Apache Synapse - Package skeleton ZIP ................. SUCCESS [3.231s]
[INFO] Apache Synapse - Package archetype .................... SUCCESS [4.562s]
[INFO] Apache Synapse - Integration .......................... SUCCESS [2:18.173s]
[INFO] ------------------------------------------------------------------------
[INFO] ------------------------------------------------------------------------
[INFO] BUILD SUCCESSFUL
[INFO] ------------------------------------------------------------------------
[INFO] Total time: 17 minutes 33 seconds
[INFO] Finished at: Sat Aug 03 01:48:38 UTC 2013
[INFO] Final Memory: 197M/575M
[INFO] ------------------------------------------------------------------------
channel stopped
[locks-and-latches] Releasing all the locks
[locks-and-latches] All the locks released
Maven RedeployPublisher use remote ubuntu2 maven settings from : /home/jenkins/.m2/settings.xml
[INFO] Deployment in https://repository.apache.org/content/repositories/snapshots (id=apache.snapshots.https,uniqueVersion=false)
Deploying the main artifact Apache-Synapse-2.2.0-SNAPSHOT.pom
ERROR: Error installing artifact's metadata: Error while deploying metadata: The target server
failed to respond
org.apache.maven.artifact.deployer.ArtifactDeploymentException: Error installing artifact's
metadata: Error while deploying metadata: The target server failed to respond
	at hudson.maven.artifact.deployer.DefaultArtifactDeployer.deploy(DefaultArtifactDeployer.java:183)
	at hudson.maven.reporters.MavenArtifactRecord.deploy(MavenArtifactRecord.java:190)
	at hudson.maven.RedeployPublisher.perform(RedeployPublisher.java:176)
	at hudson.tasks.BuildStepMonitor$1.perform(BuildStepMonitor.java:19)
	at hudson.model.AbstractBuild$AbstractBuildExecution.perform(AbstractBuild.java:804)
	at hudson.model.AbstractBuild$AbstractBuildExecution.performAllBuildSteps(AbstractBuild.java:776)
	at hudson.maven.MavenModuleSetBuild$MavenModuleSetBuildExecution.post2(MavenModuleSetBuild.java:995)
	at hudson.model.AbstractBuild$AbstractBuildExecution.post(AbstractBuild.java:726)
	at hudson.model.Run.execute(Run.java:1618)
	at hudson.maven.MavenModuleSetBuild.run(MavenModuleSetBuild.java:495)
	at hudson.model.ResourceController.execute(ResourceController.java:88)
	at hudson.model.Executor.run(Executor.java:247)
Caused by: org.apache.maven.artifact.repository.metadata.RepositoryMetadataDeploymentException:
Error while deploying metadata: The target server failed to respond
	at org.apache.maven.artifact.repository.metadata.DefaultRepositoryMetadataManager.deploy(DefaultRepositoryMetadataManager.java:492)
	at hudson.maven.artifact.deployer.DefaultArtifactDeployer.deploy(DefaultArtifactDeployer.java:167)
	... 11 more
Caused by: org.apache.maven.wagon.TransferFailedException: The target server failed to respond
	at org.apache.maven.wagon.shared.http4.AbstractHttpClientWagon.put(AbstractHttpClientWagon.java:580)
	at org.apache.maven.wagon.shared.http4.AbstractHttpClientWagon.put(AbstractHttpClientWagon.java:524)
	at org.apache.maven.wagon.shared.http4.AbstractHttpClientWagon.put(AbstractHttpClientWagon.java:505)
	at org.apache.maven.wagon.shared.http4.AbstractHttpClientWagon.put(AbstractHttpClientWagon.java:485)
	at org.apache.maven.repository.legacy.DefaultWagonManager.putRemoteFile(DefaultWagonManager.java:543)
	at org.apache.maven.repository.legacy.DefaultWagonManager.putArtifactMetadata(DefaultWagonManager.java:501)
	at org.apache.maven.artifact.repository.metadata.DefaultRepositoryMetadataManager.deploy(DefaultRepositoryMetadataManager.java:488)
	... 12 more
Caused by: org.apache.http.NoHttpResponseException: The target server failed to respond
	at org.apache.http.impl.conn.DefaultHttpResponseParser.parseHead(DefaultHttpResponseParser.java:95)
	at org.apache.http.impl.conn.DefaultHttpResponseParser.parseHead(DefaultHttpResponseParser.java:62)
	at org.apache.http.impl.io.AbstractMessageParser.parse(AbstractMessageParser.java:254)
	at org.apache.http.impl.AbstractHttpClientConnection.receiveResponseHeader(AbstractHttpClientConnection.java:289)
	at org.apache.http.impl.conn.DefaultClientConnection.receiveResponseHeader(DefaultClientConnection.java:252)
	at org.apache.http.impl.conn.ManagedClientConnectionImpl.receiveResponseHeader(ManagedClientConnectionImpl.java:191)
	at org.apache.http.protocol.HttpRequestExecutor.doReceiveResponse(HttpRequestExecutor.java:300)
	at org.apache.http.protocol.HttpRequestExecutor.execute(HttpRequestExecutor.java:127)
	at org.apache.http.impl.client.DefaultRequestDirector.tryExecute(DefaultRequestDirector.java:715)
	at org.apache.http.impl.client.DefaultRequestDirector.execute(DefaultRequestDirector.java:520)
	at org.apache.http.impl.client.AbstractHttpClient.execute(AbstractHttpClient.java:906)
	at org.apache.http.impl.client.AbstractHttpClient.execute(AbstractHttpClient.java:805)
	at org.apache.maven.wagon.shared.http4.AbstractHttpClientWagon.execute(AbstractHttpClientWagon.java:746)
	at org.apache.maven.wagon.shared.http4.AbstractHttpClientWagon.put(AbstractHttpClientWagon.java:574)
	... 18 more
[INFO] Deployment failed after 16 sec
Build step 'Deploy artifacts to Maven repository' changed build result to FAILURE
Updating SYNAPSE-528

---------------------------------------------------------------------
To unsubscribe, e-mail: dev-unsubscribe@synapse.apache.org
For additional commands, e-mail: dev-help@synapse.apache.org


Mime
View raw message