synapse-dev mailing list archives

Site index · List index
Message view « Date » · « Thread »
Top « Date » · « Thread »
From Apache Jenkins Server <jenk...@builds.apache.org>
Subject Build failed in Jenkins: Synapse - Trunk #4752
Date Tue, 17 Sep 2013 11:26:36 GMT
See <https://builds.apache.org/job/Synapse%20-%20Trunk/4752/>

------------------------------------------
[...truncated 9183 lines...]
Tests run: 69, Failures: 0, Errors: 0, Skipped: 0, Time elapsed: 146.159 sec

Results :

Tests run: 69, Failures: 0, Errors: 0, Skipped: 0

[JENKINS] Recording test results
[INFO] [jar:jar {execution: default-jar}]
[INFO] Building jar: <https://builds.apache.org/job/Synapse%20-%20Trunk/ws/java/modules/integration/target/synapse-integration-2.2.0-SNAPSHOT.jar>
[INFO] [install:install {execution: default-install}]
[INFO] Installing <https://builds.apache.org/job/Synapse%20-%20Trunk/ws/java/modules/integration/target/synapse-integration-2.2.0-SNAPSHOT.jar>
to <https://builds.apache.org/job/Synapse%20-%20Trunk/ws/.repository/org/apache/synapse/synapse-integration/2.2.0-SNAPSHOT/synapse-integration-2.2.0-SNAPSHOT.jar>
[INFO] Preparing surefire-report:report-only
[INFO] No goals needed for project - skipping
[INFO] Preparing surefire-report:failsafe-report-only
[INFO] No goals needed for project - skipping
[INFO] Preparing surefire-report:report
[JENKINS] Archiving <https://builds.apache.org/job/Synapse%20-%20Trunk/ws/java/modules/integration/pom.xml>
to /home/hudson/hudson/jobs/Synapse - Trunk/modules/org.apache.synapse$synapse-integration/builds/2013-09-17_11-12-04/archive/org.apache.synapse/synapse-integration/2.2.0-SNAPSHOT/synapse-integration-2.2.0-SNAPSHOT.pom
[JENKINS] Archiving <https://builds.apache.org/job/Synapse%20-%20Trunk/ws/java/modules/integration/target/synapse-integration-2.2.0-SNAPSHOT.jar>
to /home/hudson/hudson/jobs/Synapse - Trunk/modules/org.apache.synapse$synapse-integration/builds/2013-09-17_11-12-04/archive/org.apache.synapse/synapse-integration/2.2.0-SNAPSHOT/synapse-integration-2.2.0-SNAPSHOT.jar
[INFO] [remote-resources:process {execution: default}]
[WARNING] org.apache.velocity.runtime.exception.ReferenceException: reference : template =
META-INF/DEPENDENCIES.vm [line 40,column 14] : $license.name is not a valid reference.
[debug] execute contextualize
[INFO] [resources:resources {execution: default-resources}]
[INFO] Using 'UTF-8' encoding to copy filtered resources.
[INFO] skip non existing resourceDirectory <https://builds.apache.org/job/Synapse%20-%20Trunk/ws/java/modules/integration/src/main/resources>
[INFO] Copying 3 resources
[INFO] Copying 3 resources
[INFO] [compiler:compile {execution: default-compile}]
[INFO] No sources to compile
[WARNING] DEPRECATED [tasks]: Use target instead
[INFO] [antrun:run {execution: create_repo}]
[WARNING] Parameter tasks is deprecated, use target instead
[INFO] Executing tasks

main:
     [echo] *** Creating testing repositories for synapse samples
    [mkdir] Created dir: <https://builds.apache.org/job/Synapse%20-%20Trunk/ws/java/modules/integration/target/temp/classes>
    [javac] Compiling 9 source files to <https://builds.apache.org/job/Synapse%20-%20Trunk/ws/java/modules/integration/target/temp/classes>
    [mkdir] Created dir: <https://builds.apache.org/job/Synapse%20-%20Trunk/ws/java/modules/integration/target/temp/SimpleStockQuote>
    [mkdir] Created dir: <https://builds.apache.org/job/Synapse%20-%20Trunk/ws/java/modules/integration/target/temp/SimpleStockQuote/META-INF>
     [copy] Copying 1 file to <https://builds.apache.org/job/Synapse%20-%20Trunk/ws/java/modules/integration/target/temp/SimpleStockQuote/META-INF>
     [copy] Copying 9 files to <https://builds.apache.org/job/Synapse%20-%20Trunk/ws/java/modules/integration/target/temp/SimpleStockQuote>
      [jar] Building jar: <https://builds.apache.org/job/Synapse%20-%20Trunk/ws/java/modules/integration/target/test_repos/axis2Server/services/SimpleStockQuoteService.aar>
   [delete] Deleting directory <https://builds.apache.org/job/Synapse%20-%20Trunk/ws/java/modules/integration/target/temp>
    [mkdir] Created dir: <https://builds.apache.org/job/Synapse%20-%20Trunk/ws/java/modules/integration/target/temp>
    [mkdir] Created dir: <https://builds.apache.org/job/Synapse%20-%20Trunk/ws/java/modules/integration/target/temp/classes>
    [javac] Compiling 9 source files to <https://builds.apache.org/job/Synapse%20-%20Trunk/ws/java/modules/integration/target/temp/classes>
    [mkdir] Created dir: <https://builds.apache.org/job/Synapse%20-%20Trunk/ws/java/modules/integration/target/temp/SecureStockQuoteService>
    [mkdir] Created dir: <https://builds.apache.org/job/Synapse%20-%20Trunk/ws/java/modules/integration/target/temp/SecureStockQuoteService/META-INF>
     [copy] Copying 1 file to <https://builds.apache.org/job/Synapse%20-%20Trunk/ws/java/modules/integration/target/temp/SecureStockQuoteService/META-INF>
     [copy] Copying 1 file to <https://builds.apache.org/job/Synapse%20-%20Trunk/ws/java/modules/integration/target/temp/SecureStockQuoteService>
     [copy] Copying 9 files to <https://builds.apache.org/job/Synapse%20-%20Trunk/ws/java/modules/integration/target/temp/SecureStockQuoteService>
      [jar] Building jar: <https://builds.apache.org/job/Synapse%20-%20Trunk/ws/java/modules/integration/target/test_repos/axis2Server/services/SecureStockQuoteService.aar>
   [delete] Deleting directory <https://builds.apache.org/job/Synapse%20-%20Trunk/ws/java/modules/integration/target/temp>
    [mkdir] Created dir: <https://builds.apache.org/job/Synapse%20-%20Trunk/ws/java/modules/integration/target/temp>
    [mkdir] Created dir: <https://builds.apache.org/job/Synapse%20-%20Trunk/ws/java/modules/integration/target/temp/classes>
    [javac] Compiling 1 source file to <https://builds.apache.org/job/Synapse%20-%20Trunk/ws/java/modules/integration/target/temp/classes>
    [mkdir] Created dir: <https://builds.apache.org/job/Synapse%20-%20Trunk/ws/java/modules/integration/target/temp/MTOMSwASampleService>
    [mkdir] Created dir: <https://builds.apache.org/job/Synapse%20-%20Trunk/ws/java/modules/integration/target/temp/MTOMSwASampleService/META-INF>
     [copy] Copying 1 file to <https://builds.apache.org/job/Synapse%20-%20Trunk/ws/java/modules/integration/target/temp/MTOMSwASampleService/META-INF>
     [copy] Copying 1 file to <https://builds.apache.org/job/Synapse%20-%20Trunk/ws/java/modules/integration/target/temp/MTOMSwASampleService>
      [jar] Building jar: <https://builds.apache.org/job/Synapse%20-%20Trunk/ws/java/modules/integration/target/test_repos/axis2Server/services/MTOMSwASampleService.aar>
   [delete] Deleting directory <https://builds.apache.org/job/Synapse%20-%20Trunk/ws/java/modules/integration/target/temp>
    [mkdir] Created dir: <https://builds.apache.org/job/Synapse%20-%20Trunk/ws/java/modules/integration/target/temp>
    [mkdir] Created dir: <https://builds.apache.org/job/Synapse%20-%20Trunk/ws/java/modules/integration/target/temp/classes>
    [javac] Compiling 4 source files to <https://builds.apache.org/job/Synapse%20-%20Trunk/ws/java/modules/integration/target/temp/classes>
    [mkdir] Created dir: <https://builds.apache.org/job/Synapse%20-%20Trunk/ws/java/modules/integration/target/temp/ReliableStockQuoteService>
    [mkdir] Created dir: <https://builds.apache.org/job/Synapse%20-%20Trunk/ws/java/modules/integration/target/temp/ReliableStockQuoteService/META-INF>
     [copy] Copying 1 file to <https://builds.apache.org/job/Synapse%20-%20Trunk/ws/java/modules/integration/target/temp/ReliableStockQuoteService/META-INF>
     [copy] Copying 4 files to <https://builds.apache.org/job/Synapse%20-%20Trunk/ws/java/modules/integration/target/temp/ReliableStockQuoteService>
      [jar] Building jar: <https://builds.apache.org/job/Synapse%20-%20Trunk/ws/java/modules/integration/target/test_repos/axis2Server/services/ReliableStockQuoteService.aar>
   [delete] Deleting directory <https://builds.apache.org/job/Synapse%20-%20Trunk/ws/java/modules/integration/target/temp>
    [mkdir] Created dir: <https://builds.apache.org/job/Synapse%20-%20Trunk/ws/java/modules/integration/target/temp>
    [mkdir] Created dir: <https://builds.apache.org/job/Synapse%20-%20Trunk/ws/java/modules/integration/target/temp/classes>
    [javac] Compiling 2 source files to <https://builds.apache.org/job/Synapse%20-%20Trunk/ws/java/modules/integration/target/temp/classes>
    [mkdir] Created dir: <https://builds.apache.org/job/Synapse%20-%20Trunk/ws/java/modules/integration/target/temp/LBService1>
    [mkdir] Created dir: <https://builds.apache.org/job/Synapse%20-%20Trunk/ws/java/modules/integration/target/temp/LBService1/META-INF>
     [copy] Copying 1 file to <https://builds.apache.org/job/Synapse%20-%20Trunk/ws/java/modules/integration/target/temp/LBService1/META-INF>
     [copy] Copying 1 file to <https://builds.apache.org/job/Synapse%20-%20Trunk/ws/java/modules/integration/target/temp/LBService1>
      [jar] Building jar: <https://builds.apache.org/job/Synapse%20-%20Trunk/ws/java/modules/integration/target/test_repos/axis2Server/services/LBService1.aar>
    [mkdir] Created dir: <https://builds.apache.org/job/Synapse%20-%20Trunk/ws/java/modules/integration/target/temp/LBService2>
    [mkdir] Created dir: <https://builds.apache.org/job/Synapse%20-%20Trunk/ws/java/modules/integration/target/temp/LBService2/META-INF>
     [copy] Copying 1 file to <https://builds.apache.org/job/Synapse%20-%20Trunk/ws/java/modules/integration/target/temp/LBService2/META-INF>
     [copy] Copying 1 file to <https://builds.apache.org/job/Synapse%20-%20Trunk/ws/java/modules/integration/target/temp/LBService2>
      [jar] Building jar: <https://builds.apache.org/job/Synapse%20-%20Trunk/ws/java/modules/integration/target/test_repos/axis2Server/services/LBService2.aar>
[INFO] Executed tasks
[INFO] [dependency:copy {execution: copy}]
[INFO] Configured Artifact: org.apache.axis2:addressing:1.7.0-SNAPSHOT:mar
[INFO] Configured Artifact: org.apache.rampart:rampart:1.7.0-SNAPSHOT:mar
[INFO] Configured Artifact: org.apache.sandesha2:sandesha2:1.7.0-SNAPSHOT:mar
[INFO] Configured Artifact: org.apache.axis2:addressing:1.7.0-SNAPSHOT:mar
[INFO] Configured Artifact: org.apache.rampart:rampart:1.7.0-SNAPSHOT:mar
[INFO] Configured Artifact: org.apache.axis2:addressing:1.7.0-SNAPSHOT:mar
[INFO] Configured Artifact: org.apache.rampart:rampart:1.7.0-SNAPSHOT:mar
[INFO] Configured Artifact: org.apache.sandesha2:sandesha2:1.7.0-SNAPSHOT:mar
[INFO] org.apache.axis2:addressing:1.7.0-SNAPSHOT:mar already exists in <https://builds.apache.org/job/Synapse%20-%20Trunk/ws/java/modules/integration/target/test_repos/axis2Server/modules>
[INFO] org.apache.rampart:rampart:1.7.0-SNAPSHOT:mar already exists in <https://builds.apache.org/job/Synapse%20-%20Trunk/ws/java/modules/integration/target/test_repos/axis2Server/modules>
[INFO] org.apache.sandesha2:sandesha2:1.7.0-SNAPSHOT:mar already exists in <https://builds.apache.org/job/Synapse%20-%20Trunk/ws/java/modules/integration/target/test_repos/axis2Server/modules>
[INFO] org.apache.axis2:addressing:1.7.0-SNAPSHOT:mar already exists in <https://builds.apache.org/job/Synapse%20-%20Trunk/ws/java/modules/integration/target/test_repos/axis2Client/modules>
[INFO] org.apache.rampart:rampart:1.7.0-SNAPSHOT:mar already exists in <https://builds.apache.org/job/Synapse%20-%20Trunk/ws/java/modules/integration/target/test_repos/axis2Client/modules>
[INFO] org.apache.axis2:addressing:1.7.0-SNAPSHOT:mar already exists in <https://builds.apache.org/job/Synapse%20-%20Trunk/ws/java/modules/integration/target/test_repos/synapse/modules>
[INFO] org.apache.rampart:rampart:1.7.0-SNAPSHOT:mar already exists in <https://builds.apache.org/job/Synapse%20-%20Trunk/ws/java/modules/integration/target/test_repos/synapse/modules>
[INFO] org.apache.sandesha2:sandesha2:1.7.0-SNAPSHOT:mar already exists in <https://builds.apache.org/job/Synapse%20-%20Trunk/ws/java/modules/integration/target/test_repos/synapse/modules>
[debug] execute contextualize
[INFO] [resources:testResources {execution: default-testResources}]
[INFO] Using 'UTF-8' encoding to copy filtered resources.
[INFO] Copying 91 resources
[INFO] Copying 3 resources
[INFO] Copying 3 resources
[INFO] [compiler:testCompile {execution: default-testCompile}]
[INFO] Nothing to compile - all classes are up to date
[INFO] [surefire:test {execution: default-test}]
[INFO] Skipping execution of surefire because it has already been run for this configuration
[JENKINS] Recording test results
ERROR: Could not find local repository for 2.2.1
[INFO] [site:site {execution: default-site}]
[INFO] Parent project loaded from repository: org.apache:apache:pom:9
[INFO] Relativizing decoration links with respect to project URL: http://synapse.apache.org/modules/synapse-integration
[INFO] Rendering site with org.apache.maven.skins:maven-default-skin:jar:1.0 skin.
[INFO] Skipped "Surefire Report" report, file "sample_automation.html" already exists for
the English version.
[INFO] Generating "About" report.
[INFO] Generating "Source Repository" report.
[INFO] Generating "Plugin Management" report.
[INFO] Generating "Mailing Lists" report.
[INFO] Generating "Issue Tracking" report.
[INFO] Generating "Project Plugins" report.
[INFO] Generating "Dependency Convergence" report.
[INFO] Generating "Project Summary" report.
[INFO] Generating "Dependency Management" report.
[INFO] Generating "Dependencies" report.
[INFO] Generating "Project License" report.
[INFO] Generating "Project Team" report.
[INFO] Generating "Continuous Integration" report.
[INFO] Generating "Surefire Report" report.
[WARNING] Unable to locate Test Source XRef to link to - DISABLED
[FINDBUGS] No report found for mojo site
[JENKINS] Archiving site from <https://builds.apache.org/job/Synapse%20-%20Trunk/ws/java/modules/integration/target/site>
to /home/hudson/hudson/jobs/Synapse - Trunk/site/synapse-integration
[INFO] 
[INFO] 
[INFO] ------------------------------------------------------------------------
Waiting for Jenkins to finish collecting data[INFO] Reactor Summary:
[INFO] ------------------------------------------------------------------------

[INFO] Apache Synapse ........................................ SUCCESS [1:15.387s]
[INFO] Apache Synapse - Secure Vault ......................... SUCCESS [16.229s]
[INFO] Apache Synapse - Commons .............................. SUCCESS [26.243s]
[INFO] Apache Synapse - Transports ........................... SUCCESS [8.718s]
[INFO] Apache Synapse - Non-blocking HTTP/s Transport ........ SUCCESS [25.626s]
[INFO] Apache Synapse - PIPE Transport ....................... SUCCESS [8.978s]
[INFO] Apache Synapse - VFS Transport ........................ SUCCESS [19.466s]
[INFO] Apache Synapse - FIX Transport ........................ SUCCESS [10.489s]
[INFO] Apache Synapse - AMQP Transport ....................... SUCCESS [8.510s]
[INFO] Apache Synapse - Tasks ................................ SUCCESS [9.053s]
[INFO] Apache Synapse - Core ................................. SUCCESS [3:02.114s]
[INFO] Apache Synapse - Extensions ........................... SUCCESS [23.163s]
[INFO] Apache Synapse - Samples .............................. SUCCESS [12.855s]
[INFO] Apache Synapse - Patches .............................. SUCCESS [6.681s]
[INFO] Apache Synapse - Experimental code .................... SUCCESS [6.686s]
[INFO] Apache Synapse - Documentation ........................ SUCCESS [13.190s]
[INFO] Apache Synapse - Web Application ...................... SUCCESS [26.016s]
[INFO] Apache Synapse - Handler Module ....................... SUCCESS [7.992s]
[INFO] Apache Synapse - XAR Maven Plugin ..................... SUCCESS [9.981s]
[INFO] Apache Synapse - Configuration Migrator ............... SUCCESS [7.910s]
[INFO] Apache Synapse - Distribution ......................... SUCCESS [28.486s]
[INFO] Apache Synapse - Package skeleton ZIP ................. SUCCESS [6.528s]
[INFO] Apache Synapse - Package archetype .................... SUCCESS [9.692s]
[INFO] Apache Synapse - Integration .......................... SUCCESS [3:04.476s]
[INFO] ------------------------------------------------------------------------
[INFO] ------------------------------------------------------------------------
[INFO] BUILD SUCCESSFUL
[INFO] ------------------------------------------------------------------------
[INFO] Total time: 13 minutes 5 seconds
[INFO] Finished at: Tue Sep 17 11:25:16 UTC 2013
[INFO] Final Memory: 169M/695M
[INFO] ------------------------------------------------------------------------
channel stopped
[locks-and-latches] Releasing all the locks
[locks-and-latches] All the locks released
Maven RedeployPublisher use remote ubuntu3 maven settings from : /home/jenkins/.m2/settings.xml
[INFO] Deployment in https://repository.apache.org/content/repositories/snapshots (id=apache.snapshots.https,uniqueVersion=false)
Deploying the main artifact Apache-Synapse-2.2.0-SNAPSHOT.pom
[INFO] Deployment in https://repository.apache.org/content/repositories/snapshots (id=apache.snapshots.https,uniqueVersion=false)
Deploying the main artifact synapse-amqp-transport-2.2.0-SNAPSHOT.jar
[INFO] Deployment in https://repository.apache.org/content/repositories/snapshots (id=apache.snapshots.https,uniqueVersion=false)
Deploying the main artifact synapse-commons-2.2.0-SNAPSHOT.jar
[INFO] Deployment in https://repository.apache.org/content/repositories/snapshots (id=apache.snapshots.https,uniqueVersion=false)
Deploying the main artifact synapse-config-migrator-2.2.0-SNAPSHOT.jar
[INFO] Deployment in https://repository.apache.org/content/repositories/snapshots (id=apache.snapshots.https,uniqueVersion=false)
Deploying the main artifact synapse-core-2.2.0-SNAPSHOT.jar
Deploying the main artifact synapse-core-2.2.0-SNAPSHOT-tests.jar
[INFO] Deployment in https://repository.apache.org/content/repositories/snapshots (id=apache.snapshots.https,uniqueVersion=false)
Deploying the main artifact synapse-distribution-2.2.0-SNAPSHOT.pom
Deploying the main artifact synapse-distribution-2.2.0-SNAPSHOT-bin.zip
[INFO] Deployment in https://repository.apache.org/content/repositories/snapshots (id=apache.snapshots.https,uniqueVersion=false)
Deploying the main artifact synapse-documentation-2.2.0-SNAPSHOT.pom
Deploying the main artifact synapse-documentation-2.2.0-SNAPSHOT-site.xml
Deploying the main artifact synapse-documentation-2.2.0-SNAPSHOT-docs.zip
[INFO] Deployment in https://repository.apache.org/content/repositories/snapshots (id=apache.snapshots.https,uniqueVersion=false)
Deploying the main artifact synapse-experimental-2.2.0-SNAPSHOT.jar
[INFO] Deployment in https://repository.apache.org/content/repositories/snapshots (id=apache.snapshots.https,uniqueVersion=false)
Deploying the main artifact synapse-extensions-2.2.0-SNAPSHOT.jar
[INFO] Deployment in https://repository.apache.org/content/repositories/snapshots (id=apache.snapshots.https,uniqueVersion=false)
Deploying the main artifact synapse-fix-transport-2.2.0-SNAPSHOT.jar
[INFO] Deployment in https://repository.apache.org/content/repositories/snapshots (id=apache.snapshots.https,uniqueVersion=false)
Deploying the main artifact synapse-handler-2.2.0-SNAPSHOT.jar
ERROR: Error installing artifact's metadata: Error while deploying metadata: The target server
failed to respond
org.apache.maven.artifact.deployer.ArtifactDeploymentException: Error installing artifact's
metadata: Error while deploying metadata: The target server failed to respond
	at hudson.maven.artifact.deployer.DefaultArtifactDeployer.deploy(DefaultArtifactDeployer.java:183)
	at hudson.maven.reporters.MavenArtifactRecord.deploy(MavenArtifactRecord.java:190)
	at hudson.maven.RedeployPublisher.perform(RedeployPublisher.java:176)
	at hudson.tasks.BuildStepMonitor$1.perform(BuildStepMonitor.java:20)
	at hudson.model.AbstractBuild$AbstractBuildExecution.perform(AbstractBuild.java:782)
	at hudson.model.AbstractBuild$AbstractBuildExecution.performAllBuildSteps(AbstractBuild.java:754)
	at hudson.maven.MavenModuleSetBuild$MavenModuleSetBuildExecution.post2(MavenModuleSetBuild.java:1007)
	at hudson.model.AbstractBuild$AbstractBuildExecution.post(AbstractBuild.java:707)
	at hudson.model.Run.execute(Run.java:1628)
	at hudson.maven.MavenModuleSetBuild.run(MavenModuleSetBuild.java:506)
	at hudson.model.ResourceController.execute(ResourceController.java:88)
	at hudson.model.Executor.run(Executor.java:246)
Caused by: org.apache.maven.artifact.repository.metadata.RepositoryMetadataDeploymentException:
Error while deploying metadata: The target server failed to respond
	at org.apache.maven.artifact.repository.metadata.DefaultRepositoryMetadataManager.deploy(DefaultRepositoryMetadataManager.java:492)
	at hudson.maven.artifact.deployer.DefaultArtifactDeployer.deploy(DefaultArtifactDeployer.java:167)
	... 11 more
Caused by: org.apache.maven.wagon.TransferFailedException: The target server failed to respond
	at org.apache.maven.wagon.shared.http4.AbstractHttpClientWagon.put(AbstractHttpClientWagon.java:580)
	at org.apache.maven.wagon.shared.http4.AbstractHttpClientWagon.put(AbstractHttpClientWagon.java:524)
	at org.apache.maven.wagon.shared.http4.AbstractHttpClientWagon.put(AbstractHttpClientWagon.java:505)
	at org.apache.maven.wagon.shared.http4.AbstractHttpClientWagon.put(AbstractHttpClientWagon.java:485)
	at org.apache.maven.repository.legacy.DefaultWagonManager.putRemoteFile(DefaultWagonManager.java:543)
	at org.apache.maven.repository.legacy.DefaultWagonManager.putArtifactMetadata(DefaultWagonManager.java:501)
	at org.apache.maven.artifact.repository.metadata.DefaultRepositoryMetadataManager.deploy(DefaultRepositoryMetadataManager.java:488)
	... 12 more
Caused by: org.apache.http.NoHttpResponseException: The target server failed to respond
	at org.apache.http.impl.conn.DefaultHttpResponseParser.parseHead(DefaultHttpResponseParser.java:95)
	at org.apache.http.impl.conn.DefaultHttpResponseParser.parseHead(DefaultHttpResponseParser.java:62)
	at org.apache.http.impl.io.AbstractMessageParser.parse(AbstractMessageParser.java:254)
	at org.apache.http.impl.AbstractHttpClientConnection.receiveResponseHeader(AbstractHttpClientConnection.java:289)
	at org.apache.http.impl.conn.DefaultClientConnection.receiveResponseHeader(DefaultClientConnection.java:252)
	at org.apache.http.impl.conn.ManagedClientConnectionImpl.receiveResponseHeader(ManagedClientConnectionImpl.java:191)
	at org.apache.http.protocol.HttpRequestExecutor.doReceiveResponse(HttpRequestExecutor.java:300)
	at org.apache.http.protocol.HttpRequestExecutor.execute(HttpRequestExecutor.java:127)
	at org.apache.http.impl.client.DefaultRequestDirector.tryExecute(DefaultRequestDirector.java:715)
	at org.apache.http.impl.client.DefaultRequestDirector.execute(DefaultRequestDirector.java:520)
	at org.apache.http.impl.client.AbstractHttpClient.execute(AbstractHttpClient.java:906)
	at org.apache.http.impl.client.AbstractHttpClient.execute(AbstractHttpClient.java:805)
	at org.apache.maven.wagon.shared.http4.AbstractHttpClientWagon.execute(AbstractHttpClientWagon.java:746)
	at org.apache.maven.wagon.shared.http4.AbstractHttpClientWagon.put(AbstractHttpClientWagon.java:574)
	... 18 more
[INFO] Deployment failed after 1 min 6 sec
Build step 'Deploy artifacts to Maven repository' changed build result to FAILURE

---------------------------------------------------------------------
To unsubscribe, e-mail: dev-unsubscribe@synapse.apache.org
For additional commands, e-mail: dev-help@synapse.apache.org


Mime
View raw message