synapse-dev mailing list archives

Site index · List index
Message view « Date » · « Thread »
Top « Date » · « Thread »
From Apache Jenkins Server <jenk...@builds.apache.org>
Subject Build failed in Jenkins: Synapse - Trunk #4769
Date Mon, 25 Nov 2013 06:42:22 GMT
See <https://builds.apache.org/job/Synapse%20-%20Trunk/4769/>

------------------------------------------
[...truncated 9226 lines...]
      [jar] Building jar: <https://builds.apache.org/job/Synapse%20-%20Trunk/ws/java/modules/integration/target/test_repos/axis2Server/services/LBService2.aar>
[INFO] Executed tasks
[INFO] [dependency:copy {execution: copy}]
[INFO] Configured Artifact: org.apache.axis2:addressing:1.7.0-SNAPSHOT:mar
[INFO] Configured Artifact: org.apache.rampart:rampart:1.7.0-SNAPSHOT:mar
[INFO] Configured Artifact: org.apache.axis2:addressing:1.7.0-SNAPSHOT:mar
[INFO] Configured Artifact: org.apache.rampart:rampart:1.7.0-SNAPSHOT:mar
[INFO] Configured Artifact: org.apache.axis2:addressing:1.7.0-SNAPSHOT:mar
[INFO] Configured Artifact: org.apache.rampart:rampart:1.7.0-SNAPSHOT:mar
[INFO] org.apache.axis2:addressing:1.7.0-SNAPSHOT:mar already exists in <https://builds.apache.org/job/Synapse%20-%20Trunk/ws/java/modules/integration/target/test_repos/axis2Server/modules>
[INFO] org.apache.rampart:rampart:1.7.0-SNAPSHOT:mar already exists in <https://builds.apache.org/job/Synapse%20-%20Trunk/ws/java/modules/integration/target/test_repos/axis2Server/modules>
[INFO] org.apache.axis2:addressing:1.7.0-SNAPSHOT:mar already exists in <https://builds.apache.org/job/Synapse%20-%20Trunk/ws/java/modules/integration/target/test_repos/axis2Client/modules>
[INFO] org.apache.rampart:rampart:1.7.0-SNAPSHOT:mar already exists in <https://builds.apache.org/job/Synapse%20-%20Trunk/ws/java/modules/integration/target/test_repos/axis2Client/modules>
[INFO] org.apache.axis2:addressing:1.7.0-SNAPSHOT:mar already exists in <https://builds.apache.org/job/Synapse%20-%20Trunk/ws/java/modules/integration/target/test_repos/synapse/modules>
[INFO] org.apache.rampart:rampart:1.7.0-SNAPSHOT:mar already exists in <https://builds.apache.org/job/Synapse%20-%20Trunk/ws/java/modules/integration/target/test_repos/synapse/modules>
[debug] execute contextualize
[INFO] [resources:testResources {execution: default-testResources}]
[INFO] Using 'UTF-8' encoding to copy filtered resources.
[INFO] Copying 93 resources
[INFO] Copying 3 resources
[INFO] Copying 3 resources
[INFO] [compiler:testCompile {execution: default-testCompile}]
[INFO] Nothing to compile - all classes are up to date
[INFO] [surefire:test {execution: default-test}]
[INFO] Skipping execution of surefire because it has already been run for this configuration
ERROR: Could not find local repository for 2.2.1
[INFO] [site:site {execution: default-site}]
[INFO] Parent project loaded from repository: org.apache:apache:pom:9
[INFO] Relativizing decoration links with respect to project URL: http://synapse.apache.org/modules/synapse-integration
[INFO] Rendering site with org.apache.maven.skins:maven-default-skin:jar:1.0 skin.
[INFO] Skipped "Surefire Report" report, file "sample_automation.html" already exists for
the English version.
[INFO] Generating "About" report.
[INFO] Generating "Source Repository" report.
[INFO] Generating "Plugin Management" report.
[INFO] Generating "Mailing Lists" report.
[INFO] Generating "Issue Tracking" report.
[INFO] Generating "Project Plugins" report.
[INFO] Generating "Dependency Convergence" report.
[INFO] Generating "Project Summary" report.
[INFO] Generating "Dependency Management" report.
[INFO] Generating "Dependencies" report.
[INFO] Generating "Project License" report.
[INFO] Generating "Project Team" report.
[INFO] Generating "Continuous Integration" report.
[INFO] Generating "Surefire Report" report.
[WARNING] Unable to locate Test Source XRef to link to - DISABLED
[FINDBUGS] No report found for mojo site
[JENKINS] Archiving site from <https://builds.apache.org/job/Synapse%20-%20Trunk/ws/java/modules/integration/target/site>
to /home/hudson/hudson/jobs/Synapse - Trunk/site/synapse-integration
[INFO] 
[INFO] 
[INFO] ------------------------------------------------------------------------
[INFO] Reactor Summary:
[INFO] ------------------------------------------------------------------------
[INFO] Apache Synapse ........................................ SUCCESS [1:14.860s]
[INFO] Apache Synapse - Secure Vault ......................... SUCCESS [22.246s]
[INFO] Apache Synapse - Commons .............................. SUCCESS [21.521s]
[INFO] Apache Synapse - Transports ........................... SUCCESS [12.882s]
[INFO] Apache Synapse - Non-blocking HTTP/s Transport ........ SUCCESS [30.001s]
[INFO] Apache Synapse - PIPE Transport ....................... SUCCESS [15.327s]
[INFO] Apache Synapse - VFS Transport ........................ SUCCESS [18.295s]
[INFO] Apache Synapse - FIX Transport ........................ SUCCESS [13.194s]
[INFO] Apache Synapse - AMQP Transport ....................... SUCCESS [7.842s]
[INFO] Apache Synapse - Tasks ................................ SUCCESS [9.327s]
[INFO] Apache Synapse - Core ................................. SUCCESS [3:11.038s]
[INFO] Apache Synapse - Extensions ........................... SUCCESS [30.357s]
[INFO] Apache Synapse - Samples .............................. SUCCESS [15.452s]
[INFO] Apache Synapse - Patches .............................. SUCCESS [16.730s]
[INFO] Apache Synapse - Experimental code .................... SUCCESS [48.541s]
[INFO] Apache Synapse - Documentation ........................ SUCCESS [2:28.969s]
[INFO] Apache Synapse - Web Application ...................... SUCCESS [23.117s]
[INFO] Apache Synapse - Handler Module ....................... SUCCESS [17.321s]
[INFO] Apache Synapse - XAR Maven Plugin ..................... SUCCESS [10.418s]
[INFO] Apache Synapse - Configuration Migrator ............... SUCCESS [9.988s]
[INFO] Apache Synapse - Distribution ......................... SUCCESS [46.766s]
[INFO] Apache Synapse - Package skeleton ZIP ................. SUCCESS [12.599s]
[INFO] Apache Synapse - Package archetype .................... SUCCESS [37.398s]
[INFO] Apache Synapse - Integration .......................... SUCCESS [13:18.552s]
[INFO] ------------------------------------------------------------------------
[INFO] ------------------------------------------------------------------------
[INFO] BUILD SUCCESSFUL
[INFO] ------------------------------------------------------------------------
[INFO] Total time: 123 minutes 25 seconds
[INFO] Finished at: Mon Nov 25 06:27:17 UTC 2013
[INFO] Final Memory: 188M/359M
[INFO] ------------------------------------------------------------------------
[JENKINS] Archiving <https://builds.apache.org/job/Synapse%20-%20Trunk/ws/java/modules/migrator/pom.xml>
to org.apache.synapse/synapse-config-migrator/2.2.0-SNAPSHOT/synapse-config-migrator-2.2.0-SNAPSHOT.pom
[JENKINS] Archiving <https://builds.apache.org/job/Synapse%20-%20Trunk/ws/java/modules/migrator/target/synapse-config-migrator-2.2.0-SNAPSHOT.jar>
to org.apache.synapse/synapse-config-migrator/2.2.0-SNAPSHOT/synapse-config-migrator-2.2.0-SNAPSHOT.jar
[JENKINS] Archiving <https://builds.apache.org/job/Synapse%20-%20Trunk/ws/java/modules/xar-maven-plugin/pom.xml>
to org.apache.synapse/synapse-xar-maven-plugin/2.2.0-SNAPSHOT/synapse-xar-maven-plugin-2.2.0-SNAPSHOT.pom
[JENKINS] Archiving <https://builds.apache.org/job/Synapse%20-%20Trunk/ws/java/modules/xar-maven-plugin/target/synapse-xar-maven-plugin-2.2.0-SNAPSHOT.jar>
to org.apache.synapse/synapse-xar-maven-plugin/2.2.0-SNAPSHOT/synapse-xar-maven-plugin-2.2.0-SNAPSHOT.jar
[JENKINS] Archiving <https://builds.apache.org/job/Synapse%20-%20Trunk/ws/java/modules/handler/pom.xml>
to org.apache.synapse/synapse-handler/2.2.0-SNAPSHOT/synapse-handler-2.2.0-SNAPSHOT.pom
[JENKINS] Archiving <https://builds.apache.org/job/Synapse%20-%20Trunk/ws/java/modules/handler/target/synapse-handler-2.2.0-SNAPSHOT.jar>
to org.apache.synapse/synapse-handler/2.2.0-SNAPSHOT/synapse-handler-2.2.0-SNAPSHOT.jar
[JENKINS] Archiving <https://builds.apache.org/job/Synapse%20-%20Trunk/ws/java/modules/handler/target/synapse-handler-2.2.0-SNAPSHOT.mar>
to org.apache.synapse/synapse-handler/2.2.0-SNAPSHOT/synapse-handler-2.2.0-SNAPSHOT.mar
[JENKINS] Archiving <https://builds.apache.org/job/Synapse%20-%20Trunk/ws/java/modules/tasks/pom.xml>
to org.apache.synapse/synapse-tasks/2.2.0-SNAPSHOT/synapse-tasks-2.2.0-SNAPSHOT.pom
[JENKINS] Archiving <https://builds.apache.org/job/Synapse%20-%20Trunk/ws/java/modules/tasks/target/synapse-tasks-2.2.0-SNAPSHOT.jar>
to org.apache.synapse/synapse-tasks/2.2.0-SNAPSHOT/synapse-tasks-2.2.0-SNAPSHOT.jar
[JENKINS] Archiving <https://builds.apache.org/job/Synapse%20-%20Trunk/ws/java/modules/extensions/pom.xml>
to org.apache.synapse/synapse-extensions/2.2.0-SNAPSHOT/synapse-extensions-2.2.0-SNAPSHOT.pom
[JENKINS] Archiving <https://builds.apache.org/job/Synapse%20-%20Trunk/ws/java/modules/extensions/target/synapse-extensions-2.2.0-SNAPSHOT.jar>
to org.apache.synapse/synapse-extensions/2.2.0-SNAPSHOT/synapse-extensions-2.2.0-SNAPSHOT.jar
[JENKINS] Archiving <https://builds.apache.org/job/Synapse%20-%20Trunk/ws/java/modules/experimental/pom.xml>
to org.apache.synapse/synapse-experimental/2.2.0-SNAPSHOT/synapse-experimental-2.2.0-SNAPSHOT.pom
[JENKINS] Archiving <https://builds.apache.org/job/Synapse%20-%20Trunk/ws/java/modules/experimental/target/synapse-experimental-2.2.0-SNAPSHOT.jar>
to org.apache.synapse/synapse-experimental/2.2.0-SNAPSHOT/synapse-experimental-2.2.0-SNAPSHOT.jar
[JENKINS] Archiving <https://builds.apache.org/job/Synapse%20-%20Trunk/ws/.repository/org/apache/synapse/Apache-Synapse/2.2.0-SNAPSHOT/Apache-Synapse-2.2.0-SNAPSHOT.pom>
to org.apache.synapse/Apache-Synapse/2.2.0-SNAPSHOT/Apache-Synapse-2.2.0-SNAPSHOT.pom
<https://builds.apache.org/job/Synapse%20-%20Trunk/ws/.repository/org/apache/synapse/Apache-Synapse/2.2.0-SNAPSHOT/Apache-Synapse-2.2.0-SNAPSHOT.pom>
is not inside <https://builds.apache.org/job/Synapse%20-%20Trunk/ws/java/;> will archive
in a separate pass
[JENKINS] Archiving <https://builds.apache.org/job/Synapse%20-%20Trunk/ws/java/modules/commons/pom.xml>
to org.apache.synapse/synapse-commons/2.2.0-SNAPSHOT/synapse-commons-2.2.0-SNAPSHOT.pom
[JENKINS] Archiving <https://builds.apache.org/job/Synapse%20-%20Trunk/ws/java/modules/commons/target/synapse-commons-2.2.0-SNAPSHOT.jar>
to org.apache.synapse/synapse-commons/2.2.0-SNAPSHOT/synapse-commons-2.2.0-SNAPSHOT.jar
[JENKINS] Archiving <https://builds.apache.org/job/Synapse%20-%20Trunk/ws/java/modules/transports/core/nhttp/pom.xml>
to org.apache.synapse/synapse-nhttp-transport/2.2.0-SNAPSHOT/synapse-nhttp-transport-2.2.0-SNAPSHOT.pom
[JENKINS] Archiving <https://builds.apache.org/job/Synapse%20-%20Trunk/ws/java/modules/transports/core/nhttp/target/synapse-nhttp-transport-2.2.0-SNAPSHOT.jar>
to org.apache.synapse/synapse-nhttp-transport/2.2.0-SNAPSHOT/synapse-nhttp-transport-2.2.0-SNAPSHOT.jar
[JENKINS] Archiving <https://builds.apache.org/job/Synapse%20-%20Trunk/ws/java/modules/transports/core/nhttp/target/synapse-nhttp-transport-2.2.0-SNAPSHOT-testkit-logs.zip>
to org.apache.synapse/synapse-nhttp-transport/2.2.0-SNAPSHOT/synapse-nhttp-transport-2.2.0-SNAPSHOT-testkit-logs.zip
[JENKINS] Archiving <https://builds.apache.org/job/Synapse%20-%20Trunk/ws/.repository/org/apache/synapse/synapse-package-skeleton/2.2.0-SNAPSHOT/synapse-package-skeleton-2.2.0-SNAPSHOT.pom>
to org.apache.synapse/synapse-package-skeleton/2.2.0-SNAPSHOT/synapse-package-skeleton-2.2.0-SNAPSHOT.pom
[JENKINS] Archiving <https://builds.apache.org/job/Synapse%20-%20Trunk/ws/java/modules/packaging/package-skeleton/target/synapse-package-skeleton-2.2.0-SNAPSHOT-skeleton.zip>
to org.apache.synapse/synapse-package-skeleton/2.2.0-SNAPSHOT/synapse-package-skeleton-2.2.0-SNAPSHOT-skeleton.zip
<https://builds.apache.org/job/Synapse%20-%20Trunk/ws/.repository/org/apache/synapse/synapse-package-skeleton/2.2.0-SNAPSHOT/synapse-package-skeleton-2.2.0-SNAPSHOT.pom>
is not inside <https://builds.apache.org/job/Synapse%20-%20Trunk/ws/java/modules/packaging/package-skeleton/;>
will archive in a separate pass
[JENKINS] Archiving <https://builds.apache.org/job/Synapse%20-%20Trunk/ws/.repository/org/apache/synapse/synapse-distribution/2.2.0-SNAPSHOT/synapse-distribution-2.2.0-SNAPSHOT.pom>
to org.apache.synapse/synapse-distribution/2.2.0-SNAPSHOT/synapse-distribution-2.2.0-SNAPSHOT.pom
[JENKINS] Archiving <https://builds.apache.org/job/Synapse%20-%20Trunk/ws/java/modules/distribution/target/synapse-2.2.0-SNAPSHOT-bin.zip>
to org.apache.synapse/synapse-distribution/2.2.0-SNAPSHOT/synapse-distribution-2.2.0-SNAPSHOT-bin.zip
<https://builds.apache.org/job/Synapse%20-%20Trunk/ws/.repository/org/apache/synapse/synapse-distribution/2.2.0-SNAPSHOT/synapse-distribution-2.2.0-SNAPSHOT.pom>
is not inside <https://builds.apache.org/job/Synapse%20-%20Trunk/ws/java/modules/distribution/;>
will archive in a separate pass
[JENKINS] Archiving <https://builds.apache.org/job/Synapse%20-%20Trunk/ws/java/modules/war/pom.xml>
to org.apache.synapse/synapse-war/2.2.0-SNAPSHOT/synapse-war-2.2.0-SNAPSHOT.pom
[JENKINS] Archiving <https://builds.apache.org/job/Synapse%20-%20Trunk/ws/java/target/synapse.war>
to org.apache.synapse/synapse-war/2.2.0-SNAPSHOT/synapse-war-2.2.0-SNAPSHOT.war
<https://builds.apache.org/job/Synapse%20-%20Trunk/ws/java/target/synapse.war> is not
inside <https://builds.apache.org/job/Synapse%20-%20Trunk/ws/java/modules/war/;> will
archive in a separate pass
[JENKINS] Archiving <https://builds.apache.org/job/Synapse%20-%20Trunk/ws/java/modules/patches/pom.xml>
to org.apache.synapse/synapse-patches/2.2.0-SNAPSHOT/synapse-patches-2.2.0-SNAPSHOT.pom
[JENKINS] Archiving <https://builds.apache.org/job/Synapse%20-%20Trunk/ws/java/modules/patches/target/synapse-patches-2.2.0-SNAPSHOT.jar>
to org.apache.synapse/synapse-patches/2.2.0-SNAPSHOT/synapse-patches-2.2.0-SNAPSHOT.jar
[JENKINS] Archiving <https://builds.apache.org/job/Synapse%20-%20Trunk/ws/java/modules/patches/target/synapse-patches-2.2.0-SNAPSHOT-jars.zip>
to org.apache.synapse/synapse-patches/2.2.0-SNAPSHOT/synapse-patches-2.2.0-SNAPSHOT-jars.zip
[JENKINS] Archiving <https://builds.apache.org/job/Synapse%20-%20Trunk/ws/java/modules/packaging/package-archetype/pom.xml>
to org.apache.synapse/synapse-package-archetype/2.2.0-SNAPSHOT/synapse-package-archetype-2.2.0-SNAPSHOT.pom
[JENKINS] Archiving <https://builds.apache.org/job/Synapse%20-%20Trunk/ws/java/modules/packaging/package-archetype/target/synapse-package-archetype-2.2.0-SNAPSHOT.jar>
to org.apache.synapse/synapse-package-archetype/2.2.0-SNAPSHOT/synapse-package-archetype-2.2.0-SNAPSHOT.jar
[JENKINS] Archiving <https://builds.apache.org/job/Synapse%20-%20Trunk/ws/java/modules/transports/optional/fix/pom.xml>
to org.apache.synapse/synapse-fix-transport/2.2.0-SNAPSHOT/synapse-fix-transport-2.2.0-SNAPSHOT.pom
[JENKINS] Archiving <https://builds.apache.org/job/Synapse%20-%20Trunk/ws/java/modules/transports/optional/fix/target/synapse-fix-transport-2.2.0-SNAPSHOT.jar>
to org.apache.synapse/synapse-fix-transport/2.2.0-SNAPSHOT/synapse-fix-transport-2.2.0-SNAPSHOT.jar
[JENKINS] Archiving <https://builds.apache.org/job/Synapse%20-%20Trunk/ws/.repository/org/apache/synapse/synapse-transports/2.2.0-SNAPSHOT/synapse-transports-2.2.0-SNAPSHOT.pom>
to org.apache.synapse/synapse-transports/2.2.0-SNAPSHOT/synapse-transports-2.2.0-SNAPSHOT.pom
<https://builds.apache.org/job/Synapse%20-%20Trunk/ws/.repository/org/apache/synapse/synapse-transports/2.2.0-SNAPSHOT/synapse-transports-2.2.0-SNAPSHOT.pom>
is not inside <https://builds.apache.org/job/Synapse%20-%20Trunk/ws/java/modules/transports/;>
will archive in a separate pass
[JENKINS] Archiving <https://builds.apache.org/job/Synapse%20-%20Trunk/ws/java/modules/samples/pom.xml>
to org.apache.synapse/synapse-samples/2.2.0-SNAPSHOT/synapse-samples-2.2.0-SNAPSHOT.pom
[JENKINS] Archiving <https://builds.apache.org/job/Synapse%20-%20Trunk/ws/java/modules/samples/target/synapse-samples-2.2.0-SNAPSHOT.jar>
to org.apache.synapse/synapse-samples/2.2.0-SNAPSHOT/synapse-samples-2.2.0-SNAPSHOT.jar
[JENKINS] Archiving <https://builds.apache.org/job/Synapse%20-%20Trunk/ws/java/modules/securevault/pom.xml>
to org.apache.synapse/synapse-securevault/2.2.0-SNAPSHOT/synapse-securevault-2.2.0-SNAPSHOT.pom
[JENKINS] Archiving <https://builds.apache.org/job/Synapse%20-%20Trunk/ws/java/modules/securevault/target/synapse-securevault-2.2.0-SNAPSHOT.jar>
to org.apache.synapse/synapse-securevault/2.2.0-SNAPSHOT/synapse-securevault-2.2.0-SNAPSHOT.jar
[JENKINS] Archiving <https://builds.apache.org/job/Synapse%20-%20Trunk/ws/.repository/org/apache/synapse/synapse-documentation/2.2.0-SNAPSHOT/synapse-documentation-2.2.0-SNAPSHOT.pom>
to org.apache.synapse/synapse-documentation/2.2.0-SNAPSHOT/synapse-documentation-2.2.0-SNAPSHOT.pom
[JENKINS] Archiving <https://builds.apache.org/job/Synapse%20-%20Trunk/ws/java/modules/documentation/target/synapse-documentation-2.2.0-SNAPSHOT-site.xml>
to org.apache.synapse/synapse-documentation/2.2.0-SNAPSHOT/synapse-documentation-2.2.0-SNAPSHOT-site.xml
[JENKINS] Archiving <https://builds.apache.org/job/Synapse%20-%20Trunk/ws/java/modules/documentation/target/synapse-documentation-2.2.0-SNAPSHOT-docs.zip>
to org.apache.synapse/synapse-documentation/2.2.0-SNAPSHOT/synapse-documentation-2.2.0-SNAPSHOT-docs.zip
<https://builds.apache.org/job/Synapse%20-%20Trunk/ws/.repository/org/apache/synapse/synapse-documentation/2.2.0-SNAPSHOT/synapse-documentation-2.2.0-SNAPSHOT.pom>
is not inside <https://builds.apache.org/job/Synapse%20-%20Trunk/ws/java/modules/documentation/;>
will archive in a separate pass
[JENKINS] Archiving <https://builds.apache.org/job/Synapse%20-%20Trunk/ws/java/modules/transports/core/pipe/pom.xml>
to org.apache.synapse/synapse-pipe-transport/2.2.0-SNAPSHOT/synapse-pipe-transport-2.2.0-SNAPSHOT.pom
[JENKINS] Archiving <https://builds.apache.org/job/Synapse%20-%20Trunk/ws/java/modules/transports/core/pipe/target/synapse-pipe-transport-2.2.0-SNAPSHOT.jar>
to org.apache.synapse/synapse-pipe-transport/2.2.0-SNAPSHOT/synapse-pipe-transport-2.2.0-SNAPSHOT.jar
[JENKINS] Archiving <https://builds.apache.org/job/Synapse%20-%20Trunk/ws/java/modules/integration/pom.xml>
to org.apache.synapse/synapse-integration/2.2.0-SNAPSHOT/synapse-integration-2.2.0-SNAPSHOT.pom
[JENKINS] Archiving <https://builds.apache.org/job/Synapse%20-%20Trunk/ws/java/modules/integration/target/synapse-integration-2.2.0-SNAPSHOT.jar>
to org.apache.synapse/synapse-integration/2.2.0-SNAPSHOT/synapse-integration-2.2.0-SNAPSHOT.jar
[JENKINS] Archiving <https://builds.apache.org/job/Synapse%20-%20Trunk/ws/java/modules/transports/optional/amqp/pom.xml>
to org.apache.synapse/synapse-amqp-transport/2.2.0-SNAPSHOT/synapse-amqp-transport-2.2.0-SNAPSHOT.pom
[JENKINS] Archiving <https://builds.apache.org/job/Synapse%20-%20Trunk/ws/java/modules/transports/optional/amqp/target/synapse-amqp-transport-2.2.0-SNAPSHOT.jar>
to org.apache.synapse/synapse-amqp-transport/2.2.0-SNAPSHOT/synapse-amqp-transport-2.2.0-SNAPSHOT.jar
[JENKINS] Archiving <https://builds.apache.org/job/Synapse%20-%20Trunk/ws/java/modules/core/pom.xml>
to org.apache.synapse/synapse-core/2.2.0-SNAPSHOT/synapse-core-2.2.0-SNAPSHOT.pom
[JENKINS] Archiving <https://builds.apache.org/job/Synapse%20-%20Trunk/ws/java/modules/core/target/synapse-core-2.2.0-SNAPSHOT.jar>
to org.apache.synapse/synapse-core/2.2.0-SNAPSHOT/synapse-core-2.2.0-SNAPSHOT.jar
[JENKINS] Archiving <https://builds.apache.org/job/Synapse%20-%20Trunk/ws/java/modules/core/target/synapse-core-2.2.0-SNAPSHOT-tests.jar>
to org.apache.synapse/synapse-core/2.2.0-SNAPSHOT/synapse-core-2.2.0-SNAPSHOT-tests.jar
[JENKINS] Archiving <https://builds.apache.org/job/Synapse%20-%20Trunk/ws/java/modules/transports/core/vfs/pom.xml>
to org.apache.synapse/synapse-vfs-transport/2.2.0-SNAPSHOT/synapse-vfs-transport-2.2.0-SNAPSHOT.pom
[JENKINS] Archiving <https://builds.apache.org/job/Synapse%20-%20Trunk/ws/java/modules/transports/core/vfs/target/synapse-vfs-transport-2.2.0-SNAPSHOT.jar>
to org.apache.synapse/synapse-vfs-transport/2.2.0-SNAPSHOT/synapse-vfs-transport-2.2.0-SNAPSHOT.jar
[JENKINS] Archiving <https://builds.apache.org/job/Synapse%20-%20Trunk/ws/java/modules/transports/core/vfs/target/synapse-vfs-transport-2.2.0-SNAPSHOT-testkit-logs.zip>
to org.apache.synapse/synapse-vfs-transport/2.2.0-SNAPSHOT/synapse-vfs-transport-2.2.0-SNAPSHOT-testkit-logs.zip
channel stopped
[locks-and-latches] Releasing all the locks
[locks-and-latches] All the locks released
Maven RedeployPublisher use remote ubuntu1 maven settings from : /home/jenkins/.m2/settings.xml
[INFO] Deployment in https://repository.apache.org/content/repositories/snapshots (id=apache.snapshots.https,uniqueVersion=false)
Deploying the main artifact jenkins-6023359321340275940Apache-Synapse-2.2.0-SNAPSHOT.pom
[INFO] Deployment in https://repository.apache.org/content/repositories/snapshots (id=apache.snapshots.https,uniqueVersion=false)
Deploying the main artifact jenkins-4747294267259469570synapse-amqp-transport-2.2.0-SNAPSHOT.jar
[INFO] Deployment in https://repository.apache.org/content/repositories/snapshots (id=apache.snapshots.https,uniqueVersion=false)
Deploying the main artifact jenkins-4643740320920801721synapse-commons-2.2.0-SNAPSHOT.jar
[INFO] Deployment in https://repository.apache.org/content/repositories/snapshots (id=apache.snapshots.https,uniqueVersion=false)
Deploying the main artifact jenkins-6071239932802929518synapse-config-migrator-2.2.0-SNAPSHOT.jar
[INFO] Deployment in https://repository.apache.org/content/repositories/snapshots (id=apache.snapshots.https,uniqueVersion=false)
Deploying the main artifact jenkins-6663797405844229938synapse-core-2.2.0-SNAPSHOT.jar
Deploying the main artifact jenkins-2664542871845257625synapse-core-2.2.0-SNAPSHOT-tests.jar
[INFO] Deployment in https://repository.apache.org/content/repositories/snapshots (id=apache.snapshots.https,uniqueVersion=false)
Deploying the main artifact jenkins-1716991877645478100synapse-distribution-2.2.0-SNAPSHOT.pom
Deploying the main artifact jenkins-1227651681488003700synapse-distribution-2.2.0-SNAPSHOT-bin.zip
[INFO] Deployment in https://repository.apache.org/content/repositories/snapshots (id=apache.snapshots.https,uniqueVersion=false)
Deploying the main artifact jenkins-8635712546030878918synapse-documentation-2.2.0-SNAPSHOT.pom
Deploying the main artifact jenkins-3375337451292346253synapse-documentation-2.2.0-SNAPSHOT-site.xml
Deploying the main artifact jenkins-1307968447077070388synapse-documentation-2.2.0-SNAPSHOT-docs.zip
[INFO] Deployment in https://repository.apache.org/content/repositories/snapshots (id=apache.snapshots.https,uniqueVersion=false)
Deploying the main artifact jenkins-5564128363761695635synapse-experimental-2.2.0-SNAPSHOT.jar
[INFO] Deployment in https://repository.apache.org/content/repositories/snapshots (id=apache.snapshots.https,uniqueVersion=false)
Deploying the main artifact jenkins-2799225743697156777synapse-extensions-2.2.0-SNAPSHOT.jar
[INFO] Deployment in https://repository.apache.org/content/repositories/snapshots (id=apache.snapshots.https,uniqueVersion=false)
Deploying the main artifact jenkins-7687598784965414885synapse-fix-transport-2.2.0-SNAPSHOT.jar
[INFO] Deployment in https://repository.apache.org/content/repositories/snapshots (id=apache.snapshots.https,uniqueVersion=false)
Deploying the main artifact jenkins-4129606549214083283synapse-handler-2.2.0-SNAPSHOT.jar
Deploying the main artifact jenkins-2516293760476037545synapse-handler-2.2.0-SNAPSHOT.mar
[INFO] Deployment in https://repository.apache.org/content/repositories/snapshots (id=apache.snapshots.https,uniqueVersion=false)
Deploying the main artifact jenkins-6303281688999584053synapse-integration-2.2.0-SNAPSHOT.jar
[INFO] Deployment in https://repository.apache.org/content/repositories/snapshots (id=apache.snapshots.https,uniqueVersion=false)
Deploying the main artifact jenkins-2003892142652209198synapse-nhttp-transport-2.2.0-SNAPSHOT.jar
Deploying the main artifact jenkins-1731936662527494115synapse-nhttp-transport-2.2.0-SNAPSHOT-testkit-logs.zip
[INFO] Deployment in https://repository.apache.org/content/repositories/snapshots (id=apache.snapshots.https,uniqueVersion=false)
Deploying the main artifact jenkins-8694143091848912789synapse-package-archetype-2.2.0-SNAPSHOT.jar
[INFO] Deployment in https://repository.apache.org/content/repositories/snapshots (id=apache.snapshots.https,uniqueVersion=false)
Deploying the main artifact jenkins-4544850071272722050synapse-package-skeleton-2.2.0-SNAPSHOT.pom
Deploying the main artifact jenkins-1499956792960611278synapse-package-skeleton-2.2.0-SNAPSHOT-skeleton.zip
[INFO] Deployment in https://repository.apache.org/content/repositories/snapshots (id=apache.snapshots.https,uniqueVersion=false)
Deploying the main artifact jenkins-993626522784158627synapse-patches-2.2.0-SNAPSHOT.jar
Deploying the main artifact jenkins-4924116658483257735synapse-patches-2.2.0-SNAPSHOT-jars.zip
[INFO] Deployment in https://repository.apache.org/content/repositories/snapshots (id=apache.snapshots.https,uniqueVersion=false)
Deploying the main artifact jenkins-3362651926113370280synapse-pipe-transport-2.2.0-SNAPSHOT.jar
[INFO] Deployment in https://repository.apache.org/content/repositories/snapshots (id=apache.snapshots.https,uniqueVersion=false)
Deploying the main artifact jenkins-4870878837039726980synapse-samples-2.2.0-SNAPSHOT.jar
[INFO] Deployment in https://repository.apache.org/content/repositories/snapshots (id=apache.snapshots.https,uniqueVersion=false)
Deploying the main artifact jenkins-5755346544342278186synapse-securevault-2.2.0-SNAPSHOT.jar
[INFO] Deployment in https://repository.apache.org/content/repositories/snapshots (id=apache.snapshots.https,uniqueVersion=false)
Deploying the main artifact jenkins-1399246911830975942synapse-tasks-2.2.0-SNAPSHOT.jar
[INFO] Deployment in https://repository.apache.org/content/repositories/snapshots (id=apache.snapshots.https,uniqueVersion=false)
Deploying the main artifact jenkins-5194897568000107717synapse-transports-2.2.0-SNAPSHOT.pom
[INFO] Deployment in https://repository.apache.org/content/repositories/snapshots (id=apache.snapshots.https,uniqueVersion=false)
Deploying the main artifact jenkins-5032741994319820760synapse-vfs-transport-2.2.0-SNAPSHOT.jar
Deploying the main artifact jenkins-7140365286102334902synapse-vfs-transport-2.2.0-SNAPSHOT-testkit-logs.zip
[INFO] Deployment in https://repository.apache.org/content/repositories/snapshots (id=apache.snapshots.https,uniqueVersion=false)
Deploying the main artifact jenkins-5965970859173573495synapse-war-2.2.0-SNAPSHOT.war
[INFO] Deployment in https://repository.apache.org/content/repositories/snapshots (id=apache.snapshots.https,uniqueVersion=false)
Deploying the main artifact jenkins-8804549603236950181synapse-xar-maven-plugin-2.2.0-SNAPSHOT.jar
ERROR: Error installing artifact's metadata: Error while deploying metadata: The target server
failed to respond
org.apache.maven.artifact.deployer.ArtifactDeploymentException: Error installing artifact's
metadata: Error while deploying metadata: The target server failed to respond
	at hudson.maven.artifact.deployer.DefaultArtifactDeployer.deploy(DefaultArtifactDeployer.java:183)
	at hudson.maven.reporters.MavenArtifactRecord.deploy(MavenArtifactRecord.java:191)
	at hudson.maven.RedeployPublisher.perform(RedeployPublisher.java:176)
	at hudson.tasks.BuildStepMonitor$1.perform(BuildStepMonitor.java:20)
	at hudson.model.AbstractBuild$AbstractBuildExecution.perform(AbstractBuild.java:785)
	at hudson.model.AbstractBuild$AbstractBuildExecution.performAllBuildSteps(AbstractBuild.java:757)
	at hudson.maven.MavenModuleSetBuild$MavenModuleSetBuildExecution.post2(MavenModuleSetBuild.java:1020)
	at hudson.model.AbstractBuild$AbstractBuildExecution.post(AbstractBuild.java:706)
	at hudson.model.Run.execute(Run.java:1704)
	at hudson.maven.MavenModuleSetBuild.run(MavenModuleSetBuild.java:509)
	at hudson.model.ResourceController.execute(ResourceController.java:88)
	at hudson.model.Executor.run(Executor.java:230)
Caused by: org.apache.maven.artifact.repository.metadata.RepositoryMetadataDeploymentException:
Error while deploying metadata: The target server failed to respond
	at org.apache.maven.artifact.repository.metadata.DefaultRepositoryMetadataManager.deploy(DefaultRepositoryMetadataManager.java:492)
	at hudson.maven.artifact.deployer.DefaultArtifactDeployer.deploy(DefaultArtifactDeployer.java:167)
	... 11 more
Caused by: org.apache.maven.wagon.TransferFailedException: The target server failed to respond
	at org.apache.maven.wagon.shared.http4.AbstractHttpClientWagon.put(AbstractHttpClientWagon.java:580)
	at org.apache.maven.wagon.shared.http4.AbstractHttpClientWagon.put(AbstractHttpClientWagon.java:524)
	at org.apache.maven.wagon.shared.http4.AbstractHttpClientWagon.put(AbstractHttpClientWagon.java:505)
	at org.apache.maven.wagon.shared.http4.AbstractHttpClientWagon.put(AbstractHttpClientWagon.java:485)
	at org.apache.maven.repository.legacy.DefaultWagonManager.putRemoteFile(DefaultWagonManager.java:543)
	at org.apache.maven.repository.legacy.DefaultWagonManager.putArtifactMetadata(DefaultWagonManager.java:501)
	at org.apache.maven.artifact.repository.metadata.DefaultRepositoryMetadataManager.deploy(DefaultRepositoryMetadataManager.java:488)
	... 12 more
Caused by: org.apache.http.NoHttpResponseException: The target server failed to respond
	at org.apache.http.impl.conn.DefaultHttpResponseParser.parseHead(DefaultHttpResponseParser.java:95)
	at org.apache.http.impl.conn.DefaultHttpResponseParser.parseHead(DefaultHttpResponseParser.java:62)
	at org.apache.http.impl.io.AbstractMessageParser.parse(AbstractMessageParser.java:254)
	at org.apache.http.impl.AbstractHttpClientConnection.receiveResponseHeader(AbstractHttpClientConnection.java:289)
	at org.apache.http.impl.conn.DefaultClientConnection.receiveResponseHeader(DefaultClientConnection.java:252)
	at org.apache.http.impl.conn.ManagedClientConnectionImpl.receiveResponseHeader(ManagedClientConnectionImpl.java:191)
	at org.apache.http.protocol.HttpRequestExecutor.doReceiveResponse(HttpRequestExecutor.java:300)
	at org.apache.http.protocol.HttpRequestExecutor.execute(HttpRequestExecutor.java:127)
	at org.apache.http.impl.client.DefaultRequestDirector.tryExecute(DefaultRequestDirector.java:715)
	at org.apache.http.impl.client.DefaultRequestDirector.execute(DefaultRequestDirector.java:520)
	at org.apache.http.impl.client.AbstractHttpClient.execute(AbstractHttpClient.java:906)
	at org.apache.http.impl.client.AbstractHttpClient.execute(AbstractHttpClient.java:805)
	at org.apache.maven.wagon.shared.http4.AbstractHttpClientWagon.execute(AbstractHttpClientWagon.java:746)
	at org.apache.maven.wagon.shared.http4.AbstractHttpClientWagon.put(AbstractHttpClientWagon.java:574)
	... 18 more
[INFO] Deployment failed after 11 min
Build step 'Deploy artifacts to Maven repository' changed build result to FAILURE

---------------------------------------------------------------------
To unsubscribe, e-mail: dev-unsubscribe@synapse.apache.org
For additional commands, e-mail: dev-help@synapse.apache.org


Mime
View raw message