synapse-dev mailing list archives

Site index · List index
Message view « Date » · « Thread »
Top « Date » · « Thread »
From Apache Jenkins Server <jenk...@builds.apache.org>
Subject Build failed in Jenkins: Synapse - Trunk #4780
Date Fri, 20 Dec 2013 11:33:17 GMT
See <https://builds.apache.org/job/Synapse%20-%20Trunk/4780/changes>

Changes:

[dushan] alter root pom adding myself as developer

------------------------------------------
[...truncated 1211 lines...]
Tests run: 4, Failures: 0, Errors: 0, Skipped: 0, Time elapsed: 0.622 sec

Results :

Tests run: 393, Failures: 0, Errors: 0, Skipped: 0


[INFO] [bundle:bundle {execution: default-bundle}]
[WARNING] Bundle org.apache.synapse:synapse-core:bundle:2.2.0-SNAPSHOT : Instructions in Export-Package
that are never used: org\.apache\.synapse\.executors\..*|org\.apache\.synapse\.executors
Classpath: Jar:.,Jar:synapse-securevault,Jar:axiom-api,Jar:geronimo-activation_1.1_spec,Jar:commons-logging,Jar:jaxen,Jar:geronimo-stax-api_1.0_spec,Jar:apache-mime4j-core,Jar:axiom-impl,Jar:woodstox-core-asl,Jar:stax2-api,Jar:log4j,Jar:jline,Jar:commons-cli,Jar:commons-io,Jar:commons-codec,Jar:synapse-commons,Jar:activation,Jar:axis2-transport-base,Jar:axis2-kernel,Jar:geronimo-ws-metadata_2.0_spec,Jar:geronimo-jta_1.1_spec,Jar:servlet-api,Jar:commons-fileupload,Jar:wsdl4j,Jar:xmlschema-core,Jar:neethi,Jar:woden-core,Jar:jsr311-api,Jar:commons-pool,Jar:commons-dbcp,Jar:snmp4j-agent,Jar:snmp4j,Jar:synapse-tasks,Jar:quartz,Jar:c3p0,Jar:slf4j-api,Jar:commons-collections,Jar:synapse-nhttp-transport,Jar:httpcore,Jar:httpcore-nio,Jar:axis2-transport-http,Jar:commons-httpclient,Jar:commons-lang,Jar:bcprov-jdk15on,Jar:wso2eventing-api,Jar:wso2caching-core,Jar:axis2-saaj,Jar:geronimo-saaj_1.3_spec,Jar:axiom-dom,Jar:axis2-clustering,Jar:tribes,Jar:juli,Jar:logkit,Jar:avalon-framework,Jar:wso2-uri-templates,Jar:axis2-adb

[WARNING] Bundle org.apache.synapse:synapse-core:bundle:2.2.0-SNAPSHOT : Superfluous export-package
instructions: [org.apache.synapse.executors.*]
[INFO] [jar:test-jar {execution: default}]
[INFO] Building jar: <https://builds.apache.org/job/Synapse%20-%20Trunk/ws/java/modules/core/target/synapse-core-2.2.0-SNAPSHOT-tests.jar>
[INFO] [install:install {execution: default-install}]
[INFO] Installing <https://builds.apache.org/job/Synapse%20-%20Trunk/ws/java/modules/core/target/synapse-core-2.2.0-SNAPSHOT.jar>
to <https://builds.apache.org/job/Synapse%20-%20Trunk/ws/.repository/org/apache/synapse/synapse-core/2.2.0-SNAPSHOT/synapse-core-2.2.0-SNAPSHOT.jar>
[INFO] Installing <https://builds.apache.org/job/Synapse%20-%20Trunk/ws/java/modules/core/target/synapse-test-lib.zip>
to <https://builds.apache.org/job/Synapse%20-%20Trunk/ws/.repository/org/apache/synapse/synapse-core/2.2.0-SNAPSHOT/synapse-core-2.2.0-SNAPSHOT.zip>
[INFO] Installing <https://builds.apache.org/job/Synapse%20-%20Trunk/ws/java/modules/core/target/synapse-eiptest-lib.zip>
to <https://builds.apache.org/job/Synapse%20-%20Trunk/ws/.repository/org/apache/synapse/synapse-core/2.2.0-SNAPSHOT/synapse-core-2.2.0-SNAPSHOT.zip>
[INFO] Installing <https://builds.apache.org/job/Synapse%20-%20Trunk/ws/java/modules/core/target/synapse-eipcore-lib.zip>
to <https://builds.apache.org/job/Synapse%20-%20Trunk/ws/.repository/org/apache/synapse/synapse-core/2.2.0-SNAPSHOT/synapse-core-2.2.0-SNAPSHOT.zip>
[INFO] Installing <https://builds.apache.org/job/Synapse%20-%20Trunk/ws/java/modules/core/target/synapse-core-2.2.0-SNAPSHOT-tests.jar>
to <https://builds.apache.org/job/Synapse%20-%20Trunk/ws/.repository/org/apache/synapse/synapse-core/2.2.0-SNAPSHOT/synapse-core-2.2.0-SNAPSHOT-tests.jar>
[INFO] [bundle:install {execution: default-install}]
[INFO] Installing org/apache/synapse/synapse-core/2.2.0-SNAPSHOT/synapse-core-2.2.0-SNAPSHOT.jar
[INFO] Writing OBR metadata
[WARNING] DEPRECATED [tasks]: Use target instead
[INFO] [antrun:run {execution: remove_test_lib}]
[WARNING] Parameter tasks is deprecated, use target instead
[INFO] Executing tasks

main:
   [delete] Deleting: <https://builds.apache.org/job/Synapse%20-%20Trunk/ws/java/modules/core/target/synapse-test-lib.zip>
   [delete] Deleting: <https://builds.apache.org/job/Synapse%20-%20Trunk/ws/java/modules/core/target/synapse-eiptest-lib.zip>
   [delete] Deleting: <https://builds.apache.org/job/Synapse%20-%20Trunk/ws/java/modules/core/target/synapse-eipcore-lib.zip>
[INFO] Executed tasks
[INFO] [site:site {execution: default-site}]
[INFO] Parent project loaded from repository: org.apache:apache:pom:9
[INFO] Relativizing decoration links with respect to project URL: http://synapse.apache.org
[INFO] Rendering site with org.apache.maven.skins:maven-default-skin:jar:1.0 skin.
[INFO] Generating "About" report.
[INFO] Generating "Source Repository" report.
[INFO] Generating "Plugin Management" report.
[INFO] Generating "Mailing Lists" report.
[INFO] Generating "Issue Tracking" report.
[INFO] Generating "Project Plugins" report.
[INFO] Generating "Dependency Convergence" report.
[INFO] Generating "Project Summary" report.
[INFO] Generating "Dependency Management" report.
[INFO] Generating "Dependencies" report.
[INFO] Generating "Project License" report.
[INFO] Generating "Project Team" report.
[INFO] Generating "Continuous Integration" report.
[FINDBUGS] No report found for mojo site
[JENKINS] Archiving site from <https://builds.apache.org/job/Synapse%20-%20Trunk/ws/java/modules/core/target/site>
to /home/hudson/hudson/jobs/Synapse - Trunk/site/synapse-core
[INFO] ------------------------------------------------------------------------
[INFO] Building Apache Synapse - Extensions
[INFO]    task-segment: [clean, install, site]
[INFO] ------------------------------------------------------------------------
[INFO] [clean:clean {execution: default-clean}]
[INFO] Deleting <https://builds.apache.org/job/Synapse%20-%20Trunk/ws/java/modules/extensions/target>
[INFO] [remote-resources:process {execution: default}]
[INFO] snapshot org.apache.synapse:synapse-core:2.2.0-SNAPSHOT: checking for updates from
wso2-m2-snapshots
[INFO] snapshot org.apache.synapse:synapse-core:2.2.0-SNAPSHOT: checking for updates from
apache.snapshots
[WARNING] org.apache.velocity.runtime.exception.ReferenceException: reference : template =
META-INF/DEPENDENCIES.vm [line 40,column 14] : $license.name is not a valid reference.
[debug] execute contextualize
[INFO] [resources:resources {execution: default-resources}]
[INFO] Using 'UTF-8' encoding to copy filtered resources.
[INFO] Copying 3 resources
[INFO] Copying 3 resources
[INFO] [compiler:compile {execution: default-compile}]
[INFO] Compiling 25 source files to <https://builds.apache.org/job/Synapse%20-%20Trunk/ws/java/modules/extensions/target/classes>
[debug] execute contextualize
[INFO] [resources:testResources {execution: default-testResources}]
[INFO] Using 'UTF-8' encoding to copy filtered resources.
[INFO] Copying 4 resources
[INFO] Copying 3 resources
[INFO] [compiler:testCompile {execution: default-testCompile}]
[INFO] Compiling 18 source files to <https://builds.apache.org/job/Synapse%20-%20Trunk/ws/java/modules/extensions/target/test-classes>
[INFO] [surefire:test {execution: default-test}]
[INFO] Surefire report directory: <https://builds.apache.org/job/Synapse%20-%20Trunk/ws/java/modules/extensions/target/surefire-reports>

-------------------------------------------------------
 T E S T S
-------------------------------------------------------
Running org.apache.synapse.mediators.xquery.XQueryMediatorSerializationTest
Tests run: 1, Failures: 0, Errors: 0, Skipped: 0, Time elapsed: 0.55 sec
Running org.apache.synapse.mediators.xquery.XQueryMediatorTest
Tests run: 8, Failures: 0, Errors: 0, Skipped: 0, Time elapsed: 0.449 sec
Running org.apache.synapse.mediators.throttle.ThrottleMediatorSerializationTest
Tests run: 1, Failures: 0, Errors: 0, Skipped: 0, Time elapsed: 0.033 sec
Running org.apache.synapse.mediators.throttle.ThrottleMediatorTest
Tests run: 2, Failures: 0, Errors: 0, Skipped: 0, Time elapsed: 6.028 sec
Running org.apache.synapse.mediators.bsf.ScriptMediatorTest
Tests run: 100, Failures: 0, Errors: 0, Skipped: 0, Time elapsed: 1.566 sec
Running org.apache.synapse.mediators.bsf.ScriptMediatorSerializationTest
Tests run: 5, Failures: 0, Errors: 0, Skipped: 0, Time elapsed: 1.761 sec
Running org.apache.synapse.mediators.bsf.ScriptMediatorFactoryTest
Tests run: 3, Failures: 0, Errors: 0, Skipped: 0, Time elapsed: 0.02 sec
[JENKINS] Recording test results
Running org.apache.synapse.mediators.bsf.javascript.JavaScriptMediatorTest
Tests run: 2, Failures: 0, Errors: 0, Skipped: 0, Time elapsed: 0.022 sec
Running org.apache.synapse.mediators.bsf.GroovyScriptMediatorTest
Tests run: 1, Failures: 0, Errors: 0, Skipped: 0, Time elapsed: 0.338 sec
Running org.apache.synapse.mediators.spring.SpringMediatorTest
Tests run: 1, Failures: 0, Errors: 0, Skipped: 0, Time elapsed: 0.17 sec
Running org.apache.synapse.mediators.spring.TestMediateHandlerImpl
Tests run: 0, Failures: 0, Errors: 0, Skipped: 0, Time elapsed: 0 sec
Running org.apache.synapse.TestMediator
Tests run: 0, Failures: 0, Errors: 0, Skipped: 0, Time elapsed: 0 sec
Running org.apache.synapse.format.syslog.SyslogMessageBuilderTest
Tests run: 3, Failures: 0, Errors: 0, Skipped: 0, Time elapsed: 0.182 sec
Running org.apache.synapse.format.hessian.HessianMessageFormatterTest
Tests run: 4, Failures: 0, Errors: 0, Skipped: 0, Time elapsed: 0.014 sec
Running org.apache.synapse.format.hessian.HessianMessageBuilderTest
Tests run: 5, Failures: 0, Errors: 0, Skipped: 0, Time elapsed: 0.003 sec

Results :

Tests run: 136, Failures: 0, Errors: 0, Skipped: 0

[INFO] [bundle:bundle {execution: default-bundle}]
[WARNING] Bundle org.apache.synapse:synapse-extensions:bundle:2.2.0-SNAPSHOT : Did not find
matching referal for !org.apache.synapse.format.hessian.*
[WARNING] Bundle org.apache.synapse:synapse-extensions:bundle:2.2.0-SNAPSHOT : Did not find
matching referal for !org.apache.synapse.format.syslog.*
[WARNING] Bundle org.apache.synapse:synapse-extensions:bundle:2.2.0-SNAPSHOT : Did not find
matching referal for !org.apache.synapse.mediators.bsf.*
[WARNING] Bundle org.apache.synapse:synapse-extensions:bundle:2.2.0-SNAPSHOT : Did not find
matching referal for !org.apache.synapse.mediators.spring.*
[WARNING] Bundle org.apache.synapse:synapse-extensions:bundle:2.2.0-SNAPSHOT : Did not find
matching referal for !org.apache.synapse.mediators.throttle.*
[WARNING] Bundle org.apache.synapse:synapse-extensions:bundle:2.2.0-SNAPSHOT : Did not find
matching referal for !org.apache.synapse.mediators.xquery.*
[INFO] [install:install {execution: default-install}]
[INFO] Installing <https://builds.apache.org/job/Synapse%20-%20Trunk/ws/java/modules/extensions/target/synapse-extensions-2.2.0-SNAPSHOT.jar>
to <https://builds.apache.org/job/Synapse%20-%20Trunk/ws/.repository/org/apache/synapse/synapse-extensions/2.2.0-SNAPSHOT/synapse-extensions-2.2.0-SNAPSHOT.jar>
[INFO] [bundle:install {execution: default-install}]
[INFO] Installing org/apache/synapse/synapse-extensions/2.2.0-SNAPSHOT/synapse-extensions-2.2.0-SNAPSHOT.jar
[INFO] Writing OBR metadata
[INFO] [site:site {execution: default-site}]
[INFO] Parent project loaded from repository: org.apache:apache:pom:9
[INFO] Relativizing decoration links with respect to project URL: http://synapse.apache.org/modules/synapse-extensions
[INFO] Rendering site with org.apache.maven.skins:maven-default-skin:jar:1.0 skin.
[INFO] Generating "About" report.
[INFO] Generating "Source Repository" report.
[INFO] Generating "Plugin Management" report.
[INFO] Generating "Mailing Lists" report.
[INFO] Generating "Issue Tracking" report.
[INFO] Generating "Project Plugins" report.
[INFO] Generating "Dependency Convergence" report.
[INFO] Generating "Project Summary" report.
[INFO] Generating "Dependency Management" report.
[INFO] Generating "Dependencies" report.
[INFO] Generating "Project License" report.
[INFO] Generating "Project Team" report.
[INFO] Generating "Continuous Integration" report.
[FINDBUGS] No report found for mojo site
[JENKINS] Archiving site from <https://builds.apache.org/job/Synapse%20-%20Trunk/ws/java/modules/extensions/target/site>
to /home/hudson/hudson/jobs/Synapse - Trunk/site/synapse-extensions
[INFO] ------------------------------------------------------------------------
[INFO] Building Apache Synapse - Samples
[INFO]    task-segment: [clean, install, site]
[INFO] ------------------------------------------------------------------------
[INFO] [clean:clean {execution: default-clean}]
[INFO] Deleting <https://builds.apache.org/job/Synapse%20-%20Trunk/ws/java/modules/samples/target>
[INFO] [remote-resources:process {execution: default}]
[INFO] snapshot org.apache.synapse:synapse-extensions:2.2.0-SNAPSHOT: checking for updates
from wso2-m2-snapshots
Downloading: http://repository.apache.org/snapshots/org/apache/axis2/axis2-mtompolicy/1.7.0-SNAPSHOT/axis2-mtompolicy-1.7.0-20131219.234624-1654.jar
Downloading: http://repository.apache.org/snapshots/org/apache/rampart/rampart-core/1.7.0-SNAPSHOT/rampart-core-1.7.0-20131220.023918-1196.jar
[INFO] snapshot org.apache.synapse:synapse-extensions:2.2.0-SNAPSHOT: checking for updates
from apache.snapshots
13K downloaded  (axis2-mtompolicy-1.7.0-20131219.234624-1654.jar)
Downloading: http://repository.apache.org/snapshots/org/apache/axis2/mex/1.7.0-SNAPSHOT/mex-1.7.0-20131220.000127-1613-impl.jar
153K downloaded  (rampart-core-1.7.0-20131220.023918-1196.jar)
Downloading: http://repository.apache.org/snapshots/org/apache/rampart/rampart-policy/1.7.0-SNAPSHOT/rampart-policy-1.7.0-20131220.024225-1196.jar
32K downloaded  (mex-1.7.0-20131220.000127-1613-impl.jar)
165K downloaded  (rampart-policy-1.7.0-20131220.024225-1196.jar)
Downloading: http://repository.apache.org/snapshots/org/apache/rampart/rampart-trust/1.7.0-SNAPSHOT/rampart-trust-1.7.0-20131220.024459-1196.jar
119K downloaded  (rampart-trust-1.7.0-20131220.024459-1196.jar)
[WARNING] org.apache.velocity.runtime.exception.ReferenceException: reference : template =
META-INF/DEPENDENCIES.vm [line 40,column 14] : $license.name is not a valid reference.
[debug] execute contextualize
[INFO] [resources:resources {execution: default-resources}]
[INFO] Using 'UTF-8' encoding to copy filtered resources.
[INFO] Copying 0 resource
[INFO] Copying 3 resources
[INFO] [compiler:compile {execution: default-compile}]
[INFO] Compiling 24 source files to <https://builds.apache.org/job/Synapse%20-%20Trunk/ws/java/modules/samples/target/classes>
[debug] execute contextualize
[INFO] [resources:testResources {execution: default-testResources}]
[INFO] Using 'UTF-8' encoding to copy filtered resources.
[INFO] Copying 0 resource
[INFO] Copying 3 resources
[INFO] [compiler:testCompile {execution: default-testCompile}]
[INFO] Compiling 38 source files to <https://builds.apache.org/job/Synapse%20-%20Trunk/ws/java/modules/samples/target/test-classes>
[INFO] [surefire:test {execution: default-test}]
[INFO] Surefire report directory: <https://builds.apache.org/job/Synapse%20-%20Trunk/ws/java/modules/samples/target/surefire-reports>

-------------------------------------------------------
 T E S T S
-------------------------------------------------------

Results :

Tests run: 0, Failures: 0, Errors: 0, Skipped: 0

[INFO] [bundle:bundle {execution: default-bundle}]
[INFO] [install:install {execution: default-install}]
[INFO] Installing <https://builds.apache.org/job/Synapse%20-%20Trunk/ws/java/modules/samples/target/synapse-samples-2.2.0-SNAPSHOT.jar>
to <https://builds.apache.org/job/Synapse%20-%20Trunk/ws/.repository/org/apache/synapse/synapse-samples/2.2.0-SNAPSHOT/synapse-samples-2.2.0-SNAPSHOT.jar>
[INFO] [bundle:install {execution: default-install}]
[INFO] Installing org/apache/synapse/synapse-samples/2.2.0-SNAPSHOT/synapse-samples-2.2.0-SNAPSHOT.jar
[INFO] Writing OBR metadata
[INFO] [site:site {execution: default-site}]
[INFO] Parent project loaded from repository: org.apache:apache:pom:9
[INFO] Relativizing decoration links with respect to project URL: http://synapse.apache.org/modules/synapse-samples
[INFO] Rendering site with org.apache.maven.skins:maven-default-skin:jar:1.0 skin.
[INFO] Generating "About" report.
[INFO] Generating "Source Repository" report.
[INFO] Generating "Plugin Management" report.
[INFO] Generating "Mailing Lists" report.
[INFO] Generating "Issue Tracking" report.
[INFO] Generating "Project Plugins" report.
[INFO] Generating "Dependency Convergence" report.
[INFO] Generating "Project Summary" report.
[INFO] Generating "Dependency Management" report.
[INFO] Generating "Dependencies" report.
[INFO] Generating "Project License" report.
[INFO] Generating "Project Team" report.
[INFO] Generating "Continuous Integration" report.
[JENKINS] Recording test results
[FINDBUGS] No report found for mojo site
[JENKINS] Archiving site from <https://builds.apache.org/job/Synapse%20-%20Trunk/ws/java/modules/samples/target/site>
to /home/hudson/hudson/jobs/Synapse - Trunk/site/synapse-samples
Build timed out (after 315 minutes). Marking the build as failed.
[INFO] ------------------------------------------------------------------------
[ERROR] FATAL ERROR
[INFO] ------------------------------------------------------------------------
[INFO] Unable to call setResult. Invalid object ID 22
[INFO] ------------------------------------------------------------------------
[INFO] Trace
java.lang.IllegalStateException: Unable to call setResult. Invalid object ID 22
	at hudson.remoting.RemoteInvocationHandler$RPCRequest.perform(RemoteInvocationHandler.java:293)
	at hudson.remoting.RemoteInvocationHandler$RPCRequest.call(RemoteInvocationHandler.java:280)
	at hudson.remoting.RemoteInvocationHandler$RPCRequest.call(RemoteInvocationHandler.java:239)
	at hudson.remoting.UserRequest.perform(UserRequest.java:118)
	at hudson.remoting.UserRequest.perform(UserRequest.java:48)
	at hudson.remoting.Request$2.run(Request.java:328)
	at hudson.remoting.InterceptingExecutorService$1.call(InterceptingExecutorService.java:72)
	at java.util.concurrent.FutureTask.run(FutureTask.java:262)
	at java.util.concurrent.ThreadPoolExecutor.runWorker(ThreadPoolExecutor.java:1145)
	at java.util.concurrent.ThreadPoolExecutor$Worker.run(ThreadPoolExecutor.java:615)
	at java.lang.Thread.run(Thread.java:744)
[INFO] ------------------------------------------------------------------------
[INFO] Total time: 314 minutes 
[INFO] Finished at: Fri Dec 20 09:49:22 UTC 2013
[INFO] Final Memory: 129M/327M
[INFO] ------------------------------------------------------------------------
Waiting for Jenkins to finish collecting data
Disk usage plugin fails during calculation disk usage of this build.
channel stopped
[locks-and-latches] Releasing all the locks
[locks-and-latches] All the locks released

---------------------------------------------------------------------
To unsubscribe, e-mail: dev-unsubscribe@synapse.apache.org
For additional commands, e-mail: dev-help@synapse.apache.org


Mime
View raw message