synapse-dev mailing list archives

Site index · List index
Message view « Date » · « Thread »
Top « Date » · « Thread »
From Apache Jenkins Server <jenk...@builds.apache.org>
Subject Build failed in Jenkins: Synapse - Trunk #4777
Date Tue, 17 Dec 2013 01:52:18 GMT
See <https://builds.apache.org/job/Synapse%20-%20Trunk/4777/>

------------------------------------------
[...truncated 9186 lines...]
[INFO] [compiler:compile {execution: default-compile}]
[INFO] No sources to compile
[WARNING] DEPRECATED [tasks]: Use target instead
[INFO] [antrun:run {execution: create_repo}]
[WARNING] Parameter tasks is deprecated, use target instead
[INFO] Executing tasks

main:
     [echo] *** Creating testing repositories for synapse samples
    [mkdir] Created dir: <https://builds.apache.org/job/Synapse%20-%20Trunk/ws/java/modules/integration/target/temp/classes>
    [javac] Compiling 9 source files to <https://builds.apache.org/job/Synapse%20-%20Trunk/ws/java/modules/integration/target/temp/classes>
    [mkdir] Created dir: <https://builds.apache.org/job/Synapse%20-%20Trunk/ws/java/modules/integration/target/temp/SimpleStockQuote>
    [mkdir] Created dir: <https://builds.apache.org/job/Synapse%20-%20Trunk/ws/java/modules/integration/target/temp/SimpleStockQuote/META-INF>
     [copy] Copying 1 file to <https://builds.apache.org/job/Synapse%20-%20Trunk/ws/java/modules/integration/target/temp/SimpleStockQuote/META-INF>
     [copy] Copying 9 files to <https://builds.apache.org/job/Synapse%20-%20Trunk/ws/java/modules/integration/target/temp/SimpleStockQuote>
      [jar] Building jar: <https://builds.apache.org/job/Synapse%20-%20Trunk/ws/java/modules/integration/target/test_repos/axis2Server/services/SimpleStockQuoteService.aar>
   [delete] Deleting directory <https://builds.apache.org/job/Synapse%20-%20Trunk/ws/java/modules/integration/target/temp>
    [mkdir] Created dir: <https://builds.apache.org/job/Synapse%20-%20Trunk/ws/java/modules/integration/target/temp>
    [mkdir] Created dir: <https://builds.apache.org/job/Synapse%20-%20Trunk/ws/java/modules/integration/target/temp/classes>
    [javac] Compiling 9 source files to <https://builds.apache.org/job/Synapse%20-%20Trunk/ws/java/modules/integration/target/temp/classes>
    [mkdir] Created dir: <https://builds.apache.org/job/Synapse%20-%20Trunk/ws/java/modules/integration/target/temp/SecureStockQuoteService>
    [mkdir] Created dir: <https://builds.apache.org/job/Synapse%20-%20Trunk/ws/java/modules/integration/target/temp/SecureStockQuoteService/META-INF>
     [copy] Copying 1 file to <https://builds.apache.org/job/Synapse%20-%20Trunk/ws/java/modules/integration/target/temp/SecureStockQuoteService/META-INF>
     [copy] Copying 1 file to <https://builds.apache.org/job/Synapse%20-%20Trunk/ws/java/modules/integration/target/temp/SecureStockQuoteService>
     [copy] Copying 9 files to <https://builds.apache.org/job/Synapse%20-%20Trunk/ws/java/modules/integration/target/temp/SecureStockQuoteService>
      [jar] Building jar: <https://builds.apache.org/job/Synapse%20-%20Trunk/ws/java/modules/integration/target/test_repos/axis2Server/services/SecureStockQuoteService.aar>
   [delete] Deleting directory <https://builds.apache.org/job/Synapse%20-%20Trunk/ws/java/modules/integration/target/temp>
    [mkdir] Created dir: <https://builds.apache.org/job/Synapse%20-%20Trunk/ws/java/modules/integration/target/temp>
    [mkdir] Created dir: <https://builds.apache.org/job/Synapse%20-%20Trunk/ws/java/modules/integration/target/temp/classes>
    [javac] Compiling 1 source file to <https://builds.apache.org/job/Synapse%20-%20Trunk/ws/java/modules/integration/target/temp/classes>
    [mkdir] Created dir: <https://builds.apache.org/job/Synapse%20-%20Trunk/ws/java/modules/integration/target/temp/MTOMSwASampleService>
    [mkdir] Created dir: <https://builds.apache.org/job/Synapse%20-%20Trunk/ws/java/modules/integration/target/temp/MTOMSwASampleService/META-INF>
     [copy] Copying 1 file to <https://builds.apache.org/job/Synapse%20-%20Trunk/ws/java/modules/integration/target/temp/MTOMSwASampleService/META-INF>
     [copy] Copying 1 file to <https://builds.apache.org/job/Synapse%20-%20Trunk/ws/java/modules/integration/target/temp/MTOMSwASampleService>
      [jar] Building jar: <https://builds.apache.org/job/Synapse%20-%20Trunk/ws/java/modules/integration/target/test_repos/axis2Server/services/MTOMSwASampleService.aar>
   [delete] Deleting directory <https://builds.apache.org/job/Synapse%20-%20Trunk/ws/java/modules/integration/target/temp>
    [mkdir] Created dir: <https://builds.apache.org/job/Synapse%20-%20Trunk/ws/java/modules/integration/target/temp>
    [mkdir] Created dir: <https://builds.apache.org/job/Synapse%20-%20Trunk/ws/java/modules/integration/target/temp/classes>
    [javac] Compiling 2 source files to <https://builds.apache.org/job/Synapse%20-%20Trunk/ws/java/modules/integration/target/temp/classes>
    [mkdir] Created dir: <https://builds.apache.org/job/Synapse%20-%20Trunk/ws/java/modules/integration/target/temp/LBService1>
    [mkdir] Created dir: <https://builds.apache.org/job/Synapse%20-%20Trunk/ws/java/modules/integration/target/temp/LBService1/META-INF>
     [copy] Copying 1 file to <https://builds.apache.org/job/Synapse%20-%20Trunk/ws/java/modules/integration/target/temp/LBService1/META-INF>
     [copy] Copying 1 file to <https://builds.apache.org/job/Synapse%20-%20Trunk/ws/java/modules/integration/target/temp/LBService1>
      [jar] Building jar: <https://builds.apache.org/job/Synapse%20-%20Trunk/ws/java/modules/integration/target/test_repos/axis2Server/services/LBService1.aar>
    [mkdir] Created dir: <https://builds.apache.org/job/Synapse%20-%20Trunk/ws/java/modules/integration/target/temp/LBService2>
    [mkdir] Created dir: <https://builds.apache.org/job/Synapse%20-%20Trunk/ws/java/modules/integration/target/temp/LBService2/META-INF>
     [copy] Copying 1 file to <https://builds.apache.org/job/Synapse%20-%20Trunk/ws/java/modules/integration/target/temp/LBService2/META-INF>
     [copy] Copying 1 file to <https://builds.apache.org/job/Synapse%20-%20Trunk/ws/java/modules/integration/target/temp/LBService2>
      [jar] Building jar: <https://builds.apache.org/job/Synapse%20-%20Trunk/ws/java/modules/integration/target/test_repos/axis2Server/services/LBService2.aar>
[INFO] Executed tasks
[INFO] [dependency:copy {execution: copy}]
[INFO] Configured Artifact: org.apache.axis2:addressing:1.7.0-SNAPSHOT:mar
[INFO] Configured Artifact: org.apache.rampart:rampart:1.7.0-SNAPSHOT:mar
[INFO] Configured Artifact: org.apache.axis2:addressing:1.7.0-SNAPSHOT:mar
[INFO] Configured Artifact: org.apache.rampart:rampart:1.7.0-SNAPSHOT:mar
[INFO] Configured Artifact: org.apache.axis2:addressing:1.7.0-SNAPSHOT:mar
[INFO] Configured Artifact: org.apache.rampart:rampart:1.7.0-SNAPSHOT:mar
[INFO] org.apache.axis2:addressing:1.7.0-SNAPSHOT:mar already exists in <https://builds.apache.org/job/Synapse%20-%20Trunk/ws/java/modules/integration/target/test_repos/axis2Server/modules>
[INFO] org.apache.rampart:rampart:1.7.0-SNAPSHOT:mar already exists in <https://builds.apache.org/job/Synapse%20-%20Trunk/ws/java/modules/integration/target/test_repos/axis2Server/modules>
[INFO] org.apache.axis2:addressing:1.7.0-SNAPSHOT:mar already exists in <https://builds.apache.org/job/Synapse%20-%20Trunk/ws/java/modules/integration/target/test_repos/axis2Client/modules>
[INFO] org.apache.rampart:rampart:1.7.0-SNAPSHOT:mar already exists in <https://builds.apache.org/job/Synapse%20-%20Trunk/ws/java/modules/integration/target/test_repos/axis2Client/modules>
[INFO] org.apache.axis2:addressing:1.7.0-SNAPSHOT:mar already exists in <https://builds.apache.org/job/Synapse%20-%20Trunk/ws/java/modules/integration/target/test_repos/synapse/modules>
[INFO] org.apache.rampart:rampart:1.7.0-SNAPSHOT:mar already exists in <https://builds.apache.org/job/Synapse%20-%20Trunk/ws/java/modules/integration/target/test_repos/synapse/modules>
[debug] execute contextualize
[INFO] [resources:testResources {execution: default-testResources}]
[INFO] Using 'UTF-8' encoding to copy filtered resources.
[INFO] Copying 93 resources
[INFO] Copying 3 resources
[INFO] Copying 3 resources
[INFO] [compiler:testCompile {execution: default-testCompile}]
[INFO] Nothing to compile - all classes are up to date
[INFO] [surefire:test {execution: default-test}]
[INFO] Skipping execution of surefire because it has already been run for this configuration
[JENKINS] Recording test results
ERROR: Could not find local repository for 2.2.1
[INFO] [site:site {execution: default-site}]
[INFO] Parent project loaded from repository: org.apache:apache:pom:9
[INFO] Relativizing decoration links with respect to project URL: http://synapse.apache.org/modules/synapse-integration
[INFO] Rendering site with org.apache.maven.skins:maven-default-skin:jar:1.0 skin.
[INFO] Skipped "Surefire Report" report, file "sample_automation.html" already exists for
the English version.
[INFO] Generating "About" report.
[INFO] Generating "Source Repository" report.
[INFO] Generating "Plugin Management" report.
[INFO] Generating "Mailing Lists" report.
[INFO] Generating "Issue Tracking" report.
[INFO] Generating "Project Plugins" report.
[INFO] Generating "Dependency Convergence" report.
[INFO] Generating "Project Summary" report.
[INFO] Generating "Dependency Management" report.
[INFO] Generating "Dependencies" report.
[INFO] Generating "Project License" report.
[INFO] Generating "Project Team" report.
[INFO] Generating "Continuous Integration" report.
[INFO] Generating "Surefire Report" report.
[WARNING] Unable to locate Test Source XRef to link to - DISABLED
[FINDBUGS] No report found for mojo site
[JENKINS] Archiving site from <https://builds.apache.org/job/Synapse%20-%20Trunk/ws/java/modules/integration/target/site>
to /home/hudson/hudson/jobs/Synapse - Trunk/site/synapse-integration
[INFO] 
[INFO] 
[INFO] ------------------------------------------------------------------------
[INFO] Reactor Summary:
[INFO] ------------------------------------------------------------------------
[INFO] Apache Synapse ........................................ SUCCESS [1:26.215s]
[INFO] Apache Synapse - Secure Vault ......................... SUCCESS [1:29.001s]
[INFO] Apache Synapse - Commons .............................. SUCCESS [45.521s]
[INFO] Apache Synapse - Transports ........................... SUCCESS [27.515s]
[INFO] Apache Synapse - Non-blocking HTTP/s Transport ........ SUCCESS [1:05.109s]
[INFO] Apache Synapse - PIPE Transport ....................... SUCCESS [46.939s]
[INFO] Apache Synapse - VFS Transport ........................ SUCCESS [35.529s]
[INFO] Apache Synapse - FIX Transport ........................ SUCCESS [53.110s]
[INFO] Apache Synapse - AMQP Transport ....................... SUCCESS [18.824s]
[INFO] Apache Synapse - Tasks ................................ SUCCESS [16.265s]
[INFO] Apache Synapse - Core ................................. SUCCESS [3:13.949s]
[INFO] Apache Synapse - Extensions ........................... SUCCESS [44.528s]
[INFO] Apache Synapse - Samples .............................. SUCCESS [32.353s]
[INFO] Apache Synapse - Patches .............................. SUCCESS [19.741s]
[INFO] Apache Synapse - Experimental code .................... SUCCESS [15.766s]
[INFO] Apache Synapse - Documentation ........................ SUCCESS [1:02.382s]
[INFO] Apache Synapse - Web Application ...................... SUCCESS [25.483s]
[INFO] Apache Synapse - Handler Module ....................... SUCCESS [10.850s]
[INFO] Apache Synapse - XAR Maven Plugin ..................... SUCCESS [16.499s]
[INFO] Apache Synapse - Configuration Migrator ............... SUCCESS [14.547s]
[INFO] Apache Synapse - Distribution ......................... SUCCESS [1:08.362s]
[INFO] Apache Synapse - Package skeleton ZIP ................. SUCCESS [14.742s]
[INFO] Apache Synapse - Package archetype .................... SUCCESS [35.829s]
[INFO] Apache Synapse - Integration .......................... SUCCESS [3:06.829s]
[INFO] ------------------------------------------------------------------------
[INFO] ------------------------------------------------------------------------
[INFO] BUILD SUCCESSFUL
[INFO] ------------------------------------------------------------------------
[INFO] Total time: 21 minutes 59 seconds
[INFO] Finished at: Tue Dec 17 01:51:19 UTC 2013
[INFO] Final Memory: 152M/543M
[INFO] ------------------------------------------------------------------------
[JENKINS] Archiving <https://builds.apache.org/job/Synapse%20-%20Trunk/ws/java/modules/migrator/pom.xml>
to org.apache.synapse/synapse-config-migrator/2.2.0-SNAPSHOT/synapse-config-migrator-2.2.0-SNAPSHOT.pom
[JENKINS] Archiving <https://builds.apache.org/job/Synapse%20-%20Trunk/ws/java/modules/migrator/target/synapse-config-migrator-2.2.0-SNAPSHOT.jar>
to org.apache.synapse/synapse-config-migrator/2.2.0-SNAPSHOT/synapse-config-migrator-2.2.0-SNAPSHOT.jar
[JENKINS] Archiving <https://builds.apache.org/job/Synapse%20-%20Trunk/ws/java/modules/xar-maven-plugin/pom.xml>
to org.apache.synapse/synapse-xar-maven-plugin/2.2.0-SNAPSHOT/synapse-xar-maven-plugin-2.2.0-SNAPSHOT.pom
[JENKINS] Archiving <https://builds.apache.org/job/Synapse%20-%20Trunk/ws/java/modules/xar-maven-plugin/target/synapse-xar-maven-plugin-2.2.0-SNAPSHOT.jar>
to org.apache.synapse/synapse-xar-maven-plugin/2.2.0-SNAPSHOT/synapse-xar-maven-plugin-2.2.0-SNAPSHOT.jar
[JENKINS] Archiving <https://builds.apache.org/job/Synapse%20-%20Trunk/ws/java/modules/handler/pom.xml>
to org.apache.synapse/synapse-handler/2.2.0-SNAPSHOT/synapse-handler-2.2.0-SNAPSHOT.pom
[JENKINS] Archiving <https://builds.apache.org/job/Synapse%20-%20Trunk/ws/java/modules/handler/target/synapse-handler-2.2.0-SNAPSHOT.jar>
to org.apache.synapse/synapse-handler/2.2.0-SNAPSHOT/synapse-handler-2.2.0-SNAPSHOT.jar
[JENKINS] Archiving <https://builds.apache.org/job/Synapse%20-%20Trunk/ws/java/modules/handler/target/synapse-handler-2.2.0-SNAPSHOT.mar>
to org.apache.synapse/synapse-handler/2.2.0-SNAPSHOT/synapse-handler-2.2.0-SNAPSHOT.mar
[JENKINS] Archiving <https://builds.apache.org/job/Synapse%20-%20Trunk/ws/java/modules/tasks/pom.xml>
to org.apache.synapse/synapse-tasks/2.2.0-SNAPSHOT/synapse-tasks-2.2.0-SNAPSHOT.pom
[JENKINS] Archiving <https://builds.apache.org/job/Synapse%20-%20Trunk/ws/java/modules/tasks/target/synapse-tasks-2.2.0-SNAPSHOT.jar>
to org.apache.synapse/synapse-tasks/2.2.0-SNAPSHOT/synapse-tasks-2.2.0-SNAPSHOT.jar
[JENKINS] Archiving <https://builds.apache.org/job/Synapse%20-%20Trunk/ws/java/modules/extensions/pom.xml>
to org.apache.synapse/synapse-extensions/2.2.0-SNAPSHOT/synapse-extensions-2.2.0-SNAPSHOT.pom
[JENKINS] Archiving <https://builds.apache.org/job/Synapse%20-%20Trunk/ws/java/modules/extensions/target/synapse-extensions-2.2.0-SNAPSHOT.jar>
to org.apache.synapse/synapse-extensions/2.2.0-SNAPSHOT/synapse-extensions-2.2.0-SNAPSHOT.jar
[JENKINS] Archiving <https://builds.apache.org/job/Synapse%20-%20Trunk/ws/java/modules/experimental/pom.xml>
to org.apache.synapse/synapse-experimental/2.2.0-SNAPSHOT/synapse-experimental-2.2.0-SNAPSHOT.pom
[JENKINS] Archiving <https://builds.apache.org/job/Synapse%20-%20Trunk/ws/java/modules/experimental/target/synapse-experimental-2.2.0-SNAPSHOT.jar>
to org.apache.synapse/synapse-experimental/2.2.0-SNAPSHOT/synapse-experimental-2.2.0-SNAPSHOT.jar
[JENKINS] Archiving <https://builds.apache.org/job/Synapse%20-%20Trunk/ws/.repository/org/apache/synapse/Apache-Synapse/2.2.0-SNAPSHOT/Apache-Synapse-2.2.0-SNAPSHOT.pom>
to org.apache.synapse/Apache-Synapse/2.2.0-SNAPSHOT/Apache-Synapse-2.2.0-SNAPSHOT.pom
<https://builds.apache.org/job/Synapse%20-%20Trunk/ws/.repository/org/apache/synapse/Apache-Synapse/2.2.0-SNAPSHOT/Apache-Synapse-2.2.0-SNAPSHOT.pom>
is not inside <https://builds.apache.org/job/Synapse%20-%20Trunk/ws/java/;> will archive
in a separate pass
[JENKINS] Archiving <https://builds.apache.org/job/Synapse%20-%20Trunk/ws/java/modules/commons/pom.xml>
to org.apache.synapse/synapse-commons/2.2.0-SNAPSHOT/synapse-commons-2.2.0-SNAPSHOT.pom
[JENKINS] Archiving <https://builds.apache.org/job/Synapse%20-%20Trunk/ws/java/modules/commons/target/synapse-commons-2.2.0-SNAPSHOT.jar>
to org.apache.synapse/synapse-commons/2.2.0-SNAPSHOT/synapse-commons-2.2.0-SNAPSHOT.jar
[JENKINS] Archiving <https://builds.apache.org/job/Synapse%20-%20Trunk/ws/java/modules/transports/core/nhttp/pom.xml>
to org.apache.synapse/synapse-nhttp-transport/2.2.0-SNAPSHOT/synapse-nhttp-transport-2.2.0-SNAPSHOT.pom
[JENKINS] Archiving <https://builds.apache.org/job/Synapse%20-%20Trunk/ws/java/modules/transports/core/nhttp/target/synapse-nhttp-transport-2.2.0-SNAPSHOT.jar>
to org.apache.synapse/synapse-nhttp-transport/2.2.0-SNAPSHOT/synapse-nhttp-transport-2.2.0-SNAPSHOT.jar
[JENKINS] Archiving <https://builds.apache.org/job/Synapse%20-%20Trunk/ws/java/modules/transports/core/nhttp/target/synapse-nhttp-transport-2.2.0-SNAPSHOT-testkit-logs.zip>
to org.apache.synapse/synapse-nhttp-transport/2.2.0-SNAPSHOT/synapse-nhttp-transport-2.2.0-SNAPSHOT-testkit-logs.zip
[JENKINS] Archiving <https://builds.apache.org/job/Synapse%20-%20Trunk/ws/.repository/org/apache/synapse/synapse-package-skeleton/2.2.0-SNAPSHOT/synapse-package-skeleton-2.2.0-SNAPSHOT.pom>
to org.apache.synapse/synapse-package-skeleton/2.2.0-SNAPSHOT/synapse-package-skeleton-2.2.0-SNAPSHOT.pom
[JENKINS] Archiving <https://builds.apache.org/job/Synapse%20-%20Trunk/ws/java/modules/packaging/package-skeleton/target/synapse-package-skeleton-2.2.0-SNAPSHOT-skeleton.zip>
to org.apache.synapse/synapse-package-skeleton/2.2.0-SNAPSHOT/synapse-package-skeleton-2.2.0-SNAPSHOT-skeleton.zip
<https://builds.apache.org/job/Synapse%20-%20Trunk/ws/.repository/org/apache/synapse/synapse-package-skeleton/2.2.0-SNAPSHOT/synapse-package-skeleton-2.2.0-SNAPSHOT.pom>
is not inside <https://builds.apache.org/job/Synapse%20-%20Trunk/ws/java/modules/packaging/package-skeleton/;>
will archive in a separate pass
[JENKINS] Archiving <https://builds.apache.org/job/Synapse%20-%20Trunk/ws/.repository/org/apache/synapse/synapse-distribution/2.2.0-SNAPSHOT/synapse-distribution-2.2.0-SNAPSHOT.pom>
to org.apache.synapse/synapse-distribution/2.2.0-SNAPSHOT/synapse-distribution-2.2.0-SNAPSHOT.pom
[JENKINS] Archiving <https://builds.apache.org/job/Synapse%20-%20Trunk/ws/java/modules/distribution/target/synapse-2.2.0-SNAPSHOT-bin.zip>
to org.apache.synapse/synapse-distribution/2.2.0-SNAPSHOT/synapse-distribution-2.2.0-SNAPSHOT-bin.zip
<https://builds.apache.org/job/Synapse%20-%20Trunk/ws/.repository/org/apache/synapse/synapse-distribution/2.2.0-SNAPSHOT/synapse-distribution-2.2.0-SNAPSHOT.pom>
is not inside <https://builds.apache.org/job/Synapse%20-%20Trunk/ws/java/modules/distribution/;>
will archive in a separate pass
[JENKINS] Archiving <https://builds.apache.org/job/Synapse%20-%20Trunk/ws/java/modules/war/pom.xml>
to org.apache.synapse/synapse-war/2.2.0-SNAPSHOT/synapse-war-2.2.0-SNAPSHOT.pom
[JENKINS] Archiving <https://builds.apache.org/job/Synapse%20-%20Trunk/ws/java/target/synapse.war>
to org.apache.synapse/synapse-war/2.2.0-SNAPSHOT/synapse-war-2.2.0-SNAPSHOT.war
<https://builds.apache.org/job/Synapse%20-%20Trunk/ws/java/target/synapse.war> is not
inside <https://builds.apache.org/job/Synapse%20-%20Trunk/ws/java/modules/war/;> will
archive in a separate pass
[JENKINS] Archiving <https://builds.apache.org/job/Synapse%20-%20Trunk/ws/java/modules/patches/pom.xml>
to org.apache.synapse/synapse-patches/2.2.0-SNAPSHOT/synapse-patches-2.2.0-SNAPSHOT.pom
[JENKINS] Archiving <https://builds.apache.org/job/Synapse%20-%20Trunk/ws/java/modules/patches/target/synapse-patches-2.2.0-SNAPSHOT.jar>
to org.apache.synapse/synapse-patches/2.2.0-SNAPSHOT/synapse-patches-2.2.0-SNAPSHOT.jar
[JENKINS] Archiving <https://builds.apache.org/job/Synapse%20-%20Trunk/ws/java/modules/patches/target/synapse-patches-2.2.0-SNAPSHOT-jars.zip>
to org.apache.synapse/synapse-patches/2.2.0-SNAPSHOT/synapse-patches-2.2.0-SNAPSHOT-jars.zip
[JENKINS] Archiving <https://builds.apache.org/job/Synapse%20-%20Trunk/ws/java/modules/packaging/package-archetype/pom.xml>
to org.apache.synapse/synapse-package-archetype/2.2.0-SNAPSHOT/synapse-package-archetype-2.2.0-SNAPSHOT.pom
[JENKINS] Archiving <https://builds.apache.org/job/Synapse%20-%20Trunk/ws/java/modules/packaging/package-archetype/target/synapse-package-archetype-2.2.0-SNAPSHOT.jar>
to org.apache.synapse/synapse-package-archetype/2.2.0-SNAPSHOT/synapse-package-archetype-2.2.0-SNAPSHOT.jar
[JENKINS] Archiving <https://builds.apache.org/job/Synapse%20-%20Trunk/ws/java/modules/transports/optional/fix/pom.xml>
to org.apache.synapse/synapse-fix-transport/2.2.0-SNAPSHOT/synapse-fix-transport-2.2.0-SNAPSHOT.pom
[JENKINS] Archiving <https://builds.apache.org/job/Synapse%20-%20Trunk/ws/java/modules/transports/optional/fix/target/synapse-fix-transport-2.2.0-SNAPSHOT.jar>
to org.apache.synapse/synapse-fix-transport/2.2.0-SNAPSHOT/synapse-fix-transport-2.2.0-SNAPSHOT.jar
[JENKINS] Archiving <https://builds.apache.org/job/Synapse%20-%20Trunk/ws/.repository/org/apache/synapse/synapse-transports/2.2.0-SNAPSHOT/synapse-transports-2.2.0-SNAPSHOT.pom>
to org.apache.synapse/synapse-transports/2.2.0-SNAPSHOT/synapse-transports-2.2.0-SNAPSHOT.pom
<https://builds.apache.org/job/Synapse%20-%20Trunk/ws/.repository/org/apache/synapse/synapse-transports/2.2.0-SNAPSHOT/synapse-transports-2.2.0-SNAPSHOT.pom>
is not inside <https://builds.apache.org/job/Synapse%20-%20Trunk/ws/java/modules/transports/;>
will archive in a separate pass
[JENKINS] Archiving <https://builds.apache.org/job/Synapse%20-%20Trunk/ws/java/modules/samples/pom.xml>
to org.apache.synapse/synapse-samples/2.2.0-SNAPSHOT/synapse-samples-2.2.0-SNAPSHOT.pom
[JENKINS] Archiving <https://builds.apache.org/job/Synapse%20-%20Trunk/ws/java/modules/samples/target/synapse-samples-2.2.0-SNAPSHOT.jar>
to org.apache.synapse/synapse-samples/2.2.0-SNAPSHOT/synapse-samples-2.2.0-SNAPSHOT.jar
[JENKINS] Archiving <https://builds.apache.org/job/Synapse%20-%20Trunk/ws/java/modules/securevault/pom.xml>
to org.apache.synapse/synapse-securevault/2.2.0-SNAPSHOT/synapse-securevault-2.2.0-SNAPSHOT.pom
[JENKINS] Archiving <https://builds.apache.org/job/Synapse%20-%20Trunk/ws/java/modules/securevault/target/synapse-securevault-2.2.0-SNAPSHOT.jar>
to org.apache.synapse/synapse-securevault/2.2.0-SNAPSHOT/synapse-securevault-2.2.0-SNAPSHOT.jar
[JENKINS] Archiving <https://builds.apache.org/job/Synapse%20-%20Trunk/ws/.repository/org/apache/synapse/synapse-documentation/2.2.0-SNAPSHOT/synapse-documentation-2.2.0-SNAPSHOT.pom>
to org.apache.synapse/synapse-documentation/2.2.0-SNAPSHOT/synapse-documentation-2.2.0-SNAPSHOT.pom
[JENKINS] Archiving <https://builds.apache.org/job/Synapse%20-%20Trunk/ws/java/modules/documentation/target/synapse-documentation-2.2.0-SNAPSHOT-site.xml>
to org.apache.synapse/synapse-documentation/2.2.0-SNAPSHOT/synapse-documentation-2.2.0-SNAPSHOT-site.xml
[JENKINS] Archiving <https://builds.apache.org/job/Synapse%20-%20Trunk/ws/java/modules/documentation/target/synapse-documentation-2.2.0-SNAPSHOT-docs.zip>
to org.apache.synapse/synapse-documentation/2.2.0-SNAPSHOT/synapse-documentation-2.2.0-SNAPSHOT-docs.zip
<https://builds.apache.org/job/Synapse%20-%20Trunk/ws/.repository/org/apache/synapse/synapse-documentation/2.2.0-SNAPSHOT/synapse-documentation-2.2.0-SNAPSHOT.pom>
is not inside <https://builds.apache.org/job/Synapse%20-%20Trunk/ws/java/modules/documentation/;>
will archive in a separate pass
[JENKINS] Archiving <https://builds.apache.org/job/Synapse%20-%20Trunk/ws/java/modules/transports/core/pipe/pom.xml>
to org.apache.synapse/synapse-pipe-transport/2.2.0-SNAPSHOT/synapse-pipe-transport-2.2.0-SNAPSHOT.pom
[JENKINS] Archiving <https://builds.apache.org/job/Synapse%20-%20Trunk/ws/java/modules/transports/core/pipe/target/synapse-pipe-transport-2.2.0-SNAPSHOT.jar>
to org.apache.synapse/synapse-pipe-transport/2.2.0-SNAPSHOT/synapse-pipe-transport-2.2.0-SNAPSHOT.jar
[JENKINS] Archiving <https://builds.apache.org/job/Synapse%20-%20Trunk/ws/java/modules/integration/pom.xml>
to org.apache.synapse/synapse-integration/2.2.0-SNAPSHOT/synapse-integration-2.2.0-SNAPSHOT.pom
[JENKINS] Archiving <https://builds.apache.org/job/Synapse%20-%20Trunk/ws/java/modules/integration/target/synapse-integration-2.2.0-SNAPSHOT.jar>
to org.apache.synapse/synapse-integration/2.2.0-SNAPSHOT/synapse-integration-2.2.0-SNAPSHOT.jar
[JENKINS] Archiving <https://builds.apache.org/job/Synapse%20-%20Trunk/ws/java/modules/transports/optional/amqp/pom.xml>
to org.apache.synapse/synapse-amqp-transport/2.2.0-SNAPSHOT/synapse-amqp-transport-2.2.0-SNAPSHOT.pom
[JENKINS] Archiving <https://builds.apache.org/job/Synapse%20-%20Trunk/ws/java/modules/transports/optional/amqp/target/synapse-amqp-transport-2.2.0-SNAPSHOT.jar>
to org.apache.synapse/synapse-amqp-transport/2.2.0-SNAPSHOT/synapse-amqp-transport-2.2.0-SNAPSHOT.jar
[JENKINS] Archiving <https://builds.apache.org/job/Synapse%20-%20Trunk/ws/java/modules/core/pom.xml>
to org.apache.synapse/synapse-core/2.2.0-SNAPSHOT/synapse-core-2.2.0-SNAPSHOT.pom
[JENKINS] Archiving <https://builds.apache.org/job/Synapse%20-%20Trunk/ws/java/modules/core/target/synapse-core-2.2.0-SNAPSHOT.jar>
to org.apache.synapse/synapse-core/2.2.0-SNAPSHOT/synapse-core-2.2.0-SNAPSHOT.jar
[JENKINS] Archiving <https://builds.apache.org/job/Synapse%20-%20Trunk/ws/java/modules/core/target/synapse-core-2.2.0-SNAPSHOT-tests.jar>
to org.apache.synapse/synapse-core/2.2.0-SNAPSHOT/synapse-core-2.2.0-SNAPSHOT-tests.jar
[JENKINS] Archiving <https://builds.apache.org/job/Synapse%20-%20Trunk/ws/java/modules/transports/core/vfs/pom.xml>
to org.apache.synapse/synapse-vfs-transport/2.2.0-SNAPSHOT/synapse-vfs-transport-2.2.0-SNAPSHOT.pom
[JENKINS] Archiving <https://builds.apache.org/job/Synapse%20-%20Trunk/ws/java/modules/transports/core/vfs/target/synapse-vfs-transport-2.2.0-SNAPSHOT.jar>
to org.apache.synapse/synapse-vfs-transport/2.2.0-SNAPSHOT/synapse-vfs-transport-2.2.0-SNAPSHOT.jar
[JENKINS] Archiving <https://builds.apache.org/job/Synapse%20-%20Trunk/ws/java/modules/transports/core/vfs/target/synapse-vfs-transport-2.2.0-SNAPSHOT-testkit-logs.zip>
to org.apache.synapse/synapse-vfs-transport/2.2.0-SNAPSHOT/synapse-vfs-transport-2.2.0-SNAPSHOT-testkit-logs.zip
channel stopped
[locks-and-latches] Releasing all the locks
[locks-and-latches] All the locks released
Maven RedeployPublisher use remote ubuntu1 maven settings from : /home/jenkins/.m2/settings.xml
[INFO] Deployment in https://repository.apache.org/content/repositories/snapshots (id=apache.snapshots.https,uniqueVersion=false)
Deploying the main artifact jenkins-8090943884133236283Apache-Synapse-2.2.0-SNAPSHOT.pom
[INFO] Deployment in https://repository.apache.org/content/repositories/snapshots (id=apache.snapshots.https,uniqueVersion=false)
Deploying the main artifact jenkins-859261352785761644synapse-amqp-transport-2.2.0-SNAPSHOT.jar
[INFO] Deployment in https://repository.apache.org/content/repositories/snapshots (id=apache.snapshots.https,uniqueVersion=false)
Deploying the main artifact jenkins-4460645704151362742synapse-commons-2.2.0-SNAPSHOT.jar
[INFO] Deployment in https://repository.apache.org/content/repositories/snapshots (id=apache.snapshots.https,uniqueVersion=false)
Deploying the main artifact jenkins-342627735725564648synapse-config-migrator-2.2.0-SNAPSHOT.jar
ERROR: Error installing artifact's metadata: Error while deploying metadata: The target server
failed to respond
org.apache.maven.artifact.deployer.ArtifactDeploymentException: Error installing artifact's
metadata: Error while deploying metadata: The target server failed to respond
	at hudson.maven.artifact.deployer.DefaultArtifactDeployer.deploy(DefaultArtifactDeployer.java:183)
	at hudson.maven.reporters.MavenArtifactRecord.deploy(MavenArtifactRecord.java:191)
	at hudson.maven.RedeployPublisher.perform(RedeployPublisher.java:176)
	at hudson.tasks.BuildStepMonitor$1.perform(BuildStepMonitor.java:20)
	at hudson.model.AbstractBuild$AbstractBuildExecution.perform(AbstractBuild.java:785)
	at hudson.model.AbstractBuild$AbstractBuildExecution.performAllBuildSteps(AbstractBuild.java:757)
	at hudson.maven.MavenModuleSetBuild$MavenModuleSetBuildExecution.post2(MavenModuleSetBuild.java:1020)
	at hudson.model.AbstractBuild$AbstractBuildExecution.post(AbstractBuild.java:706)
	at hudson.model.Run.execute(Run.java:1702)
	at hudson.maven.MavenModuleSetBuild.run(MavenModuleSetBuild.java:509)
	at hudson.model.ResourceController.execute(ResourceController.java:88)
	at hudson.model.Executor.run(Executor.java:231)
Caused by: org.apache.maven.artifact.repository.metadata.RepositoryMetadataDeploymentException:
Error while deploying metadata: The target server failed to respond
	at org.apache.maven.artifact.repository.metadata.DefaultRepositoryMetadataManager.deploy(DefaultRepositoryMetadataManager.java:492)
	at hudson.maven.artifact.deployer.DefaultArtifactDeployer.deploy(DefaultArtifactDeployer.java:167)
	... 11 more
Caused by: org.apache.maven.wagon.TransferFailedException: The target server failed to respond
	at org.apache.maven.wagon.shared.http4.AbstractHttpClientWagon.put(AbstractHttpClientWagon.java:580)
	at org.apache.maven.wagon.shared.http4.AbstractHttpClientWagon.put(AbstractHttpClientWagon.java:524)
	at org.apache.maven.wagon.shared.http4.AbstractHttpClientWagon.put(AbstractHttpClientWagon.java:505)
	at org.apache.maven.wagon.shared.http4.AbstractHttpClientWagon.put(AbstractHttpClientWagon.java:485)
	at org.apache.maven.repository.legacy.DefaultWagonManager.putRemoteFile(DefaultWagonManager.java:543)
	at org.apache.maven.repository.legacy.DefaultWagonManager.putArtifactMetadata(DefaultWagonManager.java:501)
	at org.apache.maven.artifact.repository.metadata.DefaultRepositoryMetadataManager.deploy(DefaultRepositoryMetadataManager.java:488)
	... 12 more
Caused by: org.apache.http.NoHttpResponseException: The target server failed to respond
	at org.apache.http.impl.conn.DefaultHttpResponseParser.parseHead(DefaultHttpResponseParser.java:95)
	at org.apache.http.impl.conn.DefaultHttpResponseParser.parseHead(DefaultHttpResponseParser.java:62)
	at org.apache.http.impl.io.AbstractMessageParser.parse(AbstractMessageParser.java:254)
	at org.apache.http.impl.AbstractHttpClientConnection.receiveResponseHeader(AbstractHttpClientConnection.java:289)
	at org.apache.http.impl.conn.DefaultClientConnection.receiveResponseHeader(DefaultClientConnection.java:252)
	at org.apache.http.impl.conn.ManagedClientConnectionImpl.receiveResponseHeader(ManagedClientConnectionImpl.java:191)
	at org.apache.http.protocol.HttpRequestExecutor.doReceiveResponse(HttpRequestExecutor.java:300)
	at org.apache.http.protocol.HttpRequestExecutor.execute(HttpRequestExecutor.java:127)
	at org.apache.http.impl.client.DefaultRequestDirector.tryExecute(DefaultRequestDirector.java:715)
	at org.apache.http.impl.client.DefaultRequestDirector.execute(DefaultRequestDirector.java:520)
	at org.apache.http.impl.client.AbstractHttpClient.execute(AbstractHttpClient.java:906)
	at org.apache.http.impl.client.AbstractHttpClient.execute(AbstractHttpClient.java:805)
	at org.apache.maven.wagon.shared.http4.AbstractHttpClientWagon.execute(AbstractHttpClientWagon.java:746)
	at org.apache.maven.wagon.shared.http4.AbstractHttpClientWagon.put(AbstractHttpClientWagon.java:574)
	... 18 more
[INFO] Deployment failed after 29 sec
Build step 'Deploy artifacts to Maven repository' changed build result to FAILURE

---------------------------------------------------------------------
To unsubscribe, e-mail: dev-unsubscribe@synapse.apache.org
For additional commands, e-mail: dev-help@synapse.apache.org


Mime
View raw message