synapse-dev mailing list archives

Site index · List index
Message view « Date » · « Thread »
Top « Date » · « Thread »
From Apache Jenkins Server <jenk...@builds.apache.org>
Subject Build failed in Jenkins: Synapse - Trunk #4958
Date Sun, 10 May 2015 13:13:47 GMT
See <https://builds.apache.org/job/Synapse%20-%20Trunk/4958/>

------------------------------------------
[...truncated 163 lines...]
Downloading: http://repository.apache.org/snapshots/org/apache/rampart/rampart-core/1.7.0-SNAPSHOT/rampart-core-1.7.0-20150510.131111-1371.pom
3K downloaded  (rampart-core-1.7.0-20150510.131111-1371.pom)
[INFO] snapshot org.apache.rampart:rampart-policy:1.7.0-SNAPSHOT: checking for updates from
wso2-m2-snapshots
[INFO] snapshot org.apache.rampart:rampart-policy:1.7.0-SNAPSHOT: checking for updates from
apache.snapshots
Downloading: http://repository.apache.org/snapshots/org/apache/rampart/rampart-policy/1.7.0-SNAPSHOT/rampart-policy-1.7.0-20150510.131133-1371.pom
2K downloaded  (rampart-policy-1.7.0-20150510.131133-1371.pom)
[INFO] snapshot org.apache.rampart:rampart-trust:1.7.0-SNAPSHOT: checking for updates from
wso2-m2-snapshots
[INFO] snapshot org.apache.rampart:rampart-trust:1.7.0-SNAPSHOT: checking for updates from
apache.snapshots
Downloading: http://repository.apache.org/snapshots/org/apache/rampart/rampart-trust/1.7.0-SNAPSHOT/rampart-trust-1.7.0-20150510.131149-1371.pom
3K downloaded  (rampart-trust-1.7.0-20150510.131149-1371.pom)
[INFO] snapshot org.apache.woden:woden-core:1.0-SNAPSHOT: checking for updates from wso2-m2-snapshots
[INFO] snapshot org.apache.woden:woden-core:1.0-SNAPSHOT: checking for updates from apache.snapshots
Downloading: http://repository.apache.org/snapshots/org/apache/woden/woden-core/1.0-SNAPSHOT/woden-core-1.0-20150508.182037-537.pom
5K downloaded  (woden-core-1.0-20150508.182037-537.pom)
[INFO] snapshot org.apache.woden:woden:1.0-SNAPSHOT: checking for updates from wso2-m2-snapshots
[INFO] snapshot org.apache.woden:woden:1.0-SNAPSHOT: checking for updates from apache.snapshots
Downloading: http://repository.apache.org/snapshots/org/apache/woden/woden/1.0-SNAPSHOT/woden-1.0-20150508.182034-953.pom
13K downloaded  (woden-1.0-20150508.182034-953.pom)
[INFO] snapshot org.apache.ws.commons.axiom:axiom-api:1.2.15-SNAPSHOT: checking for updates
from wso2-m2-snapshots
[INFO] snapshot org.apache.ws.commons.axiom:axiom-api:1.2.15-SNAPSHOT: checking for updates
from apache.snapshots
Downloading: http://repository.apache.org/snapshots/org/apache/ws/commons/axiom/axiom-api/1.2.15-SNAPSHOT/axiom-api-1.2.15-20150510.120629-662.pom
16K downloaded  (axiom-api-1.2.15-20150510.120629-662.pom)
[INFO] snapshot org.apache.ws.commons.axiom:axiom:1.2.15-SNAPSHOT: checking for updates from
wso2-m2-snapshots
[INFO] snapshot org.apache.ws.commons.axiom:axiom:1.2.15-SNAPSHOT: checking for updates from
apache.snapshots
Downloading: http://repository.apache.org/snapshots/org/apache/ws/commons/axiom/axiom/1.2.15-SNAPSHOT/axiom-1.2.15-20150510.120337-680.pom
40K downloaded  (axiom-1.2.15-20150510.120337-680.pom)
[INFO] snapshot org.apache.ws:ws-parent:1-SNAPSHOT: checking for updates from apache.snapshots
[INFO] snapshot org.apache.ws:ws-parent:1-SNAPSHOT: checking for updates from wso2-m2-snapshots
Downloading: http://repository.apache.org/snapshots/org/apache/ws/ws-parent/1-SNAPSHOT/ws-parent-1-20150509.185548-4.pom
4K downloaded  (ws-parent-1-20150509.185548-4.pom)
[INFO] snapshot org.apache.ws.commons.axiom:axiom-dom:1.2.15-SNAPSHOT: checking for updates
from wso2-m2-snapshots
[INFO] snapshot org.apache.ws.commons.axiom:axiom-dom:1.2.15-SNAPSHOT: checking for updates
from apache.snapshots
Downloading: http://repository.apache.org/snapshots/org/apache/ws/commons/axiom/axiom-dom/1.2.15-SNAPSHOT/axiom-dom-1.2.15-20150510.121354-644.pom
6K downloaded  (axiom-dom-1.2.15-20150510.121354-644.pom)
[INFO] snapshot org.apache.ws.commons.axiom:implementations:1.2.15-SNAPSHOT: checking for
updates from wso2-m2-snapshots
[INFO] snapshot org.apache.ws.commons.axiom:implementations:1.2.15-SNAPSHOT: checking for
updates from apache.snapshots
Downloading: http://repository.apache.org/snapshots/org/apache/ws/commons/axiom/implementations/1.2.15-SNAPSHOT/implementations-1.2.15-20150510.120806-109.pom
4K downloaded  (implementations-1.2.15-20150510.120806-109.pom)
[INFO] snapshot org.apache.ws.commons.axiom:axiom-impl:1.2.15-SNAPSHOT: checking for updates
from wso2-m2-snapshots
[INFO] snapshot org.apache.ws.commons.axiom:axiom-impl:1.2.15-SNAPSHOT: checking for updates
from apache.snapshots
Downloading: http://repository.apache.org/snapshots/org/apache/ws/commons/axiom/axiom-impl/1.2.15-SNAPSHOT/axiom-impl-1.2.15-20150510.121019-650.pom
5K downloaded  (axiom-impl-1.2.15-20150510.121019-650.pom)
Downloading: http://dist.wso2.org/maven2//quickfixj/quickfixj-all/1.4.0/quickfixj-all-1.4.0.pom
[INFO] Unable to find resource 'quickfixj:quickfixj-all:pom:1.4.0' in repository wso2-m2 (http://dist.wso2.org/maven2/)
Downloading: https://oosnmp.net/dist/release//quickfixj/quickfixj-all/1.4.0/quickfixj-all-1.4.0.pom
[INFO] Unable to find resource 'quickfixj:quickfixj-all:pom:1.4.0' in repository snmp4j-repo
(https://oosnmp.net/dist/release/)
Downloading: http://repo1.maven.org/maven2/quickfixj/quickfixj-all/1.4.0/quickfixj-all-1.4.0.pom
[INFO] Unable to find resource 'quickfixj:quickfixj-all:pom:1.4.0' in repository central (http://repo1.maven.org/maven2)
[INFO] snapshot org.apache.axis2:axis2-transport-testkit:1.7.0-SNAPSHOT: checking for updates
from wso2-m2-snapshots
[INFO] snapshot org.apache.axis2:axis2-transport-testkit:1.7.0-SNAPSHOT: checking for updates
from apache.snapshots
Downloading: http://repository.apache.org/snapshots/org/apache/axis2/axis2-transport-testkit/1.7.0-SNAPSHOT/axis2-transport-testkit-1.7.0-20150510.122541-1461.pom
10K downloaded  (axis2-transport-testkit-1.7.0-20150510.122541-1461.pom)
[INFO] Generating "Dependencies" report.
[INFO] Generating "Project License" report.
[INFO] Generating "Project Modules" report.
[INFO] Generating "Project Team" report.
[INFO] Generating "Continuous Integration" report.
[FINDBUGS] No report found for mojo site
[JENKINS] Archiving site from <https://builds.apache.org/job/Synapse%20-%20Trunk/ws/java/target/site>
to /x1/jenkins/jenkins-home/jobs/Synapse - Trunk/site
log4j:WARN No appenders could be found for logger (org.apache.commons.beanutils.converters.BooleanConverter).
log4j:WARN Please initialize the log4j system properly.
[INFO] ------------------------------------------------------------------------
[INFO] Building Apache Synapse - Secure Vault
[INFO]    task-segment: [clean, install, site]
[INFO] ------------------------------------------------------------------------
[INFO] [clean:clean {execution: default-clean}]
[INFO] Deleting <https://builds.apache.org/job/Synapse%20-%20Trunk/ws/java/modules/securevault/target>
[INFO] [remote-resources:process {execution: default}]
Downloading: http://repository.apache.org/snapshots/org/apache/ws/commons/axiom/axiom-api/1.2.15-SNAPSHOT/axiom-api-1.2.15-20150510.120629-662.jar
400K downloaded  (axiom-api-1.2.15-20150510.120629-662.jar)
Downloading: http://repository.apache.org/snapshots/org/apache/ws/commons/axiom/axiom-impl/1.2.15-SNAPSHOT/axiom-impl-1.2.15-20150510.121019-650.jar
430K downloaded  (axiom-impl-1.2.15-20150510.121019-650.jar)
[WARNING] org.apache.velocity.runtime.exception.ReferenceException: reference : template =
META-INF/DEPENDENCIES.vm [line 40,column 14] : $license.name is not a valid reference.
[debug] execute contextualize
[INFO] [resources:resources {execution: default-resources}]
[INFO] Using 'UTF-8' encoding to copy filtered resources.
[INFO] skip non existing resourceDirectory <https://builds.apache.org/job/Synapse%20-%20Trunk/ws/java/modules/securevault/src/main/resources>
[INFO] Copying 3 resources
[INFO] [compiler:compile {execution: default-compile}]
[INFO] Compiling 57 source files to <https://builds.apache.org/job/Synapse%20-%20Trunk/ws/java/modules/securevault/target/classes>
[debug] execute contextualize
[INFO] [resources:testResources {execution: default-testResources}]
[INFO] Using 'UTF-8' encoding to copy filtered resources.
[INFO] skip non existing resourceDirectory <https://builds.apache.org/job/Synapse%20-%20Trunk/ws/java/modules/securevault/src/test/resources>
[INFO] Copying 3 resources
[INFO] [compiler:testCompile {execution: default-testCompile}]
[INFO] No sources to compile
[INFO] [surefire:test {execution: default-test}]
[INFO] Surefire report directory: <https://builds.apache.org/job/Synapse%20-%20Trunk/ws/java/modules/securevault/target/surefire-reports>

-------------------------------------------------------
 T E S T S
-------------------------------------------------------

Results :

Tests run: 0, Failures: 0, Errors: 0, Skipped: 0

[JENKINS] Recording test results
[INFO] [bundle:bundle {execution: default-bundle}]
[INFO] [install:install {execution: default-install}]
[INFO] Installing <https://builds.apache.org/job/Synapse%20-%20Trunk/ws/java/modules/securevault/target/synapse-securevault-2.2.0-SNAPSHOT.jar>
to <https://builds.apache.org/job/Synapse%20-%20Trunk/ws/.repository/org/apache/synapse/synapse-securevault/2.2.0-SNAPSHOT/synapse-securevault-2.2.0-SNAPSHOT.jar>
[INFO] [bundle:install {execution: default-install}]
[INFO] Installing org/apache/synapse/synapse-securevault/2.2.0-SNAPSHOT/synapse-securevault-2.2.0-SNAPSHOT.jar
[INFO] Writing OBR metadata
[INFO] [site:site {execution: default-site}]
[INFO] Parent project loaded from repository: org.apache:apache:pom:9
[INFO] Relativizing decoration links with respect to project URL: http://synapse.apache.org/modules/synapse-securevault
[INFO] Rendering site with org.apache.maven.skins:maven-default-skin:jar:1.0 skin.
[INFO] Generating "About" report.
[INFO] Generating "Source Repository" report.
[INFO] Generating "Plugin Management" report.
[INFO] Generating "Mailing Lists" report.
[INFO] Generating "Issue Tracking" report.
[INFO] Generating "Project Plugins" report.
[INFO] Generating "Dependency Convergence" report.
[INFO] Generating "Project Summary" report.
[INFO] Generating "Dependency Management" report.
[INFO] Generating "Dependencies" report.
[INFO] Generating "Project License" report.
[INFO] Generating "Project Team" report.
[INFO] Generating "Continuous Integration" report.
[FINDBUGS] No report found for mojo site
[JENKINS] Archiving site from <https://builds.apache.org/job/Synapse%20-%20Trunk/ws/java/modules/securevault/target/site>
to /x1/jenkins/jenkins-home/jobs/Synapse - Trunk/site/synapse-securevault
[INFO] ------------------------------------------------------------------------
[INFO] Building Apache Synapse - Commons
[INFO]    task-segment: [clean, install, site]
[INFO] ------------------------------------------------------------------------
[INFO] [clean:clean {execution: default-clean}]
[INFO] Deleting <https://builds.apache.org/job/Synapse%20-%20Trunk/ws/java/modules/commons/target>
[INFO] [remote-resources:process {execution: default}]
[INFO] snapshot org.apache.ws.xmlschema:xmlschema-core:2.1.1-SNAPSHOT: checking for updates
from wso2-m2-snapshots
[INFO] snapshot org.apache.ws.xmlschema:xmlschema-core:2.1.1-SNAPSHOT: checking for updates
from apache.snapshots
Downloading: http://repository.apache.org/snapshots/org/apache/ws/xmlschema/xmlschema-core/2.1.1-SNAPSHOT/xmlschema-core-2.1.1-20140911.065411-27.pom
6K downloaded  (xmlschema-core-2.1.1-20140911.065411-27.pom)
[INFO] snapshot org.apache.ws.xmlschema:xmlschema:2.1.1-SNAPSHOT: checking for updates from
wso2-m2-snapshots
[INFO] snapshot org.apache.ws.xmlschema:xmlschema:2.1.1-SNAPSHOT: checking for updates from
apache.snapshots
Downloading: http://repository.apache.org/snapshots/org/apache/ws/xmlschema/xmlschema/2.1.1-SNAPSHOT/xmlschema-2.1.1-20140911.065225-28.pom
31K downloaded  (xmlschema-2.1.1-20140911.065225-28.pom)
[INFO] snapshot org.apache.synapse:synapse-securevault:2.2.0-SNAPSHOT: checking for updates
from wso2-m2-snapshots
Downloading: http://repository.apache.org/snapshots/org/apache/axis2/axis2-transport-base/1.7.0-SNAPSHOT/axis2-transport-base-1.7.0-20150510.122531-1463.jar
Downloading: http://repository.apache.org/snapshots/org/apache/woden/woden-core/1.0-SNAPSHOT/woden-core-1.0-20150508.182037-537.jar
Downloading: http://repository.apache.org/snapshots/org/apache/neethi/neethi/3.0.4-SNAPSHOT/neethi-3.0.4-20140501.061056-2.jar
Downloading: http://repository.apache.org/snapshots/org/apache/ws/xmlschema/xmlschema-core/2.1.1-SNAPSHOT/xmlschema-core-2.1.1-20140911.065411-27.jar
69K downloaded  (neethi-3.0.4-20140501.061056-2.jar)
163K downloaded  (xmlschema-core-2.1.1-20140911.065411-27.jar)
102K downloaded  (axis2-transport-base-1.7.0-20150510.122531-1463.jar)
363K downloaded  (woden-core-1.0-20150508.182037-537.jar)
[INFO] snapshot org.apache.synapse:synapse-securevault:2.2.0-SNAPSHOT: checking for updates
from apache.snapshots
Downloading: http://repository.apache.org/snapshots/org/apache/axis2/axis2-kernel/1.7.0-SNAPSHOT/axis2-kernel-1.7.0-20150510.122433-2019.jar
1030K downloaded  (axis2-kernel-1.7.0-20150510.122433-2019.jar)
[WARNING] org.apache.velocity.runtime.exception.ReferenceException: reference : template =
META-INF/DEPENDENCIES.vm [line 40,column 14] : $license.name is not a valid reference.
[debug] execute contextualize
[INFO] [resources:resources {execution: default-resources}]
[INFO] Using 'UTF-8' encoding to copy filtered resources.
[INFO] Copying 0 resource
[INFO] Copying 3 resources
[INFO] [compiler:compile {execution: default-compile}]
[INFO] Compiling 93 source files to <https://builds.apache.org/job/Synapse%20-%20Trunk/ws/java/modules/commons/target/classes>
[debug] execute contextualize
[INFO] [resources:testResources {execution: default-testResources}]
[INFO] Using 'UTF-8' encoding to copy filtered resources.
[INFO] skip non existing resourceDirectory <https://builds.apache.org/job/Synapse%20-%20Trunk/ws/java/modules/commons/src/test/resources>
[INFO] Copying 3 resources
[INFO] [compiler:testCompile {execution: default-testCompile}]
[INFO] Compiling 11 source files to <https://builds.apache.org/job/Synapse%20-%20Trunk/ws/java/modules/commons/target/test-classes>
[INFO] -------------------------------------------------------------
[ERROR] COMPILATION ERROR : 
[INFO] -------------------------------------------------------------
[ERROR] <https://builds.apache.org/job/Synapse%20-%20Trunk/ws/java/modules/commons/src/test/java/org/apache/synapse/util/TemporaryDataTest.java>:[30,33]
package org.apache.axiom.util.blob does not exist
[ERROR] <https://builds.apache.org/job/Synapse%20-%20Trunk/ws/java/modules/commons/src/test/java/org/apache/synapse/util/TemporaryDataTest.java>:[41,8]
cannot find symbol
symbol  : class OverflowBlob
location: class org.apache.synapse.util.TemporaryDataTest
[ERROR] <https://builds.apache.org/job/Synapse%20-%20Trunk/ws/java/modules/commons/src/test/java/org/apache/synapse/util/TemporaryDataTest.java>:[41,31]
cannot find symbol
symbol  : class OverflowBlob
location: class org.apache.synapse.util.TemporaryDataTest
[ERROR] <https://builds.apache.org/job/Synapse%20-%20Trunk/ws/java/modules/commons/src/test/java/org/apache/synapse/util/TemporaryDataTest.java>:[92,8]
cannot find symbol
symbol  : class OverflowBlob
location: class org.apache.synapse.util.TemporaryDataTest
[ERROR] <https://builds.apache.org/job/Synapse%20-%20Trunk/ws/java/modules/commons/src/test/java/org/apache/synapse/util/TemporaryDataTest.java>:[92,31]
cannot find symbol
symbol  : class OverflowBlob
location: class org.apache.synapse.util.TemporaryDataTest
[ERROR] <https://builds.apache.org/job/Synapse%20-%20Trunk/ws/java/modules/commons/src/test/java/org/apache/synapse/util/TemporaryDataTest.java>:[112,8]
cannot find symbol
symbol  : class OverflowBlob
location: class org.apache.synapse.util.TemporaryDataTest
[ERROR] <https://builds.apache.org/job/Synapse%20-%20Trunk/ws/java/modules/commons/src/test/java/org/apache/synapse/util/TemporaryDataTest.java>:[112,31]
cannot find symbol
symbol  : class OverflowBlob
location: class org.apache.synapse.util.TemporaryDataTest
[INFO] 7 errors 
[INFO] -------------------------------------------------------------
[INFO] ------------------------------------------------------------------------
[ERROR] BUILD FAILURE
[INFO] ------------------------------------------------------------------------
[INFO] Compilation failure

<https://builds.apache.org/job/Synapse%20-%20Trunk/ws/java/modules/commons/src/test/java/org/apache/synapse/util/TemporaryDataTest.java>:[30,33]
package org.apache.axiom.util.blob does not exist
<https://builds.apache.org/job/Synapse%20-%20Trunk/ws/java/modules/commons/src/test/java/org/apache/synapse/util/TemporaryDataTest.java>:[41,8]
cannot find symbol
symbol  : class OverflowBlob
location: class org.apache.synapse.util.TemporaryDataTest
<https://builds.apache.org/job/Synapse%20-%20Trunk/ws/java/modules/commons/src/test/java/org/apache/synapse/util/TemporaryDataTest.java>:[41,31]
cannot find symbol
symbol  : class OverflowBlob
location: class org.apache.synapse.util.TemporaryDataTest
<https://builds.apache.org/job/Synapse%20-%20Trunk/ws/java/modules/commons/src/test/java/org/apache/synapse/util/TemporaryDataTest.java>:[92,8]
cannot find symbol
symbol  : class OverflowBlob
location: class org.apache.synapse.util.TemporaryDataTest
<https://builds.apache.org/job/Synapse%20-%20Trunk/ws/java/modules/commons/src/test/java/org/apache/synapse/util/TemporaryDataTest.java>:[92,31]
cannot find symbol
symbol  : class OverflowBlob
location: class org.apache.synapse.util.TemporaryDataTest
<https://builds.apache.org/job/Synapse%20-%20Trunk/ws/java/modules/commons/src/test/java/org/apache/synapse/util/TemporaryDataTest.java>:[112,8]
cannot find symbol
symbol  : class OverflowBlob
location: class org.apache.synapse.util.TemporaryDataTest
<https://builds.apache.org/job/Synapse%20-%20Trunk/ws/java/modules/commons/src/test/java/org/apache/synapse/util/TemporaryDataTest.java>:[112,31]
cannot find symbol
symbol  : class OverflowBlob
location: class org.apache.synapse.util.TemporaryDataTest

[INFO] ------------------------------------------------------------------------
[INFO] For more information, run Maven with the -e switch
[INFO] ------------------------------------------------------------------------
[INFO] Total time: 1 minute 33 seconds
[INFO] Finished at: Sun May 10 13:13:42 UTC 2015
[INFO] Final Memory: 106M/810M
[INFO] ------------------------------------------------------------------------
[JENKINS] Archiving <https://builds.apache.org/job/Synapse%20-%20Trunk/ws/.repository/org/apache/synapse/Apache-Synapse/2.2.0-SNAPSHOT/Apache-Synapse-2.2.0-SNAPSHOT.pom>
to org.apache.synapse/Apache-Synapse/2.2.0-SNAPSHOT/Apache-Synapse-2.2.0-SNAPSHOT.pom
<https://builds.apache.org/job/Synapse%20-%20Trunk/ws/.repository/org/apache/synapse/Apache-Synapse/2.2.0-SNAPSHOT/Apache-Synapse-2.2.0-SNAPSHOT.pom>
is not inside <https://builds.apache.org/job/Synapse%20-%20Trunk/ws/java/;> will archive
in a separate pass
Sending artifact delta relative to Synapse - Trunk » Apache Synapse #4957
Archived 1 artifacts
Archive block size is 32768
Received 1 blocks and 21185 bytes
Compression is 60.7%
Took 62 ms
[JENKINS] Archiving <https://builds.apache.org/job/Synapse%20-%20Trunk/ws/java/modules/commons/pom.xml>
to org.apache.synapse/synapse-commons/2.2.0-SNAPSHOT/synapse-commons-2.2.0-SNAPSHOT.pom
Sending artifact delta relative to Synapse - Trunk » Apache Synapse - Commons #4955
Archived 1 artifacts
Archive block size is 32768
Received 0 blocks and 4223 bytes
Compression is 0.0%
Took 77 ms
[JENKINS] Archiving <https://builds.apache.org/job/Synapse%20-%20Trunk/ws/java/modules/securevault/pom.xml>
to org.apache.synapse/synapse-securevault/2.2.0-SNAPSHOT/synapse-securevault-2.2.0-SNAPSHOT.pom
[JENKINS] Archiving <https://builds.apache.org/job/Synapse%20-%20Trunk/ws/java/modules/securevault/target/synapse-securevault-2.2.0-SNAPSHOT.jar>
to org.apache.synapse/synapse-securevault/2.2.0-SNAPSHOT/synapse-securevault-2.2.0-SNAPSHOT.jar
Sending artifact delta relative to Synapse - Trunk » Apache Synapse - Secure Vault #4957
Archived 2 artifacts
Archive block size is 32768
Received 0 blocks and 91979 bytes
Compression is 0.0%
Took 0.1 sec
Sending e-mails to: dev@synapse.apache.org
channel stopped
[locks-and-latches] Releasing all the locks
[locks-and-latches] All the locks released

---------------------------------------------------------------------
To unsubscribe, e-mail: dev-unsubscribe@synapse.apache.org
For additional commands, e-mail: dev-help@synapse.apache.org


Mime
View raw message