synapse-dev mailing list archives

Site index · List index
Message view « Date » · « Thread »
Top « Date » · « Thread »
From Apache Jenkins Server <jenk...@builds.apache.org>
Subject Build failed in Jenkins: Synapse - Trunk » Apache Synapse - Commons #4957
Date Sun, 10 May 2015 11:26:20 GMT
See <https://builds.apache.org/job/Synapse%20-%20Trunk/org.apache.synapse$synapse-commons/4957/>

------------------------------------------
[INFO] ------------------------------------------------------------------------
[INFO] Building Apache Synapse - Commons
[INFO]    task-segment: [clean, install, site]
[INFO] ------------------------------------------------------------------------
[INFO] [clean:clean {execution: default-clean}]
[INFO] Deleting <https://builds.apache.org/job/Synapse%20-%20Trunk/org.apache.synapse$synapse-commons/ws/target>
[INFO] [remote-resources:process {execution: default}]
[INFO] snapshot org.apache.ws.xmlschema:xmlschema-core:2.1.1-SNAPSHOT: checking for updates
from wso2-m2-snapshots
[INFO] snapshot org.apache.ws.xmlschema:xmlschema-core:2.1.1-SNAPSHOT: checking for updates
from apache.snapshots
Downloading: http://repository.apache.org/snapshots/org/apache/ws/xmlschema/xmlschema-core/2.1.1-SNAPSHOT/xmlschema-core-2.1.1-20140911.065411-27.pom
6K downloaded  (xmlschema-core-2.1.1-20140911.065411-27.pom)
[INFO] snapshot org.apache.ws.xmlschema:xmlschema:2.1.1-SNAPSHOT: checking for updates from
wso2-m2-snapshots
[INFO] snapshot org.apache.ws.xmlschema:xmlschema:2.1.1-SNAPSHOT: checking for updates from
apache.snapshots
Downloading: http://repository.apache.org/snapshots/org/apache/ws/xmlschema/xmlschema/2.1.1-SNAPSHOT/xmlschema-2.1.1-20140911.065225-28.pom
31K downloaded  (xmlschema-2.1.1-20140911.065225-28.pom)
[INFO] snapshot org.apache.synapse:synapse-securevault:2.2.0-SNAPSHOT: checking for updates
from wso2-m2-snapshots
Downloading: http://repository.apache.org/snapshots/org/apache/axis2/axis2-transport-base/1.7.0-SNAPSHOT/axis2-transport-base-1.7.0-20150510.103752-1462.jar
Downloading: http://repository.apache.org/snapshots/org/apache/neethi/neethi/3.0.4-SNAPSHOT/neethi-3.0.4-20140501.061056-2.jar
Downloading: http://repository.apache.org/snapshots/org/apache/woden/woden-core/1.0-SNAPSHOT/woden-core-1.0-20150508.182037-537.jar
Downloading: http://repository.apache.org/snapshots/org/apache/ws/xmlschema/xmlschema-core/2.1.1-SNAPSHOT/xmlschema-core-2.1.1-20140911.065411-27.jar
69K downloaded  (neethi-3.0.4-20140501.061056-2.jar)
363K downloaded  (woden-core-1.0-20150508.182037-537.jar)
102K downloaded  (axis2-transport-base-1.7.0-20150510.103752-1462.jar)
163K downloaded  (xmlschema-core-2.1.1-20140911.065411-27.jar)
Downloading: http://repository.apache.org/snapshots/org/apache/axis2/axis2-kernel/1.7.0-SNAPSHOT/axis2-kernel-1.7.0-20150510.103632-2018.jar
[INFO] snapshot org.apache.synapse:synapse-securevault:2.2.0-SNAPSHOT: checking for updates
from apache.snapshots
1030K downloaded  (axis2-kernel-1.7.0-20150510.103632-2018.jar)
[WARNING] org.apache.velocity.runtime.exception.ReferenceException: reference : template =
META-INF/DEPENDENCIES.vm [line 40,column 14] : $license.name is not a valid reference.
[debug] execute contextualize
[INFO] [resources:resources {execution: default-resources}]
[INFO] Using 'UTF-8' encoding to copy filtered resources.
[INFO] Copying 0 resource
[INFO] Copying 3 resources
[INFO] [compiler:compile {execution: default-compile}]
[INFO] Compiling 93 source files to <https://builds.apache.org/job/Synapse%20-%20Trunk/org.apache.synapse$synapse-commons/ws/target/classes>
[debug] execute contextualize
[INFO] [resources:testResources {execution: default-testResources}]
[INFO] Using 'UTF-8' encoding to copy filtered resources.
[INFO] skip non existing resourceDirectory <https://builds.apache.org/job/Synapse%20-%20Trunk/org.apache.synapse$synapse-commons/ws/src/test/resources>
[INFO] Copying 3 resources
[INFO] [compiler:testCompile {execution: default-testCompile}]
[INFO] Compiling 11 source files to <https://builds.apache.org/job/Synapse%20-%20Trunk/org.apache.synapse$synapse-commons/ws/target/test-classes>
[INFO] -------------------------------------------------------------
[ERROR] COMPILATION ERROR : 
[INFO] -------------------------------------------------------------
[ERROR] <https://builds.apache.org/job/Synapse%20-%20Trunk/org.apache.synapse$synapse-commons/ws/src/test/java/org/apache/synapse/util/TemporaryDataTest.java>:[30,33]
package org.apache.axiom.util.blob does not exist
[ERROR] <https://builds.apache.org/job/Synapse%20-%20Trunk/org.apache.synapse$synapse-commons/ws/src/test/java/org/apache/synapse/util/TemporaryDataTest.java>:[41,8]
cannot find symbol
symbol  : class OverflowBlob
location: class org.apache.synapse.util.TemporaryDataTest
[ERROR] <https://builds.apache.org/job/Synapse%20-%20Trunk/org.apache.synapse$synapse-commons/ws/src/test/java/org/apache/synapse/util/TemporaryDataTest.java>:[41,31]
cannot find symbol
symbol  : class OverflowBlob
location: class org.apache.synapse.util.TemporaryDataTest
[ERROR] <https://builds.apache.org/job/Synapse%20-%20Trunk/org.apache.synapse$synapse-commons/ws/src/test/java/org/apache/synapse/util/TemporaryDataTest.java>:[92,8]
cannot find symbol
symbol  : class OverflowBlob
location: class org.apache.synapse.util.TemporaryDataTest
[ERROR] <https://builds.apache.org/job/Synapse%20-%20Trunk/org.apache.synapse$synapse-commons/ws/src/test/java/org/apache/synapse/util/TemporaryDataTest.java>:[92,31]
cannot find symbol
symbol  : class OverflowBlob
location: class org.apache.synapse.util.TemporaryDataTest
[ERROR] <https://builds.apache.org/job/Synapse%20-%20Trunk/org.apache.synapse$synapse-commons/ws/src/test/java/org/apache/synapse/util/TemporaryDataTest.java>:[112,8]
cannot find symbol
symbol  : class OverflowBlob
location: class org.apache.synapse.util.TemporaryDataTest
[ERROR] <https://builds.apache.org/job/Synapse%20-%20Trunk/org.apache.synapse$synapse-commons/ws/src/test/java/org/apache/synapse/util/TemporaryDataTest.java>:[112,31]
cannot find symbol
symbol  : class OverflowBlob
location: class org.apache.synapse.util.TemporaryDataTest
[INFO] 7 errors 
[INFO] -------------------------------------------------------------
[INFO] ------------------------------------------------------------------------
[ERROR] BUILD FAILURE
[INFO] ------------------------------------------------------------------------
[INFO] Compilation failure

<https://builds.apache.org/job/Synapse%20-%20Trunk/org.apache.synapse$synapse-commons/ws/src/test/java/org/apache/synapse/util/TemporaryDataTest.java>:[30,33]
package org.apache.axiom.util.blob does not exist
<https://builds.apache.org/job/Synapse%20-%20Trunk/org.apache.synapse$synapse-commons/ws/src/test/java/org/apache/synapse/util/TemporaryDataTest.java>:[41,8]
cannot find symbol
symbol  : class OverflowBlob
location: class org.apache.synapse.util.TemporaryDataTest
<https://builds.apache.org/job/Synapse%20-%20Trunk/org.apache.synapse$synapse-commons/ws/src/test/java/org/apache/synapse/util/TemporaryDataTest.java>:[41,31]
cannot find symbol
symbol  : class OverflowBlob
location: class org.apache.synapse.util.TemporaryDataTest
<https://builds.apache.org/job/Synapse%20-%20Trunk/org.apache.synapse$synapse-commons/ws/src/test/java/org/apache/synapse/util/TemporaryDataTest.java>:[92,8]
cannot find symbol
symbol  : class OverflowBlob
location: class org.apache.synapse.util.TemporaryDataTest
<https://builds.apache.org/job/Synapse%20-%20Trunk/org.apache.synapse$synapse-commons/ws/src/test/java/org/apache/synapse/util/TemporaryDataTest.java>:[92,31]
cannot find symbol
symbol  : class OverflowBlob
location: class org.apache.synapse.util.TemporaryDataTest
<https://builds.apache.org/job/Synapse%20-%20Trunk/org.apache.synapse$synapse-commons/ws/src/test/java/org/apache/synapse/util/TemporaryDataTest.java>:[112,8]
cannot find symbol
symbol  : class OverflowBlob
location: class org.apache.synapse.util.TemporaryDataTest
<https://builds.apache.org/job/Synapse%20-%20Trunk/org.apache.synapse$synapse-commons/ws/src/test/java/org/apache/synapse/util/TemporaryDataTest.java>:[112,31]
cannot find symbol
symbol  : class OverflowBlob
location: class org.apache.synapse.util.TemporaryDataTest

[INFO] ------------------------------------------------------------------------
[INFO] For more information, run Maven with the -e switch
[INFO] ------------------------------------------------------------------------
[INFO] Total time: 1 minute 7 seconds
[INFO] Finished at: Sun May 10 11:26:18 UTC 2015
[INFO] Final Memory: 106M/810M
[INFO] ------------------------------------------------------------------------

---------------------------------------------------------------------
To unsubscribe, e-mail: dev-unsubscribe@synapse.apache.org
For additional commands, e-mail: dev-help@synapse.apache.org


Mime
View raw message