synapse-dev mailing list archives

Site index · List index
Message view « Date » · « Thread »
Top « Date » · « Thread »
From Apache Jenkins Server <jenk...@builds.apache.org>
Subject Build failed in Jenkins: Synapse - Trunk #4971
Date Fri, 22 May 2015 22:54:16 GMT
See <https://builds.apache.org/job/Synapse%20-%20Trunk/4971/>

------------------------------------------
[...truncated 4744 lines...]
Downloading: http://repo1.maven.org/maven2/org/bouncycastle/bcprov-jdk15on/1.49/bcprov-jdk15on-1.49.pom
1K downloaded  (bcprov-jdk15on-1.49.pom)
Downloading: http://dist.wso2.org/maven2//org/codehaus/plexus/plexus-utils/1.5.4/plexus-utils-1.5.4.pom
5K downloaded  (plexus-utils-1.5.4.pom)
Downloading: http://dist.wso2.org/maven2//org/quartz-scheduler/quartz/2.2.0/quartz-2.2.0.pom
[INFO] Unable to find resource 'org.quartz-scheduler:quartz:pom:2.2.0' in repository wso2-m2
(http://dist.wso2.org/maven2/)
Downloading: https://oosnmp.net/dist/release//org/quartz-scheduler/quartz/2.2.0/quartz-2.2.0.pom
[WARNING] Unable to get resource 'org.quartz-scheduler:quartz:pom:2.2.0' from repository snmp4j-repo
(https://oosnmp.net/dist/release/): Error transferring file: sun.security.validator.ValidatorException:
PKIX path building failed: sun.security.provider.certpath.SunCertPathBuilderException: unable
to find valid certification path to requested target
Downloading: http://repo1.maven.org/maven2/org/quartz-scheduler/quartz/2.2.0/quartz-2.2.0.pom
9K downloaded  (quartz-2.2.0.pom)
Downloading: http://www.terracotta.org/download/reflector/snapshots/org/quartz-scheduler/quartz-parent/2.2.0/quartz-parent-2.2.0.pom
[INFO] Unable to find resource 'org.quartz-scheduler:quartz-parent:pom:2.2.0' in repository
terracotta-snapshots (http://www.terracotta.org/download/reflector/snapshots)
Downloading: http://www.terracotta.org/download/reflector/releases/org/quartz-scheduler/quartz-parent/2.2.0/quartz-parent-2.2.0.pom
13K downloaded  (quartz-parent-2.2.0.pom)
[WARNING] *** CHECKSUM FAILED - Checksum failed on download: local = '6907943c7771380e602b84eecf444a87843a10c2';
remote = '3c8d7ccfe326ad4325fcc15c302d49e61b100d8a' - RETRYING
Downloading: http://www.terracotta.org/download/reflector/releases/org/quartz-scheduler/quartz-parent/2.2.0/quartz-parent-2.2.0.pom
13K downloaded  (quartz-parent-2.2.0.pom)
[WARNING] *** CHECKSUM FAILED - Checksum failed on download: local = '6907943c7771380e602b84eecf444a87843a10c2';
remote = '3c8d7ccfe326ad4325fcc15c302d49e61b100d8a' - IGNORING
Downloading: http://dist.wso2.org/maven2//org/snmp4j/snmp4j/2.0.3/snmp4j-2.0.3.pom
389b downloaded  (snmp4j-2.0.3.pom)
Downloading: http://dist.wso2.org/maven2//org/snmp4j/snmp4j-agent/2.0.5/snmp4j-agent-2.0.5.pom
395b downloaded  (snmp4j-agent-2.0.5.pom)
Downloading: http://dist.wso2.org/maven2//org/springframework/spring-beans/1.2.8/spring-beans-1.2.8.pom
1K downloaded  (spring-beans-1.2.8.pom)
Downloading: http://dist.wso2.org/maven2//org/springframework/spring-parent/1.2.8/spring-parent-1.2.8.pom
10K downloaded  (spring-parent-1.2.8.pom)
Downloading: http://dist.wso2.org/maven2//org/springframework/spring-context/1.2.8/spring-context-1.2.8.pom
1K downloaded  (spring-context-1.2.8.pom)
Downloading: http://dist.wso2.org/maven2//org/springframework/spring-core/1.2.8/spring-core-1.2.8.pom
1K downloaded  (spring-core-1.2.8.pom)
Downloading: http://dist.wso2.org/maven2//org/wso2/caching/wso2caching-core/3.5.0/wso2caching-core-3.5.0.pom
4K downloaded  (wso2caching-core-3.5.0.pom)
Downloading: http://dist.wso2.org/maven2//org/wso2/caching/wso2caching/3.5.0/wso2caching-3.5.0.pom
7K downloaded  (wso2caching-3.5.0.pom)
Downloading: http://dist.wso2.org/maven2//org/wso2/eventing/wso2eventing-api/2.1/wso2eventing-api-2.1.pom
1K downloaded  (wso2eventing-api-2.1.pom)
Downloading: http://dist.wso2.org/maven2//org/wso2/eventing/wso2eventing-parent/2.1/wso2eventing-parent-2.1.pom
1K downloaded  (wso2eventing-parent-2.1.pom)
Downloading: http://dist.wso2.org/maven2//org/wso2/throttle/wso2throttle-core/3.2.1/wso2throttle-core-3.2.1.pom
1K downloaded  (wso2throttle-core-3.2.1.pom)
Downloading: http://dist.wso2.org/maven2//org/wso2/throttle/wso2throttle-parent/3.2.1/wso2throttle-parent-3.2.1.pom
7K downloaded  (wso2throttle-parent-3.2.1.pom)
Downloading: http://dist.wso2.org/maven2//org/wso2/uri/template/wso2-uri-templates/1.0.0/wso2-uri-templates-1.0.0.pom
5K downloaded  (wso2-uri-templates-1.0.0.pom)
Downloading: http://dist.wso2.org/maven2//quickfixj/quickfixj-all/1.4.0/quickfixj-all-1.4.0.pom
[INFO] Unable to find resource 'quickfixj:quickfixj-all:pom:1.4.0' in repository wso2-m2 (http://dist.wso2.org/maven2/)
Downloading: https://oosnmp.net/dist/release//quickfixj/quickfixj-all/1.4.0/quickfixj-all-1.4.0.pom
[WARNING] Unable to get resource 'quickfixj:quickfixj-all:pom:1.4.0' from repository snmp4j-repo
(https://oosnmp.net/dist/release/): Error transferring file: sun.security.validator.ValidatorException:
PKIX path building failed: sun.security.provider.certpath.SunCertPathBuilderException: unable
to find valid certification path to requested target
Downloading: http://repo1.maven.org/maven2/quickfixj/quickfixj-all/1.4.0/quickfixj-all-1.4.0.pom
[INFO] Unable to find resource 'quickfixj:quickfixj-all:pom:1.4.0' in repository central (http://repo1.maven.org/maven2)
Downloading: http://dist.wso2.org/maven2//rhino/js/1.6R5/js-1.6R5.pom
786b downloaded  (js-1.6R5.pom)
Downloading: http://dist.wso2.org/maven2//wrapper/wrapper/3.2.3/wrapper-3.2.3.pom
186b downloaded  (wrapper-3.2.3.pom)
Downloading: http://dist.wso2.org/maven2//wsdl4j/wsdl4j/1.6.2/wsdl4j-1.6.2.pom
[INFO] Unable to find resource 'wsdl4j:wsdl4j:pom:1.6.2' in repository wso2-m2 (http://dist.wso2.org/maven2/)
Downloading: https://oosnmp.net/dist/release//wsdl4j/wsdl4j/1.6.2/wsdl4j-1.6.2.pom
[WARNING] Unable to get resource 'wsdl4j:wsdl4j:pom:1.6.2' from repository snmp4j-repo (https://oosnmp.net/dist/release/):
Error transferring file: sun.security.validator.ValidatorException: PKIX path building failed:
sun.security.provider.certpath.SunCertPathBuilderException: unable to find valid certification
path to requested target
Downloading: http://repo1.maven.org/maven2/wsdl4j/wsdl4j/1.6.2/wsdl4j-1.6.2.pom
939b downloaded  (wsdl4j-1.6.2.pom)
Downloading: http://dist.wso2.org/maven2//xalan/xalan/2.7.1/xalan-2.7.1.pom
1K downloaded  (xalan-2.7.1.pom)
Downloading: http://dist.wso2.org/maven2//xmlbeans/xbean/2.2.0/xbean-2.2.0.pom
1002b downloaded  (xbean-2.2.0.pom)
Downloading: http://dist.wso2.org/maven2//de/schlichtherle/io/truezip/6.6/truezip-6.6.pom
604b downloaded  (truezip-6.6.pom)
Downloading: http://dist.wso2.org/maven2//groovy/groovy-all/1.1-rc-1/groovy-all-1.1-rc-1.pom
21K downloaded  (groovy-all-1.1-rc-1.pom)
Downloading: http://dist.wso2.org/maven2//junit/junit/3.8.2/junit-3.8.2.pom
747b downloaded  (junit-3.8.2.pom)
Downloading: http://dist.wso2.org/maven2//org/apache/activemq/activemq-core/5.2.0/activemq-core-5.2.0.pom
[INFO] Unable to find resource 'org.apache.activemq:activemq-core:pom:5.2.0' in repository
wso2-m2 (http://dist.wso2.org/maven2/)
Downloading: https://oosnmp.net/dist/release//org/apache/activemq/activemq-core/5.2.0/activemq-core-5.2.0.pom
[WARNING] Unable to get resource 'org.apache.activemq:activemq-core:pom:5.2.0' from repository
snmp4j-repo (https://oosnmp.net/dist/release/): Error transferring file: sun.security.validator.ValidatorException:
PKIX path building failed: sun.security.provider.certpath.SunCertPathBuilderException: unable
to find valid certification path to requested target
Downloading: http://repo1.maven.org/maven2/org/apache/activemq/activemq-core/5.2.0/activemq-core-5.2.0.pom
23K downloaded  (activemq-core-5.2.0.pom)
Downloading: http://dist.wso2.org/maven2//org/apache/activemq/activemq-parent/5.2.0/activemq-parent-5.2.0.pom
[INFO] Unable to find resource 'org.apache.activemq:activemq-parent:pom:5.2.0' in repository
wso2-m2 (http://dist.wso2.org/maven2/)
Downloading: https://oosnmp.net/dist/release//org/apache/activemq/activemq-parent/5.2.0/activemq-parent-5.2.0.pom
[WARNING] Unable to get resource 'org.apache.activemq:activemq-parent:pom:5.2.0' from repository
snmp4j-repo (https://oosnmp.net/dist/release/): Error transferring file: sun.security.validator.ValidatorException:
PKIX path building failed: sun.security.provider.certpath.SunCertPathBuilderException: unable
to find valid certification path to requested target
Downloading: http://repo1.maven.org/maven2/org/apache/activemq/activemq-parent/5.2.0/activemq-parent-5.2.0.pom
44K downloaded  (activemq-parent-5.2.0.pom)
[INFO] snapshot org.apache.axis2:axis2-transport-testkit:1.7.0-SNAPSHOT: checking for updates
from wso2-m2-snapshots
[INFO] snapshot org.apache.axis2:axis2-transport-testkit:1.7.0-SNAPSHOT: checking for updates
from apache.snapshots
Downloading: http://repository.apache.org/snapshots/org/apache/axis2/axis2-transport-testkit/1.7.0-SNAPSHOT/axis2-transport-testkit-1.7.0-20150522.212320-1475.pom
10K downloaded  (axis2-transport-testkit-1.7.0-20150522.212320-1475.pom)
Downloading: http://dist.wso2.org/maven2//org/apache/derby/derby/10.4.2.0/derby-10.4.2.0.pom
1K downloaded  (derby-10.4.2.0.pom)
Downloading: http://dist.wso2.org/maven2//org/apache/derby/derbyclient/10.4.2.0/derbyclient-10.4.2.0.pom
[INFO] Unable to find resource 'org.apache.derby:derbyclient:pom:10.4.2.0' in repository wso2-m2
(http://dist.wso2.org/maven2/)
Downloading: https://oosnmp.net/dist/release//org/apache/derby/derbyclient/10.4.2.0/derbyclient-10.4.2.0.pom
[WARNING] Unable to get resource 'org.apache.derby:derbyclient:pom:10.4.2.0' from repository
snmp4j-repo (https://oosnmp.net/dist/release/): Error transferring file: sun.security.validator.ValidatorException:
PKIX path building failed: sun.security.provider.certpath.SunCertPathBuilderException: unable
to find valid certification path to requested target
Downloading: http://repo1.maven.org/maven2/org/apache/derby/derbyclient/10.4.2.0/derbyclient-10.4.2.0.pom
1K downloaded  (derbyclient-10.4.2.0.pom)
Downloading: http://dist.wso2.org/maven2//org/apache/derby/derbynet/10.4.2.0/derbynet-10.4.2.0.pom
[INFO] Unable to find resource 'org.apache.derby:derbynet:pom:10.4.2.0' in repository wso2-m2
(http://dist.wso2.org/maven2/)
Downloading: https://oosnmp.net/dist/release//org/apache/derby/derbynet/10.4.2.0/derbynet-10.4.2.0.pom
[WARNING] Unable to get resource 'org.apache.derby:derbynet:pom:10.4.2.0' from repository
snmp4j-repo (https://oosnmp.net/dist/release/): Error transferring file: sun.security.validator.ValidatorException:
PKIX path building failed: sun.security.provider.certpath.SunCertPathBuilderException: unable
to find valid certification path to requested target
Downloading: http://repo1.maven.org/maven2/org/apache/derby/derbynet/10.4.2.0/derbynet-10.4.2.0.pom
1K downloaded  (derbynet-10.4.2.0.pom)
Downloading: http://dist.wso2.org/maven2//org/apache/httpcomponents/httpclient/4.3.1/httpclient-4.3.1.pom
[INFO] Unable to find resource 'org.apache.httpcomponents:httpclient:pom:4.3.1' in repository
wso2-m2 (http://dist.wso2.org/maven2/)
Downloading: https://oosnmp.net/dist/release//org/apache/httpcomponents/httpclient/4.3.1/httpclient-4.3.1.pom
[WARNING] Unable to get resource 'org.apache.httpcomponents:httpclient:pom:4.3.1' from repository
snmp4j-repo (https://oosnmp.net/dist/release/): Error transferring file: sun.security.validator.ValidatorException:
PKIX path building failed: sun.security.provider.certpath.SunCertPathBuilderException: unable
to find valid certification path to requested target
Downloading: http://repo1.maven.org/maven2/org/apache/httpcomponents/httpclient/4.3.1/httpclient-4.3.1.pom
5K downloaded  (httpclient-4.3.1.pom)
Downloading: http://dist.wso2.org/maven2//org/apache/httpcomponents/httpcomponents-client/4.3.1/httpcomponents-client-4.3.1.pom
[INFO] Unable to find resource 'org.apache.httpcomponents:httpcomponents-client:pom:4.3.1'
in repository wso2-m2 (http://dist.wso2.org/maven2/)
Downloading: https://oosnmp.net/dist/release//org/apache/httpcomponents/httpcomponents-client/4.3.1/httpcomponents-client-4.3.1.pom
[WARNING] Unable to get resource 'org.apache.httpcomponents:httpcomponents-client:pom:4.3.1'
from repository snmp4j-repo (https://oosnmp.net/dist/release/): Error transferring file: sun.security.validator.ValidatorException:
PKIX path building failed: sun.security.provider.certpath.SunCertPathBuilderException: unable
to find valid certification path to requested target
Downloading: http://repo1.maven.org/maven2/org/apache/httpcomponents/httpcomponents-client/4.3.1/httpcomponents-client-4.3.1.pom
15K downloaded  (httpcomponents-client-4.3.1.pom)
Downloading: http://dist.wso2.org/maven2//org/jruby/jruby-complete/1.3.0/jruby-complete-1.3.0.pom
[INFO] Unable to find resource 'org.jruby:jruby-complete:pom:1.3.0' in repository wso2-m2
(http://dist.wso2.org/maven2/)
Downloading: https://oosnmp.net/dist/release//org/jruby/jruby-complete/1.3.0/jruby-complete-1.3.0.pom
[WARNING] Unable to get resource 'org.jruby:jruby-complete:pom:1.3.0' from repository snmp4j-repo
(https://oosnmp.net/dist/release/): Error transferring file: sun.security.validator.ValidatorException:
PKIX path building failed: sun.security.provider.certpath.SunCertPathBuilderException: unable
to find valid certification path to requested target
Downloading: http://repo1.maven.org/maven2/org/jruby/jruby-complete/1.3.0/jruby-complete-1.3.0.pom
4K downloaded  (jruby-complete-1.3.0.pom)
Downloading: http://dist.wso2.org/maven2//org/jruby/shared/1.3.0/shared-1.3.0.pom
[INFO] Unable to find resource 'org.jruby:shared:pom:1.3.0' in repository wso2-m2 (http://dist.wso2.org/maven2/)
Downloading: https://oosnmp.net/dist/release//org/jruby/shared/1.3.0/shared-1.3.0.pom
[WARNING] Unable to get resource 'org.jruby:shared:pom:1.3.0' from repository snmp4j-repo
(https://oosnmp.net/dist/release/): Error transferring file: sun.security.validator.ValidatorException:
PKIX path building failed: sun.security.provider.certpath.SunCertPathBuilderException: unable
to find valid certification path to requested target
Downloading: http://repo1.maven.org/maven2/org/jruby/shared/1.3.0/shared-1.3.0.pom
3K downloaded  (shared-1.3.0.pom)
Downloading: http://dist.wso2.org/maven2//xmlunit/xmlunit/1.3/xmlunit-1.3.pom
[INFO] Unable to find resource 'xmlunit:xmlunit:pom:1.3' in repository wso2-m2 (http://dist.wso2.org/maven2/)
Downloading: https://oosnmp.net/dist/release//xmlunit/xmlunit/1.3/xmlunit-1.3.pom
[WARNING] Unable to get resource 'xmlunit:xmlunit:pom:1.3' from repository snmp4j-repo (https://oosnmp.net/dist/release/):
Error transferring file: sun.security.validator.ValidatorException: PKIX path building failed:
sun.security.provider.certpath.SunCertPathBuilderException: unable to find valid certification
path to requested target
Downloading: http://repo1.maven.org/maven2/xmlunit/xmlunit/1.3/xmlunit-1.3.pom
2K downloaded  (xmlunit-1.3.pom)
[INFO] Generating "Dependencies" report.
[INFO] Generating "Project License" report.
[INFO] Generating "Project Modules" report.
[INFO] Generating "Project Team" report.
[INFO] Generating "Continuous Integration" report.
[FINDBUGS] No report found for mojo site
[JENKINS] Archiving site from <https://builds.apache.org/job/Synapse%20-%20Trunk/ws/java/target/site>
to /x1/jenkins/jenkins-home/jobs/Synapse - Trunk/site
log4j:WARN No appenders could be found for logger (org.apache.commons.beanutils.converters.BooleanConverter).
log4j:WARN Please initialize the log4j system properly.
[INFO] ------------------------------------------------------------------------
[INFO] Building Apache Synapse - Secure Vault
[INFO]    task-segment: [clean, install, site]
[INFO] ------------------------------------------------------------------------
Downloading: http://repo1.maven.org/maven2/org/apache/maven/plugins/maven-compiler-plugin/2.3.2/maven-compiler-plugin-2.3.2.jar
28K downloaded  (maven-compiler-plugin-2.3.2.jar)
Downloading: http://repo1.maven.org/maven2/org/apache/maven/plugins/maven-surefire-plugin/2.11/maven-surefire-plugin-2.11.jar
30K downloaded  (maven-surefire-plugin-2.11.jar)
[INFO] [clean:clean {execution: default-clean}]
Downloading: http://repo1.maven.org/maven2/org/apache/maven/plugins/maven-resources-plugin/2.5/maven-resources-plugin-2.5.jar
25K downloaded  (maven-resources-plugin-2.5.jar)
[INFO] [remote-resources:process {execution: default}]
Downloading: http://dist.wso2.org/maven2//org/apache/geronimo/specs/geronimo-activation_1.1_spec/1.1/geronimo-activation_1.1_spec-1.1.pom
[INFO] Unable to find resource 'org.apache.geronimo.specs:geronimo-activation_1.1_spec:pom:1.1'
in repository wso2-m2 (http://dist.wso2.org/maven2/)
Downloading: https://oosnmp.net/dist/release//org/apache/geronimo/specs/geronimo-activation_1.1_spec/1.1/geronimo-activation_1.1_spec-1.1.pom
[WARNING] Unable to get resource 'org.apache.geronimo.specs:geronimo-activation_1.1_spec:pom:1.1'
from repository snmp4j-repo (https://oosnmp.net/dist/release/): Error transferring file: sun.security.validator.ValidatorException:
PKIX path building failed: sun.security.provider.certpath.SunCertPathBuilderException: unable
to find valid certification path to requested target
Downloading: http://repo1.maven.org/maven2/org/apache/geronimo/specs/geronimo-activation_1.1_spec/1.1/geronimo-activation_1.1_spec-1.1.pom
4K downloaded  (geronimo-activation_1.1_spec-1.1.pom)
Downloading: http://dist.wso2.org/maven2//org/apache/geronimo/genesis/genesis-java5-flava/2.0/genesis-java5-flava-2.0.pom
[INFO] Unable to find resource 'org.apache.geronimo.genesis:genesis-java5-flava:pom:2.0' in
repository wso2-m2 (http://dist.wso2.org/maven2/)
Downloading: https://oosnmp.net/dist/release//org/apache/geronimo/genesis/genesis-java5-flava/2.0/genesis-java5-flava-2.0.pom
[WARNING] Unable to get resource 'org.apache.geronimo.genesis:genesis-java5-flava:pom:2.0'
from repository snmp4j-repo (https://oosnmp.net/dist/release/): Error transferring file: sun.security.validator.ValidatorException:
PKIX path building failed: sun.security.provider.certpath.SunCertPathBuilderException: unable
to find valid certification path to requested target
Downloading: http://repo1.maven.org/maven2/org/apache/geronimo/genesis/genesis-java5-flava/2.0/genesis-java5-flava-2.0.pom
5K downloaded  (genesis-java5-flava-2.0.pom)
Downloading: http://dist.wso2.org/maven2//org/apache/geronimo/genesis/genesis-default-flava/2.0/genesis-default-flava-2.0.pom
[INFO] Unable to find resource 'org.apache.geronimo.genesis:genesis-default-flava:pom:2.0'
in repository wso2-m2 (http://dist.wso2.org/maven2/)
Downloading: https://oosnmp.net/dist/release//org/apache/geronimo/genesis/genesis-default-flava/2.0/genesis-default-flava-2.0.pom
[WARNING] Unable to get resource 'org.apache.geronimo.genesis:genesis-default-flava:pom:2.0'
from repository snmp4j-repo (https://oosnmp.net/dist/release/): Error transferring file: sun.security.validator.ValidatorException:
PKIX path building failed: sun.security.provider.certpath.SunCertPathBuilderException: unable
to find valid certification path to requested target
Downloading: http://repo1.maven.org/maven2/org/apache/geronimo/genesis/genesis-default-flava/2.0/genesis-default-flava-2.0.pom
17K downloaded  (genesis-default-flava-2.0.pom)
Downloading: http://dist.wso2.org/maven2//org/apache/geronimo/genesis/genesis/2.0/genesis-2.0.pom
[INFO] Unable to find resource 'org.apache.geronimo.genesis:genesis:pom:2.0' in repository
wso2-m2 (http://dist.wso2.org/maven2/)
Downloading: https://oosnmp.net/dist/release//org/apache/geronimo/genesis/genesis/2.0/genesis-2.0.pom
[WARNING] Unable to get resource 'org.apache.geronimo.genesis:genesis:pom:2.0' from repository
snmp4j-repo (https://oosnmp.net/dist/release/): Error transferring file: sun.security.validator.ValidatorException:
PKIX path building failed: sun.security.provider.certpath.SunCertPathBuilderException: unable
to find valid certification path to requested target
Downloading: http://repo1.maven.org/maven2/org/apache/geronimo/genesis/genesis/2.0/genesis-2.0.pom
17K downloaded  (genesis-2.0.pom)
Downloading: http://dist.wso2.org/maven2//commons-logging/commons-logging/1.2/commons-logging-1.2.pom
[INFO] Unable to find resource 'commons-logging:commons-logging:pom:1.2' in repository wso2-m2
(http://dist.wso2.org/maven2/)
Downloading: https://oosnmp.net/dist/release//commons-logging/commons-logging/1.2/commons-logging-1.2.pom
[WARNING] Unable to get resource 'commons-logging:commons-logging:pom:1.2' from repository
snmp4j-repo (https://oosnmp.net/dist/release/): Error transferring file: sun.security.validator.ValidatorException:
PKIX path building failed: sun.security.provider.certpath.SunCertPathBuilderException: unable
to find valid certification path to requested target
Downloading: http://repo1.maven.org/maven2/commons-logging/commons-logging/1.2/commons-logging-1.2.pom
18K downloaded  (commons-logging-1.2.pom)
Downloading: http://dist.wso2.org/maven2//org/apache/commons/commons-parent/34/commons-parent-34.pom
[INFO] Unable to find resource 'org.apache.commons:commons-parent:pom:34' in repository wso2-m2
(http://dist.wso2.org/maven2/)
Downloading: https://oosnmp.net/dist/release//org/apache/commons/commons-parent/34/commons-parent-34.pom
[WARNING] Unable to get resource 'org.apache.commons:commons-parent:pom:34' from repository
snmp4j-repo (https://oosnmp.net/dist/release/): Error transferring file: sun.security.validator.ValidatorException:
PKIX path building failed: sun.security.provider.certpath.SunCertPathBuilderException: unable
to find valid certification path to requested target
Downloading: http://repo1.maven.org/maven2/org/apache/commons/commons-parent/34/commons-parent-34.pom
54K downloaded  (commons-parent-34.pom)
Downloading: http://dist.wso2.org/maven2//jaxen/jaxen/1.1.4/jaxen-1.1.4.pom
[INFO] Unable to find resource 'jaxen:jaxen:pom:1.1.4' in repository wso2-m2 (http://dist.wso2.org/maven2/)
Downloading: https://oosnmp.net/dist/release//jaxen/jaxen/1.1.4/jaxen-1.1.4.pom
[WARNING] Unable to get resource 'jaxen:jaxen:pom:1.1.4' from repository snmp4j-repo (https://oosnmp.net/dist/release/):
Error transferring file: sun.security.validator.ValidatorException: PKIX path building failed:
sun.security.provider.certpath.SunCertPathBuilderException: unable to find valid certification
path to requested target
Downloading: http://repo1.maven.org/maven2/jaxen/jaxen/1.1.4/jaxen-1.1.4.pom
12K downloaded  (jaxen-1.1.4.pom)
Downloading: http://dist.wso2.org/maven2//org/sonatype/oss/oss-parent/7/oss-parent-7.pom
[INFO] Unable to find resource 'org.sonatype.oss:oss-parent:pom:7' in repository wso2-m2 (http://dist.wso2.org/maven2/)
Downloading: https://oosnmp.net/dist/release//org/sonatype/oss/oss-parent/7/oss-parent-7.pom
[WARNING] Unable to get resource 'org.sonatype.oss:oss-parent:pom:7' from repository snmp4j-repo
(https://oosnmp.net/dist/release/): Error transferring file: sun.security.validator.ValidatorException:
PKIX path building failed: sun.security.provider.certpath.SunCertPathBuilderException: unable
to find valid certification path to requested target
Downloading: http://repo1.maven.org/maven2/org/sonatype/oss/oss-parent/7/oss-parent-7.pom
4K downloaded  (oss-parent-7.pom)
Downloading: http://dist.wso2.org/maven2//org/apache/geronimo/specs/geronimo-stax-api_1.0_spec/1.0.1/geronimo-stax-api_1.0_spec-1.0.1.pom
2K downloaded  (geronimo-stax-api_1.0_spec-1.0.1.pom)
Downloading: http://dist.wso2.org/maven2//org/apache/geronimo/specs/specs/1.3/specs-1.3.pom
6K downloaded  (specs-1.3.pom)
[INFO] ------------------------------------------------------------------------
[ERROR] BUILD ERROR
[INFO] ------------------------------------------------------------------------
[INFO] Failed to resolve dependencies for one or more projects in the reactor. Reason: Unable
to get dependency information: Unable to read the metadata file for artifact 'org.apache.geronimo.specs:geronimo-stax-api_1.0_spec:jar':
Cannot find parent: org.apache.geronimo.genesis.config:config for project: null:project-config:pom:1.1
for project null:project-config:pom:1.1
  org.apache.geronimo.specs:geronimo-stax-api_1.0_spec:jar:1.0.1

from the specified remote repositories:
  apache.snapshots (http://repository.apache.org/snapshots),
  central (http://repo1.maven.org/maven2),
  snmp4j-repo (https://oosnmp.net/dist/release/),
  wso2-m2-snapshots (http://dist.wso2.org/snapshots/maven2/),
  wso2-m2 (http://dist.wso2.org/maven2/)

Path to dependency: 
	1) org.apache.synapse:synapse-securevault:bundle:2.2.0-SNAPSHOT
	2) org.apache.ws.commons.axiom:axiom-api:jar:1.2.15-SNAPSHOT



Not a v4.0.0 POM. for project org.apache.geronimo.genesis.config:config at <https://builds.apache.org/job/Synapse%20-%20Trunk/ws/.repository/org/apache/geronimo/genesis/config/config/1.1/config-1.1.pom>
[INFO] ------------------------------------------------------------------------
[INFO] For more information, run Maven with the -e switch
[INFO] ------------------------------------------------------------------------
[INFO] Total time: 6 minutes 14 seconds
[INFO] Finished at: Fri May 22 22:54:10 UTC 2015
[INFO] Final Memory: 89M/376M
[INFO] ------------------------------------------------------------------------
[JENKINS] Archiving <https://builds.apache.org/job/Synapse%20-%20Trunk/ws/.repository/org/apache/synapse/Apache-Synapse/2.2.0-SNAPSHOT/Apache-Synapse-2.2.0-SNAPSHOT.pom>
to org.apache.synapse/Apache-Synapse/2.2.0-SNAPSHOT/Apache-Synapse-2.2.0-SNAPSHOT.pom
<https://builds.apache.org/job/Synapse%20-%20Trunk/ws/.repository/org/apache/synapse/Apache-Synapse/2.2.0-SNAPSHOT/Apache-Synapse-2.2.0-SNAPSHOT.pom>
is not inside <https://builds.apache.org/job/Synapse%20-%20Trunk/ws/java/;> will archive
in a separate pass
Sending artifact delta relative to Synapse - Trunk » Apache Synapse #4970
Archived 1 artifacts
Archive block size is 32768
Received 1 blocks and 21185 bytes
Compression is 60.7%
Took 51 ms
[JENKINS] Archiving <https://builds.apache.org/job/Synapse%20-%20Trunk/ws/java/modules/securevault/pom.xml>
to org.apache.synapse/synapse-securevault/2.2.0-SNAPSHOT/synapse-securevault-2.2.0-SNAPSHOT.pom
Sending artifact delta relative to Synapse - Trunk » Apache Synapse - Secure Vault #4970
Archived 1 artifacts
Archive block size is 32768
Received 0 blocks and 4444 bytes
Compression is 0.0%
Took 44 ms
Sending e-mails to: dev@synapse.apache.org
channel stopped
[locks-and-latches] Releasing all the locks
[locks-and-latches] All the locks released

---------------------------------------------------------------------
To unsubscribe, e-mail: dev-unsubscribe@synapse.apache.org
For additional commands, e-mail: dev-help@synapse.apache.org


Mime
View raw message