synapse-dev mailing list archives

Site index · List index
Message view « Date » · « Thread »
Top « Date » · « Thread »
From Apache Jenkins Server <jenk...@builds.apache.org>
Subject Build failed in Jenkins: Synapse - Trunk » Apache Synapse - Extensions #5134
Date Sat, 05 Sep 2015 09:59:15 GMT
See <https://builds.apache.org/job/Synapse%20-%20Trunk/org.apache.synapse$synapse-extensions/5134/>

------------------------------------------
[INFO] ------------------------------------------------------------------------
[INFO] Building Apache Synapse - Extensions
[INFO]    task-segment: [clean, install, site]
[INFO] ------------------------------------------------------------------------
[INFO] [clean:clean {execution: default-clean}]
[INFO] Deleting <https://builds.apache.org/job/Synapse%20-%20Trunk/org.apache.synapse$synapse-extensions/ws/target>
[INFO] [remote-resources:process {execution: default}]
[INFO] snapshot org.apache.synapse:synapse-core:2.2.0-SNAPSHOT: checking for updates from
wso2-m2-snapshots
[INFO] snapshot org.apache.synapse:synapse-core:2.2.0-SNAPSHOT: checking for updates from
apache.snapshots
[WARNING] org.apache.velocity.runtime.exception.ReferenceException: reference : template =
META-INF/DEPENDENCIES.vm [line 40,column 14] : $license.name is not a valid reference.
[debug] execute contextualize
[INFO] [resources:resources {execution: default-resources}]
[INFO] Using 'UTF-8' encoding to copy filtered resources.
[INFO] Copying 3 resources
[INFO] Copying 3 resources
[INFO] [compiler:compile {execution: default-compile}]
[INFO] Compiling 25 source files to <https://builds.apache.org/job/Synapse%20-%20Trunk/org.apache.synapse$synapse-extensions/ws/target/classes>
[INFO] -------------------------------------------------------------
[ERROR] COMPILATION ERROR : 
[INFO] -------------------------------------------------------------
[ERROR] <https://builds.apache.org/job/Synapse%20-%20Trunk/org.apache.synapse$synapse-extensions/ws/src/main/java/org/apache/synapse/format/syslog/SyslogMessageBuilder.java>:[128,28]
cannot find symbol
symbol  : constructor OMLinkedListImplFactory()
location: class org.apache.axiom.om.impl.llom.factory.OMLinkedListImplFactory
[INFO] 1 error
[INFO] -------------------------------------------------------------
[INFO] ------------------------------------------------------------------------
[ERROR] BUILD FAILURE
[INFO] ------------------------------------------------------------------------
[INFO] Compilation failure
<https://builds.apache.org/job/Synapse%20-%20Trunk/org.apache.synapse$synapse-extensions/ws/src/main/java/org/apache/synapse/format/syslog/SyslogMessageBuilder.java>:[128,28]
cannot find symbol
symbol  : constructor OMLinkedListImplFactory()
location: class org.apache.axiom.om.impl.llom.factory.OMLinkedListImplFactory

[INFO] ------------------------------------------------------------------------
[INFO] For more information, run Maven with the -e switch
[INFO] ------------------------------------------------------------------------
[INFO] Total time: 5 minutes 30 seconds
[INFO] Finished at: Sat Sep 05 10:00:03 UTC 2015
[INFO] Final Memory: 191M/685M
[INFO] ------------------------------------------------------------------------
Waiting for Jenkins to finish collecting data

---------------------------------------------------------------------
To unsubscribe, e-mail: dev-unsubscribe@synapse.apache.org
For additional commands, e-mail: dev-help@synapse.apache.org


Mime
View raw message