synapse-dev mailing list archives

Site index · List index
Message view « Date » · « Thread »
Top « Date » · « Thread »
From Apache Jenkins Server <jenk...@builds.apache.org>
Subject Build failed in Jenkins: Synapse - Trunk #5146
Date Sun, 20 Sep 2015 11:44:29 GMT
See <https://builds.apache.org/job/Synapse%20-%20Trunk/5146/>

------------------------------------------
[...truncated 815 lines...]
[INFO] Parent project loaded from repository: org.apache:apache:pom:9
[INFO] Relativizing decoration links with respect to project URL: http://maven.apache.org
[INFO] Rendering site with org.apache.maven.skins:maven-default-skin:jar:1.0 skin.
[INFO] Generating "About" report.
[INFO] Generating "Source Repository" report.
[INFO] Generating "Plugin Management" report.
[INFO] Generating "Mailing Lists" report.
[INFO] Generating "Issue Tracking" report.
[INFO] Generating "Project Plugins" report.
[INFO] Generating "Dependency Convergence" report.
[INFO] Generating "Project Summary" report.
[INFO] Generating "Dependency Management" report.
[INFO] Generating "Dependencies" report.
[INFO] Generating "Project License" report.
[INFO] Generating "Project Team" report.
[INFO] Generating "Continuous Integration" report.
[FINDBUGS] No report found for mojo site
[JENKINS] Archiving site from <https://builds.apache.org/job/Synapse%20-%20Trunk/ws/java/modules/transports/optional/amqp/target/site>
to /x1/jenkins/jenkins-home/jobs/Synapse - Trunk/site/synapse-transports/synapse-amqp-transport
[INFO] ------------------------------------------------------------------------
[INFO] Building Apache Synapse - Tasks
[INFO]    task-segment: [clean, install, site]
[INFO] ------------------------------------------------------------------------
[INFO] [clean:clean {execution: default-clean}]
[INFO] Deleting <https://builds.apache.org/job/Synapse%20-%20Trunk/ws/java/modules/tasks/target>
[INFO] [remote-resources:process {execution: default}]
[WARNING] org.apache.velocity.runtime.exception.ReferenceException: reference : template =
META-INF/DEPENDENCIES.vm [line 40,column 14] : $license.name is not a valid reference.
[debug] execute contextualize
[INFO] [resources:resources {execution: default-resources}]
[INFO] Using 'UTF-8' encoding to copy filtered resources.
[INFO] Copying 0 resource
[INFO] Copying 3 resources
[INFO] [compiler:compile {execution: default-compile}]
[INFO] Compiling 16 source files to <https://builds.apache.org/job/Synapse%20-%20Trunk/ws/java/modules/tasks/target/classes>
[debug] execute contextualize
[INFO] [resources:testResources {execution: default-testResources}]
[INFO] Using 'UTF-8' encoding to copy filtered resources.
[INFO] skip non existing resourceDirectory <https://builds.apache.org/job/Synapse%20-%20Trunk/ws/java/modules/tasks/src/test/resources>
[INFO] Copying 3 resources
[INFO] [compiler:testCompile {execution: default-testCompile}]
[INFO] No sources to compile
[INFO] [surefire:test {execution: default-test}]
[INFO] Surefire report directory: <https://builds.apache.org/job/Synapse%20-%20Trunk/ws/java/modules/tasks/target/surefire-reports>

-------------------------------------------------------
 T E S T S
-------------------------------------------------------

Results :

Tests run: 0, Failures: 0, Errors: 0, Skipped: 0

[JENKINS] Recording test results[INFO] [bundle:bundle {execution: default-bundle}]

[INFO] [install:install {execution: default-install}]
[INFO] Installing <https://builds.apache.org/job/Synapse%20-%20Trunk/ws/java/modules/tasks/target/synapse-tasks-2.2.0-SNAPSHOT.jar>
to <https://builds.apache.org/job/Synapse%20-%20Trunk/ws/.repository/org/apache/synapse/synapse-tasks/2.2.0-SNAPSHOT/synapse-tasks-2.2.0-SNAPSHOT.jar>
[INFO] [bundle:install {execution: default-install}]
[INFO] Installing org/apache/synapse/synapse-tasks/2.2.0-SNAPSHOT/synapse-tasks-2.2.0-SNAPSHOT.jar
[INFO] Writing OBR metadata
[INFO] [site:site {execution: default-site}]
[INFO] Parent project loaded from repository: org.apache:apache:pom:9
[INFO] Relativizing decoration links with respect to project URL: http://synapse.apache.org/modules/synapse-tasks
[INFO] Rendering site with org.apache.maven.skins:maven-default-skin:jar:1.0 skin.
[INFO] Generating "About" report.
[INFO] Generating "Source Repository" report.
[INFO] Generating "Plugin Management" report.
[INFO] Generating "Mailing Lists" report.
[INFO] Generating "Issue Tracking" report.
[INFO] Generating "Project Plugins" report.
[INFO] Generating "Dependency Convergence" report.
[INFO] Generating "Project Summary" report.
[INFO] Generating "Dependency Management" report.
[INFO] Generating "Dependencies" report.
[INFO] Generating "Project License" report.
[INFO] Generating "Project Team" report.
[INFO] Generating "Continuous Integration" report.
[FINDBUGS] No report found for mojo site
[JENKINS] Archiving site from <https://builds.apache.org/job/Synapse%20-%20Trunk/ws/java/modules/tasks/target/site>
to /x1/jenkins/jenkins-home/jobs/Synapse - Trunk/site/synapse-tasks
[INFO] ------------------------------------------------------------------------
[INFO] Building Apache Synapse - Core
[INFO]    task-segment: [clean, install, site]
[INFO] ------------------------------------------------------------------------
[INFO] [clean:clean {execution: default-clean}]
[INFO] Deleting <https://builds.apache.org/job/Synapse%20-%20Trunk/ws/java/modules/core/target>
[INFO] [remote-resources:process {execution: default}]
[INFO] snapshot org.apache.synapse:synapse-tasks:2.2.0-SNAPSHOT: checking for updates from
wso2-m2-snapshots
Downloading: http://repository.apache.org/snapshots/org/apache/axis2/axis2-saaj/1.7.0-SNAPSHOT/axis2-saaj-1.7.0-20150920.111318-2220.jar
Downloading: http://repository.apache.org/snapshots/org/apache/ws/commons/axiom/axiom-dom/1.2.16-SNAPSHOT/axiom-dom-1.2.16-20150920.110213-185.jar
90K downloaded  (axis2-saaj-1.7.0-20150920.111318-2220.jar)
697K downloaded  (axiom-dom-1.2.16-20150920.110213-185.jar)
Downloading: http://repository.apache.org/snapshots/org/apache/axis2/axis2-clustering/1.7.0-SNAPSHOT/axis2-clustering-1.7.0-20150920.111249-2250.jar
105K downloaded  (axis2-clustering-1.7.0-20150920.111249-2250.jar)
Downloading: http://repository.apache.org/snapshots/org/apache/axis2/axis2-transport-jms/1.7.0-SNAPSHOT/axis2-transport-jms-1.7.0-20150920.113429-1648.jar
78K downloaded  (axis2-transport-jms-1.7.0-20150920.113429-1648.jar)
Downloading: http://repository.apache.org/snapshots/org/apache/axis2/axis2-transport-mail/1.7.0-SNAPSHOT/axis2-transport-mail-1.7.0-20150920.113534-1648.jar
40K downloaded  (axis2-transport-mail-1.7.0-20150920.113534-1648.jar)
Downloading: http://repository.apache.org/snapshots/org/apache/axis2/axis2-transport-local/1.7.0-SNAPSHOT/axis2-transport-local-1.7.0-20150920.110924-2287.jar
19K downloaded  (axis2-transport-local-1.7.0-20150920.110924-2287.jar)
Downloading: http://repository.apache.org/snapshots/org/apache/axis2/axis2-adb/1.7.0-SNAPSHOT/axis2-adb-1.7.0-20150920.110917-2295.jar
659K downloaded  (axis2-adb-1.7.0-20150920.110917-2295.jar)
[INFO] snapshot org.apache.synapse:synapse-tasks:2.2.0-SNAPSHOT: checking for updates from
apache.snapshots
[INFO] snapshot org.apache.synapse:synapse-nhttp-transport:2.2.0-SNAPSHOT: checking for updates
from wso2-m2-snapshots
[INFO] snapshot org.apache.synapse:synapse-nhttp-transport:2.2.0-SNAPSHOT: checking for updates
from apache.snapshots
[INFO] snapshot org.apache.synapse:synapse-vfs-transport:2.2.0-SNAPSHOT: checking for updates
from wso2-m2-snapshots
[INFO] snapshot org.apache.synapse:synapse-vfs-transport:2.2.0-SNAPSHOT: checking for updates
from apache.snapshots
[WARNING] org.apache.velocity.runtime.exception.ReferenceException: reference : template =
META-INF/DEPENDENCIES.vm [line 40,column 14] : $license.name is not a valid reference.
[debug] execute contextualize
[INFO] [resources:resources {execution: default-resources}]
[INFO] Using 'UTF-8' encoding to copy filtered resources.
[INFO] Copying 1 resource
[INFO] Copying 3 resources
[INFO] [compiler:compile {execution: default-compile}]
[INFO] Compiling 509 source files to <https://builds.apache.org/job/Synapse%20-%20Trunk/ws/java/modules/core/target/classes>
[INFO] -------------------------------------------------------------
[WARNING] COMPILATION WARNING : 
[INFO] -------------------------------------------------------------
[WARNING] <https://builds.apache.org/job/Synapse%20-%20Trunk/ws/java/modules/core/src/main/java/org/apache/synapse/config/xml/MediatorFactoryFinder.java>:[31,15]
sun.misc.Service is Sun proprietary API and may be removed in a future release
[WARNING] <https://builds.apache.org/job/Synapse%20-%20Trunk/ws/java/modules/core/src/main/java/org/apache/synapse/config/xml/StartupFinder.java>:[37,15]
sun.misc.Service is Sun proprietary API and may be removed in a future release
[WARNING] <https://builds.apache.org/job/Synapse%20-%20Trunk/ws/java/modules/core/src/main/java/org/apache/synapse/config/xml/ConfigurationFactoryAndSerializerFinder.java>:[29,15]
sun.misc.Service is Sun proprietary API and may be removed in a future release
[WARNING] <https://builds.apache.org/job/Synapse%20-%20Trunk/ws/java/modules/core/src/main/java/org/apache/synapse/config/xml/MediatorSerializerFinder.java>:[27,15]
sun.misc.Service is Sun proprietary API and may be removed in a future release
[WARNING] <https://builds.apache.org/job/Synapse%20-%20Trunk/ws/java/modules/core/src/main/java/org/apache/synapse/config/xml/MediatorFactoryFinder.java>:[140,22]
sun.misc.Service is Sun proprietary API and may be removed in a future release
[WARNING] <https://builds.apache.org/job/Synapse%20-%20Trunk/ws/java/modules/core/src/main/java/org/apache/synapse/config/xml/StartupFinder.java>:[115,25]
sun.misc.Service is Sun proprietary API and may be removed in a future release
[WARNING] <https://builds.apache.org/job/Synapse%20-%20Trunk/ws/java/modules/core/src/main/java/org/apache/synapse/config/xml/ConfigurationFactoryAndSerializerFinder.java>:[117,22]
sun.misc.Service is Sun proprietary API and may be removed in a future release
[WARNING] <https://builds.apache.org/job/Synapse%20-%20Trunk/ws/java/modules/core/src/main/java/org/apache/synapse/config/xml/MediatorSerializerFinder.java>:[116,22]
sun.misc.Service is Sun proprietary API and may be removed in a future release
[INFO] 8 warnings 
[INFO] -------------------------------------------------------------
[INFO] -------------------------------------------------------------
[ERROR] COMPILATION ERROR : 
[INFO] -------------------------------------------------------------
[ERROR] <https://builds.apache.org/job/Synapse%20-%20Trunk/ws/java/modules/core/src/main/java/org/apache/synapse/util/jaxp/DOOMResultBuilder.java>:[30,40]
cannot find symbol
symbol  : class DOOMDocumentBuilderFactory
location: package org.apache.axiom.om.impl.dom.jaxp
[ERROR] <https://builds.apache.org/job/Synapse%20-%20Trunk/ws/java/modules/core/src/main/java/org/apache/synapse/util/jaxp/DOOMResultBuilder.java>:[49,27]
cannot find symbol
symbol  : class DOOMDocumentBuilderFactory
location: class org.apache.synapse.util.jaxp.DOOMResultBuilder
[INFO] 2 errors 
[INFO] -------------------------------------------------------------
[INFO] ------------------------------------------------------------------------
[ERROR] BUILD FAILURE
[INFO] ------------------------------------------------------------------------
[INFO] Compilation failure

<https://builds.apache.org/job/Synapse%20-%20Trunk/ws/java/modules/core/src/main/java/org/apache/synapse/util/jaxp/DOOMResultBuilder.java>:[30,40]
cannot find symbol
symbol  : class DOOMDocumentBuilderFactory
location: package org.apache.axiom.om.impl.dom.jaxp
<https://builds.apache.org/job/Synapse%20-%20Trunk/ws/java/modules/core/src/main/java/org/apache/synapse/util/jaxp/DOOMResultBuilder.java>:[49,27]
cannot find symbol
symbol  : class DOOMDocumentBuilderFactory
location: class org.apache.synapse.util.jaxp.DOOMResultBuilder

[INFO] ------------------------------------------------------------------------
[INFO] For more information, run Maven with the -e switch
[INFO] ------------------------------------------------------------------------
[INFO] Total time: 2 minutes 1 second
[INFO] Finished at: Sun Sep 20 11:44:37 UTC 2015
[INFO] Final Memory: 172M/651M
[INFO] ------------------------------------------------------------------------
[JENKINS] Archiving <https://builds.apache.org/job/Synapse%20-%20Trunk/ws/java/modules/tasks/pom.xml>
to org.apache.synapse/synapse-tasks/2.2.0-SNAPSHOT/synapse-tasks-2.2.0-SNAPSHOT.pom
[JENKINS] Archiving <https://builds.apache.org/job/Synapse%20-%20Trunk/ws/java/modules/tasks/target/synapse-tasks-2.2.0-SNAPSHOT.jar>
to org.apache.synapse/synapse-tasks/2.2.0-SNAPSHOT/synapse-tasks-2.2.0-SNAPSHOT.jar
Sending artifact delta relative to Synapse - Trunk » Apache Synapse - Tasks #5145
Archived 2 artifacts
Archive block size is 32768
Received 0 blocks and 38346 bytes
Compression is 0.0%
Took 0.18 sec
[JENKINS] Archiving <https://builds.apache.org/job/Synapse%20-%20Trunk/ws/.repository/org/apache/synapse/Apache-Synapse/2.2.0-SNAPSHOT/Apache-Synapse-2.2.0-SNAPSHOT.pom>
to org.apache.synapse/Apache-Synapse/2.2.0-SNAPSHOT/Apache-Synapse-2.2.0-SNAPSHOT.pom
<https://builds.apache.org/job/Synapse%20-%20Trunk/ws/.repository/org/apache/synapse/Apache-Synapse/2.2.0-SNAPSHOT/Apache-Synapse-2.2.0-SNAPSHOT.pom>
is not inside <https://builds.apache.org/job/Synapse%20-%20Trunk/ws/java/;> will archive
in a separate pass
Sending artifact delta relative to Synapse - Trunk » Apache Synapse #5145
Archived 1 artifacts
Archive block size is 32768
Received 1 blocks and 21188 bytes
Compression is 60.7%
Took 0.12 sec
[JENKINS] Archiving <https://builds.apache.org/job/Synapse%20-%20Trunk/ws/java/modules/commons/pom.xml>
to org.apache.synapse/synapse-commons/2.2.0-SNAPSHOT/synapse-commons-2.2.0-SNAPSHOT.pom
[JENKINS] Archiving <https://builds.apache.org/job/Synapse%20-%20Trunk/ws/java/modules/commons/target/synapse-commons-2.2.0-SNAPSHOT.jar>
to org.apache.synapse/synapse-commons/2.2.0-SNAPSHOT/synapse-commons-2.2.0-SNAPSHOT.jar
Sending artifact delta relative to Synapse - Trunk » Apache Synapse - Commons #5145
Archived 2 artifacts
Archive block size is 32768
Received 0 blocks and 180672 bytes
Compression is 0.0%
Took 0.34 sec
[JENKINS] Archiving <https://builds.apache.org/job/Synapse%20-%20Trunk/ws/java/modules/transports/core/nhttp/pom.xml>
to org.apache.synapse/synapse-nhttp-transport/2.2.0-SNAPSHOT/synapse-nhttp-transport-2.2.0-SNAPSHOT.pom
[JENKINS] Archiving <https://builds.apache.org/job/Synapse%20-%20Trunk/ws/java/modules/transports/core/nhttp/target/synapse-nhttp-transport-2.2.0-SNAPSHOT.jar>
to org.apache.synapse/synapse-nhttp-transport/2.2.0-SNAPSHOT/synapse-nhttp-transport-2.2.0-SNAPSHOT.jar
[JENKINS] Archiving <https://builds.apache.org/job/Synapse%20-%20Trunk/ws/java/modules/transports/core/nhttp/target/synapse-nhttp-transport-2.2.0-SNAPSHOT-testkit-logs.zip>
to org.apache.synapse/synapse-nhttp-transport/2.2.0-SNAPSHOT/synapse-nhttp-transport-2.2.0-SNAPSHOT-testkit-logs.zip
Sending artifact delta relative to Synapse - Trunk » Apache Synapse - Non-blocking HTTP/s
Transport #5145
Archived 3 artifacts
Archive block size is 32768
Received 0 blocks and 1547070 bytes
Compression is 0.0%
Took 1.3 sec
[JENKINS] Archiving <https://builds.apache.org/job/Synapse%20-%20Trunk/ws/java/modules/transports/optional/fix/pom.xml>
to org.apache.synapse/synapse-fix-transport/2.2.0-SNAPSHOT/synapse-fix-transport-2.2.0-SNAPSHOT.pom
[JENKINS] Archiving <https://builds.apache.org/job/Synapse%20-%20Trunk/ws/java/modules/transports/optional/fix/target/synapse-fix-transport-2.2.0-SNAPSHOT.jar>
to org.apache.synapse/synapse-fix-transport/2.2.0-SNAPSHOT/synapse-fix-transport-2.2.0-SNAPSHOT.jar
Sending artifact delta relative to Synapse - Trunk » Apache Synapse - FIX Transport #5145
Archived 2 artifacts
Archive block size is 32768
Received 0 blocks and 59021 bytes
Compression is 0.0%
Took 47 ms
[JENKINS] Archiving <https://builds.apache.org/job/Synapse%20-%20Trunk/ws/.repository/org/apache/synapse/synapse-transports/2.2.0-SNAPSHOT/synapse-transports-2.2.0-SNAPSHOT.pom>
to org.apache.synapse/synapse-transports/2.2.0-SNAPSHOT/synapse-transports-2.2.0-SNAPSHOT.pom
<https://builds.apache.org/job/Synapse%20-%20Trunk/ws/.repository/org/apache/synapse/synapse-transports/2.2.0-SNAPSHOT/synapse-transports-2.2.0-SNAPSHOT.pom>
is not inside <https://builds.apache.org/job/Synapse%20-%20Trunk/ws/java/modules/transports/;>
will archive in a separate pass
Sending artifact delta relative to Synapse - Trunk » Apache Synapse - Transports #5145
Archived 1 artifacts
Archive block size is 32768
Received 0 blocks and 2952 bytes
Compression is 0.0%
Took 38 ms
[JENKINS] Archiving <https://builds.apache.org/job/Synapse%20-%20Trunk/ws/java/modules/securevault/pom.xml>
to org.apache.synapse/synapse-securevault/2.2.0-SNAPSHOT/synapse-securevault-2.2.0-SNAPSHOT.pom
[JENKINS] Archiving <https://builds.apache.org/job/Synapse%20-%20Trunk/ws/java/modules/securevault/target/synapse-securevault-2.2.0-SNAPSHOT.jar>
to org.apache.synapse/synapse-securevault/2.2.0-SNAPSHOT/synapse-securevault-2.2.0-SNAPSHOT.jar
Sending artifact delta relative to Synapse - Trunk » Apache Synapse - Secure Vault #5145
Archived 2 artifacts
Archive block size is 32768
Received 0 blocks and 92005 bytes
Compression is 0.0%
Took 87 ms
[JENKINS] Archiving <https://builds.apache.org/job/Synapse%20-%20Trunk/ws/java/modules/transports/core/pipe/pom.xml>
to org.apache.synapse/synapse-pipe-transport/2.2.0-SNAPSHOT/synapse-pipe-transport-2.2.0-SNAPSHOT.pom
[JENKINS] Archiving <https://builds.apache.org/job/Synapse%20-%20Trunk/ws/java/modules/transports/core/pipe/target/synapse-pipe-transport-2.2.0-SNAPSHOT.jar>
to org.apache.synapse/synapse-pipe-transport/2.2.0-SNAPSHOT/synapse-pipe-transport-2.2.0-SNAPSHOT.jar
Sending artifact delta relative to Synapse - Trunk » Apache Synapse - PIPE Transport #5145
Archived 2 artifacts
Archive block size is 32768
Received 0 blocks and 23612 bytes
Compression is 0.0%
Took 41 ms
[JENKINS] Archiving <https://builds.apache.org/job/Synapse%20-%20Trunk/ws/java/modules/transports/optional/amqp/pom.xml>
to org.apache.synapse/synapse-amqp-transport/2.2.0-SNAPSHOT/synapse-amqp-transport-2.2.0-SNAPSHOT.pom
[JENKINS] Archiving <https://builds.apache.org/job/Synapse%20-%20Trunk/ws/java/modules/transports/optional/amqp/target/synapse-amqp-transport-2.2.0-SNAPSHOT.jar>
to org.apache.synapse/synapse-amqp-transport/2.2.0-SNAPSHOT/synapse-amqp-transport-2.2.0-SNAPSHOT.jar
Sending artifact delta relative to Synapse - Trunk » Apache Synapse - AMQP Transport #5145
Archived 2 artifacts
Archive block size is 32768
Received 0 blocks and 73559 bytes
Compression is 0.0%
Took 53 ms
[JENKINS] Archiving <https://builds.apache.org/job/Synapse%20-%20Trunk/ws/java/modules/core/pom.xml>
to org.apache.synapse/synapse-core/2.2.0-SNAPSHOT/synapse-core-2.2.0-SNAPSHOT.pom
Sending artifact delta relative to Synapse - Trunk » Apache Synapse - Core #5145
Archived 1 artifacts
Archive block size is 32768
Received 0 blocks and 15420 bytes
Compression is 0.0%
Took 65 ms
[JENKINS] Archiving <https://builds.apache.org/job/Synapse%20-%20Trunk/ws/java/modules/transports/core/vfs/pom.xml>
to org.apache.synapse/synapse-vfs-transport/2.2.0-SNAPSHOT/synapse-vfs-transport-2.2.0-SNAPSHOT.pom
[JENKINS] Archiving <https://builds.apache.org/job/Synapse%20-%20Trunk/ws/java/modules/transports/core/vfs/target/synapse-vfs-transport-2.2.0-SNAPSHOT.jar>
to org.apache.synapse/synapse-vfs-transport/2.2.0-SNAPSHOT/synapse-vfs-transport-2.2.0-SNAPSHOT.jar
[JENKINS] Archiving <https://builds.apache.org/job/Synapse%20-%20Trunk/ws/java/modules/transports/core/vfs/target/synapse-vfs-transport-2.2.0-SNAPSHOT-testkit-logs.zip>
to org.apache.synapse/synapse-vfs-transport/2.2.0-SNAPSHOT/synapse-vfs-transport-2.2.0-SNAPSHOT-testkit-logs.zip
Sending artifact delta relative to Synapse - Trunk » Apache Synapse - VFS Transport #5145
Archived 3 artifacts
Archive block size is 32768
Received 0 blocks and 414498 bytes
Compression is 0.0%
Took 0.29 sec
Sending e-mails to: dev@synapse.apache.org
Sending e-mails to: dev@synapse.apache.org
channel stopped
[locks-and-latches] Releasing all the locks
[locks-and-latches] All the locks released

---------------------------------------------------------------------
To unsubscribe, e-mail: dev-unsubscribe@synapse.apache.org
For additional commands, e-mail: dev-help@synapse.apache.org


Mime
View raw message