synapse-dev mailing list archives

Site index · List index
Message view « Date » · « Thread »
Top « Date » · « Thread »
From Hiranya Jayathilaka <hiranya...@gmail.com>
Subject Re: Build failed in Jenkins: Synapse - Trunk #5135
Date Wed, 09 Sep 2015 03:25:37 GMT
Looks like Andreas updated the Woden version correctly in the trunk. The last build failure
is due to a SSL test failure:

org.apache.synapse.transport.utils.sslcert.CertificateVerificationException: Certificate Path
Validation failed on certificate number 0, details: Could not validate certificate: certificate
expired on 20150902120000GMT+00:00
	at org.apache.synapse.transport.utils.sslcert.pathvalidation.CertificatePathValidator.validatePath(CertificatePathValidator.java:99)
	at org.apache.synapse.transport.utils.sslcert.RevocationVerificationTest.crlPathValidation(RevocationVerificationTest.java:115)
	at org.apache.synapse.transport.utils.sslcert.RevocationVerificationTest.testCRLPathValidation(RevocationVerificationTest.java:48)
Caused by: org.bouncycastle.jce.exception.ExtCertPathValidatorException: Could not validate
certificate: certificate expired on 20150902120000GMT+00:00
	at org.bouncycastle.jce.provider.RFC3280CertPathUtilities.processCertA(Unknown Source)
	at org.bouncycastle.jce.provider.PKIXCertPathValidatorSpi.engineValidate(Unknown Source)
	at java.security.cert.CertPathValidator.validate(CertPathValidator.java:250)
	at org.apache.synapse.transport.utils.sslcert.pathvalidation.CertificatePathValidator.validatePath(CertificatePathValidator.java:95)
	... 30 more
Caused by: java.security.cert.CertificateExpiredException: certificate expired on 20150902120000GMT+00:00
	at org.bouncycastle.jcajce.provider.asymmetric.x509.X509CertificateObject.checkValidity(Unknown
Source)
	... 34 more


Looks like some test certificate expired?


On Sep 8, 2015, at 7:59 PM, Hiranya Jayathilaka <hiranya911@gmail.com> wrote:

> 
> On Sep 6, 2015, at 1:51 PM, Apache Jenkins Server <jenkins@builds.apache.org> wrote:
> 
>> See <https://builds.apache.org/job/Synapse%20-%20Trunk/5135/>
>> 
>> ------------------------------------------
>> [...truncated 128 lines...]
>> [INFO] snapshot org.apache.axis2:axis2-transport-jms:1.7.0-SNAPSHOT: checking for
updates from wso2-m2-snapshots
>> [INFO] snapshot org.apache.axis2:axis2-transport-jms:1.7.0-SNAPSHOT: checking for
updates from apache.snapshots
>> Downloading: http://repository.apache.org/snapshots/org/apache/axis2/axis2-transport-jms/1.7.0-SNAPSHOT/axis2-transport-jms-1.7.0-20150906.204158-1637.pom
>> 7K downloaded  (axis2-transport-jms-1.7.0-20150906.204158-1637.pom)
>> [INFO] snapshot org.apache.axis2:axis2-transport-local:1.7.0-SNAPSHOT: checking for
updates from wso2-m2-snapshots
>> [INFO] snapshot org.apache.axis2:axis2-transport-local:1.7.0-SNAPSHOT: checking for
updates from apache.snapshots
>> Downloading: http://repository.apache.org/snapshots/org/apache/axis2/axis2-transport-local/1.7.0-SNAPSHOT/axis2-transport-local-1.7.0-20150906.201437-2274.pom
>> 4K downloaded  (axis2-transport-local-1.7.0-20150906.201437-2274.pom)
>> [INFO] snapshot org.apache.axis2:axis2-transport-mail:1.7.0-SNAPSHOT: checking for
updates from wso2-m2-snapshots
>> [INFO] snapshot org.apache.axis2:axis2-transport-mail:1.7.0-SNAPSHOT: checking for
updates from apache.snapshots
>> Downloading: http://repository.apache.org/snapshots/org/apache/axis2/axis2-transport-mail/1.7.0-SNAPSHOT/axis2-transport-mail-1.7.0-20150906.204310-1637.pom
>> 5K downloaded  (axis2-transport-mail-1.7.0-20150906.204310-1637.pom)
>> [INFO] snapshot org.apache.axis2:mex:1.7.0-SNAPSHOT: checking for updates from wso2-m2-snapshots
>> [INFO] snapshot org.apache.axis2:mex:1.7.0-SNAPSHOT: checking for updates from apache.snapshots
>> Downloading: http://repository.apache.org/snapshots/org/apache/axis2/mex/1.7.0-SNAPSHOT/mex-1.7.0-20150906.203703-2103.pom
>> 5K downloaded  (mex-1.7.0-20150906.203703-2103.pom)
>> Downloading: http://dist.wso2.org/maven2//org/apache/bsf/bsf-all/3.0/bsf-all-3.0.pom
>> [INFO] Unable to find resource 'org.apache.bsf:bsf-all:pom:3.0' in repository wso2-m2
(http://dist.wso2.org/maven2/)
>> Downloading: https://oosnmp.net/dist/release//org/apache/bsf/bsf-all/3.0/bsf-all-3.0.pom
>> [INFO] Unable to find resource 'org.apache.bsf:bsf-all:pom:3.0' in repository snmp4j-repo
(https://oosnmp.net/dist/release/)
>> Downloading: http://repo1.maven.org/maven2/org/apache/bsf/bsf-all/3.0/bsf-all-3.0.pom
>> [INFO] Unable to find resource 'org.apache.bsf:bsf-all:pom:3.0' in repository central
(http://repo1.maven.org/maven2)
>> [INFO] snapshot org.apache.neethi:neethi:3.0.4-SNAPSHOT: checking for updates from
wso2-m2-snapshots
>> [INFO] snapshot org.apache.neethi:neethi:3.0.4-SNAPSHOT: checking for updates from
apache.snapshots
>> Downloading: http://repository.apache.org/snapshots/org/apache/neethi/neethi/3.0.4-SNAPSHOT/neethi-3.0.4-20150530.093116-3.pom
>> 12K downloaded  (neethi-3.0.4-20150530.093116-3.pom)
>> [INFO] snapshot org.apache.rampart:rampart:1.7.0-SNAPSHOT: checking for updates from
wso2-m2-snapshots
>> [INFO] snapshot org.apache.rampart:rampart:1.7.0-SNAPSHOT: checking for updates from
apache.snapshots
>> Downloading: http://repository.apache.org/snapshots/org/apache/rampart/rampart/1.7.0-SNAPSHOT/rampart-1.7.0-20150906.205002-1570.pom
>> 4K downloaded  (rampart-1.7.0-20150906.205002-1570.pom)
>> [INFO] snapshot org.apache.rampart:rampart-project:1.7.0-SNAPSHOT: checking for updates
from wso2-m2-snapshots
>> [INFO] snapshot org.apache.rampart:rampart-project:1.7.0-SNAPSHOT: checking for updates
from apache.snapshots
>> Downloading: http://repository.apache.org/snapshots/org/apache/rampart/rampart-project/1.7.0-SNAPSHOT/rampart-project-1.7.0-20150906.205011-1570.pom
>> 21K downloaded  (rampart-project-1.7.0-20150906.205011-1570.pom)
>> [INFO] snapshot org.apache.rampart:rampart-core:1.7.0-SNAPSHOT: checking for updates
from wso2-m2-snapshots
>> [INFO] snapshot org.apache.rampart:rampart-core:1.7.0-SNAPSHOT: checking for updates
from apache.snapshots
>> Downloading: http://repository.apache.org/snapshots/org/apache/rampart/rampart-core/1.7.0-SNAPSHOT/rampart-core-1.7.0-20150906.205004-1570.pom
>> 3K downloaded  (rampart-core-1.7.0-20150906.205004-1570.pom)
>> [INFO] snapshot org.apache.rampart:rampart-policy:1.7.0-SNAPSHOT: checking for updates
from wso2-m2-snapshots
>> [INFO] snapshot org.apache.rampart:rampart-policy:1.7.0-SNAPSHOT: checking for updates
from apache.snapshots
>> Downloading: http://repository.apache.org/snapshots/org/apache/rampart/rampart-policy/1.7.0-SNAPSHOT/rampart-policy-1.7.0-20150906.205010-1570.pom
>> 2K downloaded  (rampart-policy-1.7.0-20150906.205010-1570.pom)
>> [INFO] snapshot org.apache.rampart:rampart-trust:1.7.0-SNAPSHOT: checking for updates
from wso2-m2-snapshots
>> [INFO] snapshot org.apache.rampart:rampart-trust:1.7.0-SNAPSHOT: checking for updates
from apache.snapshots
>> Downloading: http://repository.apache.org/snapshots/org/apache/rampart/rampart-trust/1.7.0-SNAPSHOT/rampart-trust-1.7.0-20150906.205013-1570.pom
>> 3K downloaded  (rampart-trust-1.7.0-20150906.205013-1570.pom)
>> [INFO] snapshot org.apache.woden:woden-core:1.0-SNAPSHOT: checking for updates from
wso2-m2-snapshots
>> [INFO] snapshot org.apache.woden:woden-core:1.0-SNAPSHOT: checking for updates from
apache.snapshots
>> Downloading: http://dist.wso2.org/snapshots/maven2//org/apache/woden/woden-core/1.0-SNAPSHOT/woden-core-1.0-SNAPSHOT.pom
>> [INFO] Unable to find resource 'org.apache.woden:woden-core:pom:1.0-SNAPSHOT' in
repository wso2-m2-snapshots (http://dist.wso2.org/snapshots/maven2/)
>> Downloading: http://repository.apache.org/snapshots/org/apache/woden/woden-core/1.0-SNAPSHOT/woden-core-1.0-SNAPSHOT.pom
>> [INFO] Unable to find resource 'org.apache.woden:woden-core:pom:1.0-SNAPSHOT' in
repository apache.snapshots (http://repository.apache.org/snapshots)
>> [INFO] snapshot org.apache.ws.commons.axiom:axiom-api:1.2.16-SNAPSHOT: checking for
updates from wso2-m2-snapshots
>> [INFO] snapshot org.apache.ws.commons.axiom:axiom-api:1.2.16-SNAPSHOT: checking for
updates from apache.snapshots
>> Downloading: http://repository.apache.org/snapshots/org/apache/ws/commons/axiom/axiom-api/1.2.16-SNAPSHOT/axiom-api-1.2.16-20150906.195945-177.pom
>> 15K downloaded  (axiom-api-1.2.16-20150906.195945-177.pom)
>> [INFO] snapshot org.apache.ws.commons.axiom:axiom:1.2.16-SNAPSHOT: checking for updates
from wso2-m2-snapshots
>> [INFO] snapshot org.apache.ws.commons.axiom:axiom:1.2.16-SNAPSHOT: checking for updates
from apache.snapshots
>> Downloading: http://repository.apache.org/snapshots/org/apache/ws/commons/axiom/axiom/1.2.16-SNAPSHOT/axiom-1.2.16-20150906.195704-178.pom
>> 47K downloaded  (axiom-1.2.16-20150906.195704-178.pom)
>> [INFO] snapshot org.apache.ws.commons.axiom:axiom-dom:1.2.16-SNAPSHOT: checking for
updates from wso2-m2-snapshots
>> [INFO] snapshot org.apache.ws.commons.axiom:axiom-dom:1.2.16-SNAPSHOT: checking for
updates from apache.snapshots
>> Downloading: http://repository.apache.org/snapshots/org/apache/ws/commons/axiom/axiom-dom/1.2.16-SNAPSHOT/axiom-dom-1.2.16-20150906.200724-176.pom
>> 5K downloaded  (axiom-dom-1.2.16-20150906.200724-176.pom)
>> [INFO] snapshot org.apache.ws.commons.axiom:implementations:1.2.16-SNAPSHOT: checking
for updates from wso2-m2-snapshots
>> [INFO] snapshot org.apache.ws.commons.axiom:implementations:1.2.16-SNAPSHOT: checking
for updates from apache.snapshots
>> Downloading: http://repository.apache.org/snapshots/org/apache/ws/commons/axiom/implementations/1.2.16-SNAPSHOT/implementations-1.2.16-20150906.200114-177.pom
>> 5K downloaded  (implementations-1.2.16-20150906.200114-177.pom)
>> [INFO] snapshot org.apache.ws.commons.axiom:axiom-impl:1.2.16-SNAPSHOT: checking
for updates from wso2-m2-snapshots
>> [INFO] snapshot org.apache.ws.commons.axiom:axiom-impl:1.2.16-SNAPSHOT: checking
for updates from apache.snapshots
>> Downloading: http://repository.apache.org/snapshots/org/apache/ws/commons/axiom/axiom-impl/1.2.16-SNAPSHOT/axiom-impl-1.2.16-20150906.200325-177.pom
>> 5K downloaded  (axiom-impl-1.2.16-20150906.200325-177.pom)
>> Downloading: http://dist.wso2.org/maven2//quickfixj/quickfixj-all/1.4.0/quickfixj-all-1.4.0.pom
>> [INFO] Unable to find resource 'quickfixj:quickfixj-all:pom:1.4.0' in repository
wso2-m2 (http://dist.wso2.org/maven2/)
>> Downloading: https://oosnmp.net/dist/release//quickfixj/quickfixj-all/1.4.0/quickfixj-all-1.4.0.pom
>> [INFO] Unable to find resource 'quickfixj:quickfixj-all:pom:1.4.0' in repository
snmp4j-repo (https://oosnmp.net/dist/release/)
>> Downloading: http://repo1.maven.org/maven2/quickfixj/quickfixj-all/1.4.0/quickfixj-all-1.4.0.pom
>> [INFO] Unable to find resource 'quickfixj:quickfixj-all:pom:1.4.0' in repository
central (http://repo1.maven.org/maven2)
>> [INFO] snapshot org.apache.axis2:axis2-transport-testkit:1.7.0-SNAPSHOT: checking
for updates from wso2-m2-snapshots
>> [INFO] snapshot org.apache.axis2:axis2-transport-testkit:1.7.0-SNAPSHOT: checking
for updates from apache.snapshots
>> Downloading: http://repository.apache.org/snapshots/org/apache/axis2/axis2-transport-testkit/1.7.0-SNAPSHOT/axis2-transport-testkit-1.7.0-20150906.201509-1730.pom
>> 10K downloaded  (axis2-transport-testkit-1.7.0-20150906.201509-1730.pom)
>> [INFO] Generating "Dependencies" report.
>> [INFO] Generating "Project License" report.
>> [INFO] Generating "Project Modules" report.
>> [INFO] Generating "Project Team" report.
>> [INFO] Generating "Continuous Integration" report.
>> [FINDBUGS] No report found for mojo site
>> [JENKINS] Archiving site from <https://builds.apache.org/job/Synapse%20-%20Trunk/ws/java/target/site>
to /x1/jenkins/jenkins-home/jobs/Synapse - Trunk/site
>> log4j:WARN No appenders could be found for logger (org.apache.commons.beanutils.converters.BooleanConverter).
>> log4j:WARN Please initialize the log4j system properly.
>> [INFO] ------------------------------------------------------------------------
>> [INFO] Building Apache Synapse - Secure Vault
>> [INFO]    task-segment: [clean, install, site]
>> [INFO] ------------------------------------------------------------------------
>> [INFO] [clean:clean {execution: default-clean}]
>> [INFO] Deleting <https://builds.apache.org/job/Synapse%20-%20Trunk/ws/java/modules/securevault/target>
>> [INFO] [remote-resources:process {execution: default}]
>> Downloading: http://repository.apache.org/snapshots/org/apache/ws/commons/axiom/axiom-api/1.2.16-SNAPSHOT/axiom-api-1.2.16-20150906.195945-177.jar
>> 410K downloaded  (axiom-api-1.2.16-20150906.195945-177.jar)
>> Downloading: http://repository.apache.org/snapshots/org/apache/ws/commons/axiom/axiom-impl/1.2.16-SNAPSHOT/axiom-impl-1.2.16-20150906.200325-177.jar
>> 567K downloaded  (axiom-impl-1.2.16-20150906.200325-177.jar)
>> [WARNING] org.apache.velocity.runtime.exception.ReferenceException: reference : template
= META-INF/DEPENDENCIES.vm [line 40,column 14] : $license.name is not a valid reference.
>> [debug] execute contextualize
>> [INFO] [resources:resources {execution: default-resources}]
>> [INFO] Using 'UTF-8' encoding to copy filtered resources.
>> [INFO] skip non existing resourceDirectory <https://builds.apache.org/job/Synapse%20-%20Trunk/ws/java/modules/securevault/src/main/resources>
>> [INFO] Copying 3 resources
>> [INFO] [compiler:compile {execution: default-compile}]
>> [INFO] Compiling 57 source files to <https://builds.apache.org/job/Synapse%20-%20Trunk/ws/java/modules/securevault/target/classes>
>> [debug] execute contextualize
>> [INFO] [resources:testResources {execution: default-testResources}]
>> [INFO] Using 'UTF-8' encoding to copy filtered resources.
>> [INFO] skip non existing resourceDirectory <https://builds.apache.org/job/Synapse%20-%20Trunk/ws/java/modules/securevault/src/test/resources>
>> [INFO] Copying 3 resources
>> [INFO] [compiler:testCompile {execution: default-testCompile}]
>> [INFO] No sources to compile
>> [INFO] [surefire:test {execution: default-test}]
>> [INFO] Surefire report directory: <https://builds.apache.org/job/Synapse%20-%20Trunk/ws/java/modules/securevault/target/surefire-reports>
>> 
>> -------------------------------------------------------
>> T E S T S
>> -------------------------------------------------------
>> 
>> Results :
>> 
>> Tests run: 0, Failures: 0, Errors: 0, Skipped: 0
>> 
>> [JENKINS] Recording test results
>> [INFO] [bundle:bundle {execution: default-bundle}]
>> [INFO] [install:install {execution: default-install}]
>> [INFO] Installing <https://builds.apache.org/job/Synapse%20-%20Trunk/ws/java/modules/securevault/target/synapse-securevault-2.2.0-SNAPSHOT.jar>
to <https://builds.apache.org/job/Synapse%20-%20Trunk/ws/.repository/org/apache/synapse/synapse-securevault/2.2.0-SNAPSHOT/synapse-securevault-2.2.0-SNAPSHOT.jar>
>> [INFO] [bundle:install {execution: default-install}]
>> [INFO] Installing org/apache/synapse/synapse-securevault/2.2.0-SNAPSHOT/synapse-securevault-2.2.0-SNAPSHOT.jar
>> [INFO] Writing OBR metadata
>> [INFO] [site:site {execution: default-site}]
>> [INFO] Parent project loaded from repository: org.apache:apache:pom:9
>> [INFO] Relativizing decoration links with respect to project URL: http://synapse.apache.org/modules/synapse-securevault
>> [INFO] Rendering site with org.apache.maven.skins:maven-default-skin:jar:1.0 skin.
>> [INFO] Generating "About" report.
>> [INFO] Generating "Source Repository" report.
>> [INFO] Generating "Plugin Management" report.
>> [INFO] Generating "Mailing Lists" report.
>> [INFO] Generating "Issue Tracking" report.
>> [INFO] Generating "Project Plugins" report.
>> [INFO] Generating "Dependency Convergence" report.
>> [INFO] Generating "Project Summary" report.
>> [INFO] Generating "Dependency Management" report.
>> [INFO] Generating "Dependencies" report.
>> [INFO] Generating "Project License" report.
>> [INFO] Generating "Project Team" report.
>> [INFO] Generating "Continuous Integration" report.
>> [FINDBUGS] No report found for mojo site
>> [JENKINS] Archiving site from <https://builds.apache.org/job/Synapse%20-%20Trunk/ws/java/modules/securevault/target/site>
to /x1/jenkins/jenkins-home/jobs/Synapse - Trunk/site/synapse-securevault
>> [INFO] ------------------------------------------------------------------------
>> [INFO] Building Apache Synapse - Commons
>> [INFO]    task-segment: [clean, install, site]
>> [INFO] ------------------------------------------------------------------------
>> [INFO] [clean:clean {execution: default-clean}]
>> [INFO] Deleting <https://builds.apache.org/job/Synapse%20-%20Trunk/ws/java/modules/commons/target>
>> [INFO] [remote-resources:process {execution: default}]
>> [INFO] snapshot org.apache.ws.commons.axiom:axiom-compat:1.2.16-SNAPSHOT: checking
for updates from wso2-m2-snapshots
>> [INFO] snapshot org.apache.ws.commons.axiom:axiom-compat:1.2.16-SNAPSHOT: checking
for updates from apache.snapshots
>> Downloading: http://repository.apache.org/snapshots/org/apache/ws/commons/axiom/axiom-compat/1.2.16-SNAPSHOT/axiom-compat-1.2.16-20150906.200738-176.pom
>> 3K downloaded  (axiom-compat-1.2.16-20150906.200738-176.pom)
>> [INFO] snapshot org.apache.synapse:synapse-securevault:2.2.0-SNAPSHOT: checking for
updates from wso2-m2-snapshots
>> Downloading: http://dist.wso2.org/snapshots/maven2//org/apache/woden/woden-core/1.0-SNAPSHOT/woden-core-1.0-SNAPSHOT.jar
>> Downloading: http://repository.apache.org/snapshots/org/apache/neethi/neethi/3.0.4-SNAPSHOT/neethi-3.0.4-20150530.093116-3.jar
>> Downloading: http://repository.apache.org/snapshots/org/apache/axis2/axis2-transport-base/1.7.0-SNAPSHOT/axis2-transport-base-1.7.0-20150906.201459-1732.jar
>> Downloading: http://repository.apache.org/snapshots/org/apache/ws/commons/axiom/axiom-compat/1.2.16-SNAPSHOT/axiom-compat-1.2.16-20150906.200738-176.jar
>> 102K downloaded  (axis2-transport-base-1.7.0-20150906.201459-1732.jar)
>> 70K downloaded  (axiom-compat-1.2.16-20150906.200738-176.jar)
>> Downloading: http://repository.apache.org/snapshots/org/apache/axis2/axis2-kernel/1.7.0-SNAPSHOT/axis2-kernel-1.7.0-20150906.201409-2288.jar
>> 69K downloaded  (neethi-3.0.4-20150530.093116-3.jar)
>> [INFO] Unable to find resource 'org.apache.woden:woden-core:jar:1.0-SNAPSHOT' in
repository wso2-m2-snapshots (http://dist.wso2.org/snapshots/maven2/)
>> Downloading: http://repository.apache.org/snapshots/org/apache/woden/woden-core/1.0-SNAPSHOT/woden-core-1.0-SNAPSHOT.jar
>> [INFO] snapshot org.apache.synapse:synapse-securevault:2.2.0-SNAPSHOT: checking for
updates from apache.snapshots
>> [INFO] Unable to find resource 'org.apache.woden:woden-core:jar:1.0-SNAPSHOT' in
repository apache.snapshots (http://repository.apache.org/snapshots)
>> 1031K downloaded  (axis2-kernel-1.7.0-20150906.201409-2288.jar)
>> [INFO] ------------------------------------------------------------------------
>> [ERROR] BUILD ERROR
>> [INFO] ------------------------------------------------------------------------
>> [INFO] Failed to resolve dependencies for one or more projects in the reactor. Reason:
Missing:
>> ----------
>> 1) org.apache.woden:woden-core:jar:1.0-SNAPSHOT
>> 
>>  Try downloading the file manually from the project website.
>> 
>>  Then, install it using the command: 
>>      mvn install:install-file -DgroupId=org.apache.woden -DartifactId=woden-core
-Dversion=1.0-SNAPSHOT -Dpackaging=jar -Dfile=/path/to/file
>> 
>>  Alternatively, if you host your own repository you can deploy the file there: 
>>      mvn deploy:deploy-file -DgroupId=org.apache.woden -DartifactId=woden-core -Dversion=1.0-SNAPSHOT
-Dpackaging=jar -Dfile=/path/to/file -Durl=[url] -DrepositoryId=[id]
>> 
>>  Path to dependency: 
>>  	1) org.apache.synapse:synapse-commons:bundle:2.2.0-SNAPSHOT
>>  	2) org.apache.axis2:axis2-transport-base:jar:1.7.0-SNAPSHOT
>>  	3) org.apache.axis2:axis2-kernel:jar:1.7.0-SNAPSHOT
>>  	4) org.apache.woden:woden-core:jar:1.0-SNAPSHOT
> 
> Is this due to the Woden release that has gone out recently? Has the trunk version of
Woden been updated?
> 
> Thanks,
> Hiranya
> 
>> 
>> ----------
>> 1 required artifact is missing.
>> 
>> for artifact: 
>>  org.apache.synapse:synapse-commons:bundle:2.2.0-SNAPSHOT
>> 
>> from the specified remote repositories:
>>  central (http://repo1.maven.org/maven2),
>>  wso2-m2 (http://dist.wso2.org/maven2/),
>>  wso2-m2-snapshots (http://dist.wso2.org/snapshots/maven2/),
>>  snmp4j-repo (https://oosnmp.net/dist/release/),
>>  Nexus (http://repository.apache.org/snapshots)
>> 
>> 
>> 
>> [INFO] ------------------------------------------------------------------------
>> [INFO] For more information, run Maven with the -e switch
>> [INFO] ------------------------------------------------------------------------
>> [INFO] Total time: 57 seconds
>> [INFO] Finished at: Sun Sep 06 20:52:52 UTC 2015
>> [INFO] Final Memory: 98M/809M
>> [INFO] ------------------------------------------------------------------------
>> [JENKINS] Archiving <https://builds.apache.org/job/Synapse%20-%20Trunk/ws/.repository/org/apache/synapse/Apache-Synapse/2.2.0-SNAPSHOT/Apache-Synapse-2.2.0-SNAPSHOT.pom>
to org.apache.synapse/Apache-Synapse/2.2.0-SNAPSHOT/Apache-Synapse-2.2.0-SNAPSHOT.pom
>> <https://builds.apache.org/job/Synapse%20-%20Trunk/ws/.repository/org/apache/synapse/Apache-Synapse/2.2.0-SNAPSHOT/Apache-Synapse-2.2.0-SNAPSHOT.pom>
is not inside <https://builds.apache.org/job/Synapse%20-%20Trunk/ws/java/;> will archive
in a separate pass
>> Sending artifact delta relative to Synapse - Trunk » Apache Synapse #5134
>> Archived 1 artifacts
>> Archive block size is 32768
>> Received 1 blocks and 21185 bytes
>> Compression is 60.7%
>> Took 43 ms
>> [JENKINS] Archiving <https://builds.apache.org/job/Synapse%20-%20Trunk/ws/java/modules/commons/pom.xml>
to org.apache.synapse/synapse-commons/2.2.0-SNAPSHOT/synapse-commons-2.2.0-SNAPSHOT.pom
>> Sending artifact delta relative to Synapse - Trunk » Apache Synapse - Commons #5134
>> Archived 1 artifacts
>> Archive block size is 32768
>> Received 0 blocks and 4423 bytes
>> Compression is 0.0%
>> Took 53 ms
>> [JENKINS] Archiving <https://builds.apache.org/job/Synapse%20-%20Trunk/ws/java/modules/securevault/pom.xml>
to org.apache.synapse/synapse-securevault/2.2.0-SNAPSHOT/synapse-securevault-2.2.0-SNAPSHOT.pom
>> [JENKINS] Archiving <https://builds.apache.org/job/Synapse%20-%20Trunk/ws/java/modules/securevault/target/synapse-securevault-2.2.0-SNAPSHOT.jar>
to org.apache.synapse/synapse-securevault/2.2.0-SNAPSHOT/synapse-securevault-2.2.0-SNAPSHOT.jar
>> Sending artifact delta relative to Synapse - Trunk » Apache Synapse - Secure Vault
#5134
>> Archived 2 artifacts
>> Archive block size is 32768
>> Received 0 blocks and 92006 bytes
>> Compression is 0.0%
>> Took 80 ms
>> Sending e-mails to: dev@synapse.apache.org
>> channel stopped
>> [locks-and-latches] Releasing all the locks
>> [locks-and-latches] All the locks released
>> 
>> ---------------------------------------------------------------------
>> To unsubscribe, e-mail: dev-unsubscribe@synapse.apache.org
>> For additional commands, e-mail: dev-help@synapse.apache.org
>> 
> 
> --
> Hiranya Jayathilaka
> Mayhem Lab/RACE Lab;
> Dept. of Computer Science, UCSB;  http://cs.ucsb.edu
> E-mail: hiranya@cs.ucsb.edu;  Mobile: +1 (805) 895-7443
> Blog: http://techfeast-hiranya.blogspot.com
> 

--
Hiranya Jayathilaka
Mayhem Lab/RACE Lab;
Dept. of Computer Science, UCSB;  http://cs.ucsb.edu
E-mail: hiranya@cs.ucsb.edu;  Mobile: +1 (805) 895-7443
Blog: http://techfeast-hiranya.blogspot.com


Mime
View raw message