synapse-dev mailing list archives

Site index · List index
Message view « Date » · « Thread »
Top « Date » · « Thread »
From Apache Jenkins Server <jenk...@builds.apache.org>
Subject Build failed in Jenkins: Synapse - Trunk #5421
Date Wed, 26 Feb 2020 15:45:10 GMT
See <https://builds.apache.org/job/Synapse%20-%20Trunk/5421/display/redirect?page=changes>

Changes:

[madhawa] Fix SYNAPSE-1106


------------------------------------------
[...truncated 485.42 KB...]
Tests run: 0, Failures: 0, Errors: 0, Skipped: 0

[JENKINS] Recording test results[INFO] 

[INFO] --- maven-bundle-plugin:2.3.6:bundle (default-bundle) @ synapse-tasks ---
[INFO] 
[INFO] --- maven-site-plugin:3.6:attach-descriptor (attach-descriptor) @ synapse-tasks ---
[INFO] Skipping because packaging 'bundle' is not pom.
[INFO] 
[INFO] --- maven-install-plugin:2.5.2:install (default-install) @ synapse-tasks ---
[INFO] Installing <https://builds.apache.org/job/Synapse%20-%20Trunk/ws/modules/tasks/target/synapse-tasks-3.0.2-SNAPSHOT.jar>
to <https://builds.apache.org/job/Synapse%20-%20Trunk/ws/.repository/org/apache/synapse/synapse-tasks/3.0.2-SNAPSHOT/synapse-tasks-3.0.2-SNAPSHOT.jar>
[INFO] Installing <https://builds.apache.org/job/Synapse%20-%20Trunk/ws/modules/tasks/pom.xml>
to <https://builds.apache.org/job/Synapse%20-%20Trunk/ws/.repository/org/apache/synapse/synapse-tasks/3.0.2-SNAPSHOT/synapse-tasks-3.0.2-SNAPSHOT.pom>
[INFO] 
[INFO] --- maven-bundle-plugin:2.3.6:install (default-install) @ synapse-tasks ---
[INFO] Installing org/apache/synapse/synapse-tasks/3.0.2-SNAPSHOT/synapse-tasks-3.0.2-SNAPSHOT.jar
[INFO] Writing OBR metadata
[INFO] 
[INFO] --- maven-site-plugin:3.6:site (default-site) @ synapse-tasks ---
[INFO] configuring report plugin org.apache.maven.plugins:maven-project-info-reports-plugin:2.2
[INFO] Relativizing decoration links with respect to localized project URL: http://synapse.apache.org/modules/synapse-tasks/
[INFO] Rendering site with org.apache.maven.skins:maven-default-skin:jar:1.2 skin.
[INFO] Generating "About" report                --- maven-project-info-reports-plugin:2.2:index
[INFO] Generating "Source Repository" report    --- maven-project-info-reports-plugin:2.2:scm
[INFO] Generating "Plugin Management" report    --- maven-project-info-reports-plugin:2.2:plugin-management
[INFO] Generating "Mailing Lists" report        --- maven-project-info-reports-plugin:2.2:mailing-list
[INFO] Generating "Issue Tracking" report       --- maven-project-info-reports-plugin:2.2:issue-tracking
[INFO] Generating "Project Plugins" report      --- maven-project-info-reports-plugin:2.2:plugins
[INFO] Generating "Project Summary" report      --- maven-project-info-reports-plugin:2.2:summary
[INFO] Generating "Dependency Management" report --- maven-project-info-reports-plugin:2.2:dependency-management
[INFO] Generating "Dependencies" report         --- maven-project-info-reports-plugin:2.2:dependencies
[INFO] Generating "Project License" report      --- maven-project-info-reports-plugin:2.2:license
[INFO] Generating "Project Team" report         --- maven-project-info-reports-plugin:2.2:project-team
[INFO] Generating "Continuous Integration" report --- maven-project-info-reports-plugin:2.2:cim
[FINDBUGS] No report found for mojo site
[JENKINS] Archiving site from <https://builds.apache.org/job/Synapse%20-%20Trunk/ws/modules/tasks/target/site>
to /x1/jenkins/jenkins-home/jobs/Synapse - Trunk/site/synapse-tasks
[INFO] 
[INFO] ------------------< org.apache.synapse:synapse-core >-------------------
[INFO] Building Apache Synapse - Core 3.0.2-SNAPSHOT                    [11/24]
[INFO] -------------------------------[ bundle ]-------------------------------
[INFO] Downloading from central: https://repo.maven.apache.org/maven2/org/apache/maven/plugins/maven-jar-plugin/2.3.2/maven-jar-plugin-2.3.2.jar
[INFO] Downloaded from central: https://repo.maven.apache.org/maven2/org/apache/maven/plugins/maven-jar-plugin/2.3.2/maven-jar-plugin-2.3.2.jar
(33 kB at 2.0 MB/s)
[INFO] Downloading from central: https://repo.maven.apache.org/maven2/org/apache/maven/plugins/maven-antrun-plugin/1.7/maven-antrun-plugin-1.7.jar
[INFO] Downloaded from central: https://repo.maven.apache.org/maven2/org/apache/maven/plugins/maven-antrun-plugin/1.7/maven-antrun-plugin-1.7.jar
(32 kB at 2.6 MB/s)
[INFO] Downloading from wso2-m2: https://maven.wso2.org/nexus/content/groups/wso2-public/org/apache/tomcat/tribes/6.0.16/tribes-6.0.16.pom
[INFO] Downloaded from wso2-m2: https://maven.wso2.org/nexus/content/groups/wso2-public/org/apache/tomcat/tribes/6.0.16/tribes-6.0.16.pom
(1.3 kB at 2.5 kB/s)
[INFO] Downloading from wso2-m2: https://maven.wso2.org/nexus/content/groups/wso2-public/org/apache/tomcat/juli/6.0.16/juli-6.0.16.pom
[INFO] Downloaded from wso2-m2: https://maven.wso2.org/nexus/content/groups/wso2-public/org/apache/tomcat/juli/6.0.16/juli-6.0.16.pom
(1.1 kB at 3.8 kB/s)
[INFO] Downloading from wso2-m2: https://maven.wso2.org/nexus/content/groups/wso2-public/xalan/serializer/2.7.1/serializer-2.7.1.pom
[INFO] Downloaded from wso2-m2: https://maven.wso2.org/nexus/content/groups/wso2-public/xalan/serializer/2.7.1/serializer-2.7.1.pom
(1.1 kB at 7.0 kB/s)
[INFO] Downloading from wso2-m2: https://maven.wso2.org/nexus/content/groups/wso2-public/org/apache/geronimo/specs/geronimo-jta_1.0.1B_spec/1.0/geronimo-jta_1.0.1B_spec-1.0.pom
[INFO] Downloaded from wso2-m2: https://maven.wso2.org/nexus/content/groups/wso2-public/org/apache/geronimo/specs/geronimo-jta_1.0.1B_spec/1.0/geronimo-jta_1.0.1B_spec-1.0.pom
(181 B at 741 B/s)
[INFO] Downloading from wso2-m2: https://maven.wso2.org/nexus/content/groups/wso2-public/javax/mail/mail/1.4.1/mail-1.4.1.pom
[INFO] Downloaded from wso2-m2: https://maven.wso2.org/nexus/content/groups/wso2-public/javax/mail/mail/1.4.1/mail-1.4.1.pom
(995 B at 7.0 kB/s)
[INFO] Downloading from wso2-m2: https://maven.wso2.org/nexus/content/groups/wso2-public/com/google/code/gson/gson/2.1/gson-2.1.pom
[INFO] Downloaded from wso2-m2: https://maven.wso2.org/nexus/content/groups/wso2-public/com/google/code/gson/gson/2.1/gson-2.1.pom
(10 kB at 50 kB/s)
[INFO] Downloading from wso2-m2: https://maven.wso2.org/nexus/content/groups/wso2-public/org/sonatype/oss/oss-parent/5/oss-parent-5.pom
[INFO] Downloaded from wso2-m2: https://maven.wso2.org/nexus/content/groups/wso2-public/org/sonatype/oss/oss-parent/5/oss-parent-5.pom
(4.1 kB at 29 kB/s)
[INFO] Downloading from wso2-m2: https://maven.wso2.org/nexus/content/groups/wso2-public/javax/xml/stream/stax-api/1.0-2/stax-api-1.0-2.pom
[INFO] Downloaded from wso2-m2: https://maven.wso2.org/nexus/content/groups/wso2-public/javax/xml/stream/stax-api/1.0-2/stax-api-1.0-2.pom
(962 B at 5.9 kB/s)
[INFO] Downloading from wso2-m2: https://maven.wso2.org/nexus/content/groups/wso2-public/org/apache/axis2/axis2-clustering/1.7.7/axis2-clustering-1.7.7.jar
[INFO] Downloading from wso2-m2: https://maven.wso2.org/nexus/content/groups/wso2-public/org/apache/tomcat/tribes/6.0.16/tribes-6.0.16.jar
[INFO] Downloading from wso2-m2: https://maven.wso2.org/nexus/content/groups/wso2-public/org/apache/tomcat/juli/6.0.16/juli-6.0.16.jar
[INFO] Downloading from wso2-m2: https://maven.wso2.org/nexus/content/groups/wso2-public/org/wso2/eventing/wso2eventing-api/2.1/wso2eventing-api-2.1.jar
[INFO] Downloading from wso2-m2: https://maven.wso2.org/nexus/content/groups/wso2-public/org/wso2/caching/wso2caching-core/3.5.0/wso2caching-core-3.5.0.jar
[INFO] Downloaded from wso2-m2: https://maven.wso2.org/nexus/content/groups/wso2-public/org/wso2/eventing/wso2eventing-api/2.1/wso2eventing-api-2.1.jar
(9.9 kB at 23 kB/s)
[INFO] Downloading from wso2-m2: https://maven.wso2.org/nexus/content/groups/wso2-public/logkit/logkit/1.0.1/logkit-1.0.1.jar
[INFO] Downloaded from wso2-m2: https://maven.wso2.org/nexus/content/groups/wso2-public/org/apache/tomcat/tribes/6.0.16/tribes-6.0.16.jar
(228 kB at 506 kB/s)
[INFO] Downloading from wso2-m2: https://maven.wso2.org/nexus/content/groups/wso2-public/avalon-framework/avalon-framework/4.1.3/avalon-framework-4.1.3.jar
[INFO] Downloaded from wso2-m2: https://maven.wso2.org/nexus/content/groups/wso2-public/org/apache/tomcat/juli/6.0.16/juli-6.0.16.jar
(19 kB at 40 kB/s)
[INFO] Downloading from wso2-m2: https://maven.wso2.org/nexus/content/groups/wso2-public/org/wso2/uri/template/wso2-uri-templates/1.0.0/wso2-uri-templates-1.0.0.jar
[INFO] Downloaded from wso2-m2: https://maven.wso2.org/nexus/content/groups/wso2-public/org/wso2/caching/wso2caching-core/3.5.0/wso2caching-core-3.5.0.jar
(26 kB at 53 kB/s)
[INFO] Downloading from wso2-m2: https://maven.wso2.org/nexus/content/groups/wso2-public/xalan/xalan/2.7.1/xalan-2.7.1.jar
[INFO] Downloaded from wso2-m2: https://maven.wso2.org/nexus/content/groups/wso2-public/avalon-framework/avalon-framework/4.1.3/avalon-framework-4.1.3.jar
(64 kB at 103 kB/s)
[INFO] Downloading from wso2-m2: https://maven.wso2.org/nexus/content/groups/wso2-public/xalan/serializer/2.7.1/serializer-2.7.1.jar
[INFO] Downloaded from wso2-m2: https://maven.wso2.org/nexus/content/groups/wso2-public/org/apache/axis2/axis2-clustering/1.7.7/axis2-clustering-1.7.7.jar
(109 kB at 173 kB/s)
[INFO] Downloading from wso2-m2: https://maven.wso2.org/nexus/content/groups/wso2-public/net/sf/saxon/saxon/8.9/saxon-8.9.jar
[INFO] Downloaded from wso2-m2: https://maven.wso2.org/nexus/content/groups/wso2-public/org/wso2/uri/template/wso2-uri-templates/1.0.0/wso2-uri-templates-1.0.0.jar
(18 kB at 28 kB/s)
[INFO] Downloading from wso2-m2: https://maven.wso2.org/nexus/content/groups/wso2-public/net/sf/saxon/saxon-dom/8.9/saxon-dom-8.9.jar
[INFO] Downloaded from wso2-m2: https://maven.wso2.org/nexus/content/groups/wso2-public/logkit/logkit/1.0.1/logkit-1.0.1.jar
(72 kB at 95 kB/s)
[INFO] Downloading from wso2-m2: https://maven.wso2.org/nexus/content/groups/wso2-public/org/apache/axis2/axis2-transport-jms/1.7.7/axis2-transport-jms-1.7.7.jar
[INFO] Downloaded from wso2-m2: https://maven.wso2.org/nexus/content/groups/wso2-public/xalan/serializer/2.7.1/serializer-2.7.1.jar
(278 kB at 310 kB/s)
[INFO] Downloading from wso2-m2: https://maven.wso2.org/nexus/content/groups/wso2-public/org/apache/geronimo/specs/geronimo-jms_1.1_spec/1.1/geronimo-jms_1.1_spec-1.1.jar
[INFO] Downloaded from wso2-m2: https://maven.wso2.org/nexus/content/groups/wso2-public/net/sf/saxon/saxon-dom/8.9/saxon-dom-8.9.jar
(90 kB at 94 kB/s)
[INFO] Downloading from wso2-m2: https://maven.wso2.org/nexus/content/groups/wso2-public/org/apache/geronimo/specs/geronimo-jta_1.0.1B_spec/1.0/geronimo-jta_1.0.1B_spec-1.0.jar
[INFO] Downloaded from wso2-m2: https://maven.wso2.org/nexus/content/groups/wso2-public/org/apache/axis2/axis2-transport-jms/1.7.7/axis2-transport-jms-1.7.7.jar
(80 kB at 79 kB/s)
[INFO] Downloading from wso2-m2: https://maven.wso2.org/nexus/content/groups/wso2-public/org/apache/derby/derby/10.4.2.0/derby-10.4.2.0.jar
[INFO] Downloaded from wso2-m2: https://maven.wso2.org/nexus/content/groups/wso2-public/org/apache/geronimo/specs/geronimo-jms_1.1_spec/1.1/geronimo-jms_1.1_spec-1.1.jar
(32 kB at 30 kB/s)
[INFO] Downloading from wso2-m2: https://maven.wso2.org/nexus/content/groups/wso2-public/org/apache/axis2/axis2-transport-mail/1.7.7/axis2-transport-mail-1.7.7.jar
[INFO] Downloaded from wso2-m2: https://maven.wso2.org/nexus/content/groups/wso2-public/org/apache/geronimo/specs/geronimo-jta_1.0.1B_spec/1.0/geronimo-jta_1.0.1B_spec-1.0.jar
(11 kB at 10 kB/s)
[INFO] Downloading from wso2-m2: https://maven.wso2.org/nexus/content/groups/wso2-public/javax/mail/mail/1.4.1/mail-1.4.1.jar
[INFO] Downloaded from wso2-m2: https://maven.wso2.org/nexus/content/groups/wso2-public/xalan/xalan/2.7.1/xalan-2.7.1.jar
(3.2 MB at 2.7 MB/s)
[INFO] Downloading from wso2-m2: https://maven.wso2.org/nexus/content/groups/wso2-public/org/apache/axis2/axis2-transport-local/1.7.7/axis2-transport-local-1.7.7.jar
[INFO] Downloaded from wso2-m2: https://maven.wso2.org/nexus/content/groups/wso2-public/net/sf/saxon/saxon/8.9/saxon-8.9.jar
(3.7 MB at 3.0 MB/s)
[INFO] Downloading from wso2-m2: https://maven.wso2.org/nexus/content/groups/wso2-public/org/apache/axis2/axis2-json/1.7.7/axis2-json-1.7.7.jar
[INFO] Downloaded from wso2-m2: https://maven.wso2.org/nexus/content/groups/wso2-public/org/apache/axis2/axis2-transport-mail/1.7.7/axis2-transport-mail-1.7.7.jar
(42 kB at 33 kB/s)
[INFO] Downloading from wso2-m2: https://maven.wso2.org/nexus/content/groups/wso2-public/org/codehaus/jettison/jettison/1.3.8/jettison-1.3.8.jar
[INFO] Downloaded from wso2-m2: https://maven.wso2.org/nexus/content/groups/wso2-public/org/apache/axis2/axis2-transport-local/1.7.7/axis2-transport-local-1.7.7.jar
(17 kB at 13 kB/s)
[INFO] Downloading from wso2-m2: https://maven.wso2.org/nexus/content/groups/wso2-public/com/google/code/gson/gson/2.1/gson-2.1.jar
[INFO] Downloaded from wso2-m2: https://maven.wso2.org/nexus/content/groups/wso2-public/javax/mail/mail/1.4.1/mail-1.4.1.jar
(448 kB at 314 kB/s)
[INFO] Downloading from wso2-m2: https://maven.wso2.org/nexus/content/groups/wso2-public/org/apache/ws/commons/axiom/axiom-dom/1.2.20/axiom-dom-1.2.20.jar
[INFO] Downloaded from wso2-m2: https://maven.wso2.org/nexus/content/groups/wso2-public/org/apache/axis2/axis2-json/1.7.7/axis2-json-1.7.7.jar
(53 kB at 37 kB/s)
[INFO] Downloading from wso2-m2: https://maven.wso2.org/nexus/content/groups/wso2-public/org/apache/axis2/axis2-adb/1.7.7/axis2-adb-1.7.7.jar
[INFO] Downloaded from wso2-m2: https://maven.wso2.org/nexus/content/groups/wso2-public/org/codehaus/jettison/jettison/1.3.8/jettison-1.3.8.jar
(88 kB at 59 kB/s)
[INFO] Downloaded from wso2-m2: https://maven.wso2.org/nexus/content/groups/wso2-public/com/google/code/gson/gson/2.1/gson-2.1.jar
(180 kB at 115 kB/s)
[INFO] Downloaded from wso2-m2: https://maven.wso2.org/nexus/content/groups/wso2-public/org/apache/derby/derby/10.4.2.0/derby-10.4.2.0.jar
(2.4 MB at 1.6 MB/s)
[INFO] Downloaded from wso2-m2: https://maven.wso2.org/nexus/content/groups/wso2-public/org/apache/axis2/axis2-adb/1.7.7/axis2-adb-1.7.7.jar
(654 kB at 396 kB/s)
[INFO] Downloaded from wso2-m2: https://maven.wso2.org/nexus/content/groups/wso2-public/org/apache/ws/commons/axiom/axiom-dom/1.2.20/axiom-dom-1.2.20.jar
(716 kB at 427 kB/s)
[INFO] 
[INFO] --- maven-clean-plugin:2.4.1:clean (default-clean) @ synapse-core ---
[INFO] 
[INFO] --- maven-remote-resources-plugin:1.5:process (process-resource-bundles) @ synapse-core
---
[INFO] 
[INFO] --- maven-resources-plugin:2.5:resources (default-resources) @ synapse-core ---
[debug] execute contextualize
[INFO] Using 'UTF-8' encoding to copy filtered resources.
[INFO] Copying 1 resource
[INFO] Copying 3 resources
[INFO] 
[INFO] --- maven-compiler-plugin:3.5.1:compile (default-compile) @ synapse-core ---
[INFO] Changes detected - recompiling the module!
[INFO] Compiling 517 source files to <https://builds.apache.org/job/Synapse%20-%20Trunk/ws/modules/core/target/classes>
[INFO] <https://builds.apache.org/job/Synapse%20-%20Trunk/ws/modules/core/src/main/java/org/apache/synapse/core/SynapseEnvironment.java>:
Some input files use or override a deprecated API.
[INFO] <https://builds.apache.org/job/Synapse%20-%20Trunk/ws/modules/core/src/main/java/org/apache/synapse/core/SynapseEnvironment.java>:
Recompile with -Xlint:deprecation for details.
[INFO] <https://builds.apache.org/job/Synapse%20-%20Trunk/ws/modules/core/src/main/java/org/apache/synapse/eventing/SynapseEventSource.java>:
Some input files use unchecked or unsafe operations.
[INFO] <https://builds.apache.org/job/Synapse%20-%20Trunk/ws/modules/core/src/main/java/org/apache/synapse/eventing/SynapseEventSource.java>:
Recompile with -Xlint:unchecked for details.
[INFO] -------------------------------------------------------------
[ERROR] COMPILATION ERROR : 
[INFO] -------------------------------------------------------------
[ERROR] <https://builds.apache.org/job/Synapse%20-%20Trunk/ws/modules/core/src/main/java/org/apache/synapse/mediators/builtin/CacheMediator.java>:[48,22]
package javax.xml.soap does not exist
[ERROR] <https://builds.apache.org/job/Synapse%20-%20Trunk/ws/modules/core/src/main/java/org/apache/synapse/mediators/builtin/CacheMediator.java>:[314,26]
cannot find symbol
  symbol:   class SOAPException
  location: class org.apache.synapse.mediators.builtin.CacheMediator
[INFO] 2 errors 
[INFO] -------------------------------------------------------------
[INFO] ------------------------------------------------------------------------
[INFO] Reactor Summary for Apache Synapse 3.0.2-SNAPSHOT:
[INFO] 
[INFO] Apache Synapse ..................................... SUCCESS [01:43 min]
[INFO] Apache Synapse - Secure Vault ...................... SUCCESS [ 15.454 s]
[INFO] Apache Synapse - Commons ........................... SUCCESS [ 22.925 s]
[INFO] Apache Synapse - Transports ........................ SUCCESS [  9.711 s]
[INFO] Apache Synapse - Non-blocking HTTP/s Transport ..... SUCCESS [ 24.621 s]
[INFO] Apache Synapse - PIPE Transport .................... SUCCESS [  6.754 s]
[INFO] Apache Synapse - VFS Transport ..................... SUCCESS [ 16.947 s]
[INFO] Apache Synapse - FIX Transport ..................... SUCCESS [ 10.762 s]
[INFO] Apache Synapse - AMQP Transport .................... SUCCESS [02:06 min]
[INFO] Apache Synapse - Tasks ............................. SUCCESS [  7.372 s]
[INFO] Apache Synapse - Core .............................. FAILURE [  7.535 s]
[INFO] Apache Synapse - Extensions ........................ SKIPPED
[INFO] Apache Synapse - Samples ........................... SKIPPED
[INFO] Apache Synapse - Patches ........................... SKIPPED
[INFO] Apache Synapse - Experimental code ................. SKIPPED
[INFO] Apache Synapse ..................................... SKIPPED
[INFO] Apache Synapse - Web Application ................... SKIPPED
[INFO] Apache Synapse - Handler Module .................... SKIPPED
[INFO] Apache Synapse - XAR Maven Plugin .................. SKIPPED
[INFO] Apache Synapse - Configuration Migrator ............ SKIPPED
[INFO] Apache Synapse - Distribution ...................... SKIPPED
[INFO] Apache Synapse - Package skeleton ZIP .............. SKIPPED
[INFO] Apache Synapse - Package archetype ................. SKIPPED
[INFO] Apache Synapse - Integration ....................... SKIPPED
[INFO] ------------------------------------------------------------------------
[INFO] BUILD FAILURE
[INFO] ------------------------------------------------------------------------
[INFO] Total time:  06:52 min
[INFO] Finished at: 2020-02-26T15:44:08Z
[INFO] ------------------------------------------------------------------------
Waiting for Jenkins to finish collecting data
[ERROR] Failed to execute goal org.apache.maven.plugins:maven-compiler-plugin:3.5.1:compile
(default-compile) on project synapse-core: Compilation failure: Compilation failure:
[ERROR] <https://builds.apache.org/job/Synapse%20-%20Trunk/ws/modules/core/src/main/java/org/apache/synapse/mediators/builtin/CacheMediator.java>:[48,22]
package javax.xml.soap does not exist
[ERROR] <https://builds.apache.org/job/Synapse%20-%20Trunk/ws/modules/core/src/main/java/org/apache/synapse/mediators/builtin/CacheMediator.java>:[314,26]
cannot find symbol
[ERROR] symbol:   class SOAPException
[ERROR] location: class org.apache.synapse.mediators.builtin.CacheMediator
[ERROR] -> [Help 1]
[ERROR] 
[ERROR] To see the full stack trace of the errors, re-run Maven with the -e switch.
[ERROR] Re-run Maven using the -X switch to enable full debug logging.
[ERROR] 
[ERROR] For more information about the errors and possible solutions, please read the following
articles:
[ERROR] [Help 1] http://cwiki.apache.org/confluence/display/MAVEN/MojoFailureException
[ERROR] 
[ERROR] After correcting the problems, you can resume the build with the command
[ERROR]   mvn <goals> -rf :synapse-core
[JENKINS] Archiving <https://builds.apache.org/job/Synapse%20-%20Trunk/ws/modules/transports/optional/fix/pom.xml>
to org.apache.synapse/synapse-fix-transport/3.0.2-SNAPSHOT/synapse-fix-transport-3.0.2-SNAPSHOT.pom
[JENKINS] Archiving <https://builds.apache.org/job/Synapse%20-%20Trunk/ws/modules/transports/optional/fix/target/synapse-fix-transport-3.0.2-SNAPSHOT.jar>
to org.apache.synapse/synapse-fix-transport/3.0.2-SNAPSHOT/synapse-fix-transport-3.0.2-SNAPSHOT.jar
[JENKINS] Archiving <https://builds.apache.org/job/Synapse%20-%20Trunk/ws/modules/securevault/pom.xml>
to org.apache.synapse/synapse-securevault/3.0.2-SNAPSHOT/synapse-securevault-3.0.2-SNAPSHOT.pom
[JENKINS] Archiving <https://builds.apache.org/job/Synapse%20-%20Trunk/ws/modules/securevault/target/synapse-securevault-3.0.2-SNAPSHOT.jar>
to org.apache.synapse/synapse-securevault/3.0.2-SNAPSHOT/synapse-securevault-3.0.2-SNAPSHOT.jar
[JENKINS] Archiving <https://builds.apache.org/job/Synapse%20-%20Trunk/ws/modules/transports/pom.xml>
to org.apache.synapse/synapse-transports/3.0.2-SNAPSHOT/synapse-transports-3.0.2-SNAPSHOT.pom
[JENKINS] Archiving <https://builds.apache.org/job/Synapse%20-%20Trunk/ws/modules/documentation/pom.xml>
to org.apache.synapse/synapse-documentation/3.0.2-SNAPSHOT/synapse-documentation-3.0.2-SNAPSHOT.pom
[JENKINS] Archiving <https://builds.apache.org/job/Synapse%20-%20Trunk/ws/modules/migrator/pom.xml>
to org.apache.synapse/synapse-config-migrator/3.0.2-SNAPSHOT/synapse-config-migrator-3.0.2-SNAPSHOT.pom
[JENKINS] Archiving <https://builds.apache.org/job/Synapse%20-%20Trunk/ws/modules/commons/pom.xml>
to org.apache.synapse/synapse-commons/3.0.2-SNAPSHOT/synapse-commons-3.0.2-SNAPSHOT.pom
[JENKINS] Archiving <https://builds.apache.org/job/Synapse%20-%20Trunk/ws/modules/commons/target/synapse-commons-3.0.2-SNAPSHOT.jar>
to org.apache.synapse/synapse-commons/3.0.2-SNAPSHOT/synapse-commons-3.0.2-SNAPSHOT.jar
[JENKINS] Archiving <https://builds.apache.org/job/Synapse%20-%20Trunk/ws/modules/samples/pom.xml>
to org.apache.synapse/synapse-samples/3.0.2-SNAPSHOT/synapse-samples-3.0.2-SNAPSHOT.pom
[JENKINS] Archiving <https://builds.apache.org/job/Synapse%20-%20Trunk/ws/modules/war/pom.xml>
to org.apache.synapse/synapse-war/3.0.2-SNAPSHOT/synapse-war-3.0.2-SNAPSHOT.pom
[JENKINS] Archiving <https://builds.apache.org/job/Synapse%20-%20Trunk/ws/pom.xml> to
org.apache.synapse/Apache-Synapse/3.0.2-SNAPSHOT/Apache-Synapse-3.0.2-SNAPSHOT.pom
[Fast Archiver] Compressed 56.01 KB of artifacts by 57.1% relative to #5420
[JENKINS] Archiving <https://builds.apache.org/job/Synapse%20-%20Trunk/ws/modules/extensions/pom.xml>
to org.apache.synapse/synapse-extensions/3.0.2-SNAPSHOT/synapse-extensions-3.0.2-SNAPSHOT.pom
[JENKINS] Archiving <https://builds.apache.org/job/Synapse%20-%20Trunk/ws/modules/handler/pom.xml>
to org.apache.synapse/synapse-handler/3.0.2-SNAPSHOT/synapse-handler-3.0.2-SNAPSHOT.pom
[JENKINS] Archiving <https://builds.apache.org/job/Synapse%20-%20Trunk/ws/modules/xar-maven-plugin/pom.xml>
to org.apache.synapse/synapse-xar-maven-plugin/3.0.2-SNAPSHOT/synapse-xar-maven-plugin-3.0.2-SNAPSHOT.pom
[JENKINS] Archiving <https://builds.apache.org/job/Synapse%20-%20Trunk/ws/modules/tasks/pom.xml>
to org.apache.synapse/synapse-tasks/3.0.2-SNAPSHOT/synapse-tasks-3.0.2-SNAPSHOT.pom
[JENKINS] Archiving <https://builds.apache.org/job/Synapse%20-%20Trunk/ws/modules/tasks/target/synapse-tasks-3.0.2-SNAPSHOT.jar>
to org.apache.synapse/synapse-tasks/3.0.2-SNAPSHOT/synapse-tasks-3.0.2-SNAPSHOT.jar
[JENKINS] Archiving <https://builds.apache.org/job/Synapse%20-%20Trunk/ws/modules/packaging/package-archetype/pom.xml>
to org.apache.synapse/synapse-package-archetype/3.0.2-SNAPSHOT/synapse-package-archetype-3.0.2-SNAPSHOT.pom
[JENKINS] Archiving <https://builds.apache.org/job/Synapse%20-%20Trunk/ws/modules/transports/core/nhttp/pom.xml>
to org.apache.synapse/synapse-nhttp-transport/3.0.2-SNAPSHOT/synapse-nhttp-transport-3.0.2-SNAPSHOT.pom
[JENKINS] Archiving <https://builds.apache.org/job/Synapse%20-%20Trunk/ws/modules/transports/core/nhttp/target/synapse-nhttp-transport-3.0.2-SNAPSHOT.jar>
to org.apache.synapse/synapse-nhttp-transport/3.0.2-SNAPSHOT/synapse-nhttp-transport-3.0.2-SNAPSHOT.jar
[JENKINS] Archiving <https://builds.apache.org/job/Synapse%20-%20Trunk/ws/modules/transports/core/nhttp/target/synapse-nhttp-transport-3.0.2-SNAPSHOT-testkit-logs.zip>
to org.apache.synapse/synapse-nhttp-transport/3.0.2-SNAPSHOT/synapse-nhttp-transport-3.0.2-SNAPSHOT-testkit-logs.zip
[JENKINS] Archiving <https://builds.apache.org/job/Synapse%20-%20Trunk/ws/modules/transports/core/vfs/pom.xml>
to org.apache.synapse/synapse-vfs-transport/3.0.2-SNAPSHOT/synapse-vfs-transport-3.0.2-SNAPSHOT.pom
[JENKINS] Archiving <https://builds.apache.org/job/Synapse%20-%20Trunk/ws/modules/transports/core/vfs/target/synapse-vfs-transport-3.0.2-SNAPSHOT.jar>
to org.apache.synapse/synapse-vfs-transport/3.0.2-SNAPSHOT/synapse-vfs-transport-3.0.2-SNAPSHOT.jar
[JENKINS] Archiving <https://builds.apache.org/job/Synapse%20-%20Trunk/ws/modules/transports/core/vfs/target/synapse-vfs-transport-3.0.2-SNAPSHOT-testkit-logs.zip>
to org.apache.synapse/synapse-vfs-transport/3.0.2-SNAPSHOT/synapse-vfs-transport-3.0.2-SNAPSHOT-testkit-logs.zip
[JENKINS] Archiving <https://builds.apache.org/job/Synapse%20-%20Trunk/ws/modules/packaging/package-skeleton/pom.xml>
to org.apache.synapse/synapse-package-skeleton/3.0.2-SNAPSHOT/synapse-package-skeleton-3.0.2-SNAPSHOT.pom
[JENKINS] Archiving <https://builds.apache.org/job/Synapse%20-%20Trunk/ws/modules/integration/pom.xml>
to org.apache.synapse/synapse-integration/3.0.2-SNAPSHOT/synapse-integration-3.0.2-SNAPSHOT.pom
[JENKINS] Archiving <https://builds.apache.org/job/Synapse%20-%20Trunk/ws/modules/transports/core/pipe/pom.xml>
to org.apache.synapse/synapse-pipe-transport/3.0.2-SNAPSHOT/synapse-pipe-transport-3.0.2-SNAPSHOT.pom
[JENKINS] Archiving <https://builds.apache.org/job/Synapse%20-%20Trunk/ws/modules/transports/core/pipe/target/synapse-pipe-transport-3.0.2-SNAPSHOT.jar>
to org.apache.synapse/synapse-pipe-transport/3.0.2-SNAPSHOT/synapse-pipe-transport-3.0.2-SNAPSHOT.jar
[JENKINS] Archiving <https://builds.apache.org/job/Synapse%20-%20Trunk/ws/modules/core/pom.xml>
to org.apache.synapse/synapse-core/3.0.2-SNAPSHOT/synapse-core-3.0.2-SNAPSHOT.pom
[JENKINS] Archiving <https://builds.apache.org/job/Synapse%20-%20Trunk/ws/modules/transports/optional/amqp/pom.xml>
to org.apache.synapse/synapse-amqp-transport/3.0.2-SNAPSHOT/synapse-amqp-transport-3.0.2-SNAPSHOT.pom
[JENKINS] Archiving <https://builds.apache.org/job/Synapse%20-%20Trunk/ws/modules/transports/optional/amqp/target/synapse-amqp-transport-3.0.2-SNAPSHOT.jar>
to org.apache.synapse/synapse-amqp-transport/3.0.2-SNAPSHOT/synapse-amqp-transport-3.0.2-SNAPSHOT.jar
[JENKINS] Archiving <https://builds.apache.org/job/Synapse%20-%20Trunk/ws/modules/patches/pom.xml>
to org.apache.synapse/synapse-patches/3.0.2-SNAPSHOT/synapse-patches-3.0.2-SNAPSHOT.pom
[JENKINS] Archiving <https://builds.apache.org/job/Synapse%20-%20Trunk/ws/modules/distribution/pom.xml>
to org.apache.synapse/synapse-distribution/3.0.2-SNAPSHOT/synapse-distribution-3.0.2-SNAPSHOT.pom
[JENKINS] Archiving <https://builds.apache.org/job/Synapse%20-%20Trunk/ws/modules/experimental/pom.xml>
to org.apache.synapse/synapse-experimental/3.0.2-SNAPSHOT/synapse-experimental-3.0.2-SNAPSHOT.pom
No mail will be sent out, as 'Synapse - Trunk » Apache Synapse - FIX Transport #5421' does
not have a result yet. Please make sure you set a proper result in case of pipeline/build
scripts.
No mail will be sent out, as 'Synapse - Trunk » Apache Synapse - Secure Vault #5421' does
not have a result yet. Please make sure you set a proper result in case of pipeline/build
scripts.
No mail will be sent out, as 'Synapse - Trunk » Apache Synapse - Commons #5421' does not
have a result yet. Please make sure you set a proper result in case of pipeline/build scripts.
No mail will be sent out, as 'Synapse - Trunk » Apache Synapse - Web Application #5421'
does not have a result yet. Please make sure you set a proper result in case of pipeline/build
scripts.
No mail will be sent out, as 'Synapse - Trunk » Apache Synapse #5421' does not have a result
yet. Please make sure you set a proper result in case of pipeline/build scripts.
No mail will be sent out, as 'Synapse - Trunk » Apache Synapse - Extensions #5421' does
not have a result yet. Please make sure you set a proper result in case of pipeline/build
scripts.
No mail will be sent out, as 'Synapse - Trunk » Apache Synapse - Handler Module #5421'
does not have a result yet. Please make sure you set a proper result in case of pipeline/build
scripts.
No mail will be sent out, as 'Synapse - Trunk » Apache Synapse - XAR Maven Plugin #5421'
does not have a result yet. Please make sure you set a proper result in case of pipeline/build
scripts.
No mail will be sent out, as 'Synapse - Trunk » Apache Synapse - PIPE Transport #5421'
does not have a result yet. Please make sure you set a proper result in case of pipeline/build
scripts.
No mail will be sent out, as 'Synapse - Trunk » Apache Synapse - AMQP Transport #5421'
does not have a result yet. Please make sure you set a proper result in case of pipeline/build
scripts.
No mail will be sent out, as 'Synapse - Trunk » Apache Synapse - Patches #5421' does not
have a result yet. Please make sure you set a proper result in case of pipeline/build scripts.
No mail will be sent out, as 'Synapse - Trunk » Apache Synapse - Transports #5421' does
not have a result yet. Please make sure you set a proper result in case of pipeline/build
scripts.
No mail will be sent out, as 'Synapse - Trunk » Apache Synapse #5421' does not have a result
yet. Please make sure you set a proper result in case of pipeline/build scripts.
No mail will be sent out, as 'Synapse - Trunk » Apache Synapse - Configuration Migrator
#5421' does not have a result yet. Please make sure you set a proper result in case of pipeline/build
scripts.
No mail will be sent out, as 'Synapse - Trunk » Apache Synapse - Samples #5421' does not
have a result yet. Please make sure you set a proper result in case of pipeline/build scripts.
No mail will be sent out, as 'Synapse - Trunk » Apache Synapse - Tasks #5421' does not
have a result yet. Please make sure you set a proper result in case of pipeline/build scripts.
No mail will be sent out, as 'Synapse - Trunk » Apache Synapse - Package archetype #5421'
does not have a result yet. Please make sure you set a proper result in case of pipeline/build
scripts.
No mail will be sent out, as 'Synapse - Trunk » Apache Synapse - Non-blocking HTTP/s Transport
#5421' does not have a result yet. Please make sure you set a proper result in case of pipeline/build
scripts.
No mail will be sent out, as 'Synapse - Trunk » Apache Synapse - VFS Transport #5421' does
not have a result yet. Please make sure you set a proper result in case of pipeline/build
scripts.
No mail will be sent out, as 'Synapse - Trunk » Apache Synapse - Package skeleton ZIP #5421'
does not have a result yet. Please make sure you set a proper result in case of pipeline/build
scripts.
No mail will be sent out, as 'Synapse - Trunk » Apache Synapse - Integration #5421' does
not have a result yet. Please make sure you set a proper result in case of pipeline/build
scripts.
Sending e-mails to: dev@synapse.apache.org
No mail will be sent out, as 'Synapse - Trunk » Apache Synapse - Distribution #5421' does
not have a result yet. Please make sure you set a proper result in case of pipeline/build
scripts.
No mail will be sent out, as 'Synapse - Trunk » Apache Synapse - Experimental code #5421'
does not have a result yet. Please make sure you set a proper result in case of pipeline/build
scripts.
[locks-and-latches] Releasing all the locks
[locks-and-latches] All the locks released
channel stopped
[JIRA] Updating issue SYNAPSE-1106
No JDK named ?JDK 1.8.0_144 (unlimited security)? found
No JDK named ?JDK 1.8.0_144 (unlimited security)? found
No JDK named ?JDK 1.8.0_144 (unlimited security)? found

---------------------------------------------------------------------
To unsubscribe, e-mail: dev-unsubscribe@synapse.apache.org
For additional commands, e-mail: dev-help@synapse.apache.org


Mime
View raw message