systemml-dev mailing list archives

Site index · List index
Message view « Date » · « Thread »
Top « Date » · « Thread »
From jenk...@spark.tc
Subject Build failed in Jenkins: SystemML-DailyTest #40
Date Sat, 30 Jan 2016 10:46:46 GMT
See <https://sparktc.ibmcloud.com/jenkins/job/SystemML-DailyTest/40/>

------------------------------------------
[...truncated 1288 lines...]
Running org.apache.sysml.test.integration.functions.aggregate.FullRowAggregateTest
Tests run: 160, Failures: 0, Errors: 0, Skipped: 0, Time elapsed: 934.525 sec - in org.apache.sysml.test.integration.functions.aggregate.FullRowAggregateTest
16/01/30 03:28:24 INFO util.Utils: Shutdown hook called
16/01/30 03:28:24 INFO util.Utils: Deleting directory /tmp/spark-b26bfd45-ff8c-4eb0-be47-ac20c1a3d4e3
Running org.apache.sysml.test.integration.functions.quaternary.RewritesWeightedSigmoidTest
Tests run: 6, Failures: 0, Errors: 0, Skipped: 0, Time elapsed: 53.562 sec - in org.apache.sysml.test.integration.functions.quaternary.RewritesWeightedSigmoidTest
16/01/30 03:28:29 INFO util.Utils: Shutdown hook called
16/01/30 03:28:29 INFO util.Utils: Deleting directory /tmp/spark-34919e50-f502-401c-b4b8-d9d9be82dbb5
16/01/30 03:28:29 WARN util.NativeCodeLoader: Unable to load native-hadoop library for your
platform... using builtin-java classes where applicable
16/01/30 03:28:32 WARN util.NativeCodeLoader: Unable to load native-hadoop library for your
platform... using builtin-java classes where applicable
Running org.apache.sysml.test.integration.functions.io.csv.FormatChangeTest
Tests run: 6, Failures: 0, Errors: 0, Skipped: 0, Time elapsed: 304.676 sec - in org.apache.sysml.test.integration.functions.io.csv.FormatChangeTest
Running org.apache.sysml.test.integration.functions.io.csv.CSVParametersTest
Tests run: 48, Failures: 0, Errors: 0, Skipped: 0, Time elapsed: 351.598 sec - in org.apache.sysml.test.integration.functions.io.csv.CSVParametersTest
Running org.apache.sysml.test.integration.functions.caching.CachingPWriteExportTest
Tests run: 2, Failures: 0, Errors: 0, Skipped: 0, Time elapsed: 43.515 sec - in org.apache.sysml.test.integration.functions.caching.CachingPWriteExportTest
Running org.apache.sysml.test.integration.functions.quaternary.WeightedCrossEntropyTest
Tests run: 8, Failures: 0, Errors: 0, Skipped: 0, Time elapsed: 130.48 sec - in org.apache.sysml.test.integration.functions.quaternary.WeightedCrossEntropyTest
16/01/30 03:30:44 INFO util.Utils: Shutdown hook called
16/01/30 03:30:44 INFO util.Utils: Deleting directory /tmp/spark-7c04b87c-6f5d-4baf-9e11-80ff04eda865
Running org.apache.sysml.test.integration.functions.transform.RunTest
Tests run: 24, Failures: 0, Errors: 0, Skipped: 0, Time elapsed: 110.08 sec - in org.apache.sysml.test.integration.functions.transform.RunTest
Running org.apache.sysml.test.integration.functions.reorg.FullTransposeTest
Tests run: 18, Failures: 0, Errors: 0, Skipped: 0, Time elapsed: 410.707 sec - in org.apache.sysml.test.integration.functions.reorg.FullTransposeTest
Running org.apache.sysml.test.integration.functions.jmlc.ReuseModelVariablesTest
Tests run: 8, Failures: 0, Errors: 0, Skipped: 0, Time elapsed: 5.987 sec - in org.apache.sysml.test.integration.functions.jmlc.ReuseModelVariablesTest
Running org.apache.sysml.test.integration.functions.transform.ScalingTest
Tests run: 8, Failures: 0, Errors: 0, Skipped: 0, Time elapsed: 74.625 sec - in org.apache.sysml.test.integration.functions.transform.ScalingTest
Running org.apache.sysml.test.integration.functions.binary.matrix_full_cellwise.FullMatrixMatrixCellwiseOperationTest
Tests run: 108, Failures: 0, Errors: 0, Skipped: 0, Time elapsed: 1,962.276 sec - in org.apache.sysml.test.integration.functions.binary.matrix_full_cellwise.FullMatrixMatrixCellwiseOperationTest
16/01/30 03:32:15 INFO util.Utils: Shutdown hook called
16/01/30 03:32:15 INFO util.Utils: Deleting directory /tmp/spark-7620f8fe-5b0a-4c0d-bbe3-22acf75ca35b
Running org.apache.sysml.test.integration.functions.vect.LeftIndexingChainUpdateTest
Tests run: 4, Failures: 0, Errors: 0, Skipped: 0, Time elapsed: 20.85 sec - in org.apache.sysml.test.integration.functions.vect.LeftIndexingChainUpdateTest
Running org.apache.sysml.test.integration.functions.blocks.WhileTest
Tests run: 2, Failures: 0, Errors: 0, Skipped: 0, Time elapsed: 5.596 sec - in org.apache.sysml.test.integration.functions.blocks.WhileTest
Running org.apache.sysml.test.integration.functions.dmlscript.DMLScriptTest1
Tests run: 2, Failures: 0, Errors: 0, Skipped: 0, Time elapsed: 5.617 sec - in org.apache.sysml.test.integration.functions.dmlscript.DMLScriptTest1
Running org.apache.sysml.test.integration.functions.blocks.VariableTest
Tests run: 3, Failures: 0, Errors: 0, Skipped: 0, Time elapsed: 6.601 sec - in org.apache.sysml.test.integration.functions.blocks.VariableTest
16/01/30 03:32:33 WARN util.NativeCodeLoader: Unable to load native-hadoop library for your
platform... using builtin-java classes where applicable
Running org.apache.sysml.test.integration.functions.reorg.FullReverseTest
Tests run: 14, Failures: 0, Errors: 0, Skipped: 0, Time elapsed: 486.315 sec - in org.apache.sysml.test.integration.functions.reorg.FullReverseTest
Running org.apache.sysml.test.integration.functions.dmlscript.DMLScriptTest2
Tests run: 2, Failures: 0, Errors: 0, Skipped: 0, Time elapsed: 2.333 sec - in org.apache.sysml.test.integration.functions.dmlscript.DMLScriptTest2
16/01/30 03:32:35 WARN util.NativeCodeLoader: Unable to load native-hadoop library for your
platform... using builtin-java classes where applicable
Running org.apache.sysml.test.integration.functions.jmlc.SystemTMulticlassSVMScoreTest
Tests run: 2, Failures: 0, Errors: 0, Skipped: 0, Time elapsed: 88.566 sec - in org.apache.sysml.test.integration.functions.jmlc.SystemTMulticlassSVMScoreTest
Running org.apache.sysml.test.integration.functions.vect.AutoVectorizationTest
Tests run: 24, Failures: 0, Errors: 0, Skipped: 0, Time elapsed: 113.277 sec - in org.apache.sysml.test.integration.functions.vect.AutoVectorizationTest
Running org.apache.sysml.test.integration.functions.indexing.RightIndexingVectorTest
Tests run: 3, Failures: 0, Errors: 0, Skipped: 0, Time elapsed: 69.223 sec - in org.apache.sysml.test.integration.functions.indexing.RightIndexingVectorTest
Running org.apache.sysml.test.integration.functions.indexing.LeftIndexingSparseSparseTest
Tests run: 15, Failures: 0, Errors: 0, Skipped: 0, Time elapsed: 122.964 sec - in org.apache.sysml.test.integration.functions.indexing.LeftIndexingSparseSparseTest
16/01/30 03:34:39 INFO util.Utils: Shutdown hook called
16/01/30 03:34:39 INFO util.Utils: Deleting directory /tmp/spark-f0009f28-b1f2-498e-954a-d2ed5dd9ebef
16/01/30 03:34:41 WARN util.NativeCodeLoader: Unable to load native-hadoop library for your
platform... using builtin-java classes where applicable
Running org.apache.sysml.test.integration.functions.reorg.MatrixReshapeTest
Tests run: 36, Failures: 0, Errors: 0, Skipped: 0, Time elapsed: 612.783 sec - in org.apache.sysml.test.integration.functions.reorg.MatrixReshapeTest
Running org.apache.sysml.test.integration.functions.transform.TransformTest
Tests run: 80, Failures: 0, Errors: 0, Skipped: 0, Time elapsed: 358.379 sec - in org.apache.sysml.test.integration.functions.transform.TransformTest
Running org.apache.sysml.test.integration.functions.quaternary.WeightedUnaryMatrixMultTest
Tests run: 26, Failures: 0, Errors: 0, Skipped: 0, Time elapsed: 553.659 sec - in org.apache.sysml.test.integration.functions.quaternary.WeightedUnaryMatrixMultTest
16/01/30 03:36:52 INFO util.Utils: Shutdown hook called
16/01/30 03:36:52 INFO util.Utils: Deleting directory /tmp/spark-c0c8b87e-8861-4440-af85-42c478192e12
Running org.apache.sysml.test.integration.functions.indexing.RightIndexingMatrixTest
Tests run: 6, Failures: 0, Errors: 0, Skipped: 0, Time elapsed: 274.39 sec - in org.apache.sysml.test.integration.functions.indexing.RightIndexingMatrixTest
Running org.apache.sysml.test.integration.functions.indexing.LeftIndexingScalarTest
Tests run: 3, Failures: 0, Errors: 0, Skipped: 0, Time elapsed: 233.67 sec - in org.apache.sysml.test.integration.functions.indexing.LeftIndexingScalarTest
Running org.apache.sysml.test.integration.functions.quaternary.WeightedSquaredLossTest
Tests run: 55, Failures: 0, Errors: 0, Skipped: 0, Time elapsed: 820.51 sec - in org.apache.sysml.test.integration.functions.quaternary.WeightedSquaredLossTest
16/01/30 03:38:44 INFO util.Utils: Shutdown hook called
16/01/30 03:38:44 INFO util.Utils: Deleting directory /tmp/spark-22e1c11e-591e-4eed-9711-e4b76907cf3f
Running org.apache.sysml.test.integration.functions.append.StringAppendTest
Tests run: 9, Failures: 0, Errors: 0, Skipped: 0, Time elapsed: 44.152 sec - in org.apache.sysml.test.integration.functions.append.StringAppendTest
Running org.apache.sysml.test.integration.functions.indexing.LeftIndexingSparseDenseTest
Tests run: 15, Failures: 0, Errors: 0, Skipped: 0, Time elapsed: 285.723 sec - in org.apache.sysml.test.integration.functions.indexing.LeftIndexingSparseDenseTest
16/01/30 03:39:28 INFO util.Utils: Shutdown hook called
16/01/30 03:39:28 INFO util.Utils: Deleting directory /tmp/spark-cb923ffd-3d1e-4275-b35c-4ba067f51a95
Running org.apache.sysml.test.integration.functions.append.RBindCBindMatrixTest
Tests run: 12, Failures: 0, Errors: 0, Skipped: 0, Time elapsed: 148.369 sec - in org.apache.sysml.test.integration.functions.append.RBindCBindMatrixTest
Running org.apache.sysml.test.integration.scalability.LinearRegressionTest
Tests run: 1, Failures: 0, Errors: 0, Skipped: 0, Time elapsed: 2.046 sec - in org.apache.sysml.test.integration.scalability.LinearRegressionTest
Running org.apache.sysml.test.integration.scalability.PageRankTest
Tests run: 1, Failures: 0, Errors: 0, Skipped: 0, Time elapsed: 2.424 sec - in org.apache.sysml.test.integration.scalability.PageRankTest
Running org.apache.sysml.test.integration.applications.descriptivestats.BivariateCategoricalCategoricallTest
Tests run: 3, Failures: 0, Errors: 0, Skipped: 0, Time elapsed: 21.351 sec - in org.apache.sysml.test.integration.applications.descriptivestats.BivariateCategoricalCategoricallTest
Running org.apache.sysml.test.integration.applications.parfor.ParForBivariateStatsTest
Tests run: 5, Failures: 0, Errors: 0, Skipped: 0, Time elapsed: 67.85 sec - in org.apache.sysml.test.integration.applications.parfor.ParForBivariateStatsTest
Running org.apache.sysml.test.integration.applications.descriptivestats.BivariateOrdinalOrdinalTest
Tests run: 2, Failures: 0, Errors: 0, Skipped: 0, Time elapsed: 6.956 sec - in org.apache.sysml.test.integration.applications.descriptivestats.BivariateOrdinalOrdinalTest
Running org.apache.sysml.test.integration.applications.descriptivestats.BivariateScaleCategoricalTest
Tests run: 2, Failures: 0, Errors: 0, Skipped: 0, Time elapsed: 9.235 sec - in org.apache.sysml.test.integration.applications.descriptivestats.BivariateScaleCategoricalTest
Running org.apache.sysml.test.integration.applications.descriptivestats.BivariateScaleScaleTest
Tests run: 2, Failures: 0, Errors: 0, Skipped: 0, Time elapsed: 8.698 sec - in org.apache.sysml.test.integration.applications.descriptivestats.BivariateScaleScaleTest
Running org.apache.sysml.test.integration.applications.descriptivestats.OrderStatisticsTest
Tests run: 1, Failures: 0, Errors: 0, Skipped: 0, Time elapsed: 0.158 sec - in org.apache.sysml.test.integration.applications.descriptivestats.OrderStatisticsTest
Running org.apache.sysml.test.integration.applications.descriptivestats.UnivariateCategoricalTest
Tests run: 2, Failures: 0, Errors: 0, Skipped: 0, Time elapsed: 7.352 sec - in org.apache.sysml.test.integration.applications.descriptivestats.UnivariateCategoricalTest
Running org.apache.sysml.test.integration.applications.parfor.ParForCVMulticlassSVMTest
Tests run: 6, Failures: 0, Errors: 0, Skipped: 0, Time elapsed: 31.465 sec - in org.apache.sysml.test.integration.applications.parfor.ParForCVMulticlassSVMTest
Running org.apache.sysml.test.integration.applications.dml.ArimaDMLTest
Tests run: 1, Failures: 0, Errors: 0, Skipped: 0, Time elapsed: 78.247 sec - in org.apache.sysml.test.integration.applications.dml.ArimaDMLTest
Running org.apache.sysml.test.integration.functions.quaternary.WeightedDivMatrixMultTest
Tests run: 72, Failures: 0, Errors: 0, Skipped: 0, Time elapsed: 930.562 sec - in org.apache.sysml.test.integration.functions.quaternary.WeightedDivMatrixMultTest
16/01/30 03:40:41 INFO util.Utils: Shutdown hook called
16/01/30 03:40:41 INFO util.Utils: Deleting directory /tmp/spark-18d99e66-fcd3-4f51-a9bb-9c6c48349cf2
Running org.apache.sysml.test.integration.applications.parfor.ParForUnivariateStatsTest
Tests run: 3, Failures: 0, Errors: 0, Skipped: 0, Time elapsed: 16.836 sec - in org.apache.sysml.test.integration.applications.parfor.ParForUnivariateStatsTest
Running org.apache.sysml.test.integration.functions.indexing.Jdk7IssueRightIndexingTest
Tests run: 8, Failures: 0, Errors: 0, Skipped: 0, Time elapsed: 494.858 sec - in org.apache.sysml.test.integration.functions.indexing.Jdk7IssueRightIndexingTest
Running org.apache.sysml.test.integration.functions.append.AppendVectorTest
Tests run: 6, Failures: 0, Errors: 0, Skipped: 0, Time elapsed: 373.492 sec - in org.apache.sysml.test.integration.functions.append.AppendVectorTest
Running org.apache.sysml.test.integration.functions.indexing.LeftIndexingTest
Tests run: 3, Failures: 0, Errors: 0, Skipped: 0, Time elapsed: 642.861 sec - in org.apache.sysml.test.integration.functions.indexing.LeftIndexingTest
Running org.apache.sysml.test.integration.functions.quaternary.WeightedSigmoidTest
Tests run: 56, Failures: 0, Errors: 0, Skipped: 0, Time elapsed: 966.237 sec - in org.apache.sysml.test.integration.functions.quaternary.WeightedSigmoidTest
16/01/30 03:44:37 INFO util.Utils: Shutdown hook called
16/01/30 03:44:37 INFO util.Utils: Deleting directory /tmp/spark-8ec96055-8f48-42b7-b699-de7aaca28c5c
Running org.apache.sysml.test.integration.applications.parfor.ParForCorrelationTest
Tests run: 12, Failures: 0, Errors: 0, Skipped: 0, Time elapsed: 249.396 sec - in org.apache.sysml.test.integration.applications.parfor.ParForCorrelationTest
Running org.apache.sysml.test.integration.applications.parfor.ParForCorrelationTestLarge
Tests run: 2, Failures: 0, Errors: 0, Skipped: 0, Time elapsed: 43.934 sec - in org.apache.sysml.test.integration.applications.parfor.ParForCorrelationTestLarge
Running org.apache.sysml.test.integration.applications.descriptivestats.UnivariateUnweightedScaleDenseTest
Tests run: 24, Failures: 0, Errors: 0, Skipped: 0, Time elapsed: 312.792 sec - in org.apache.sysml.test.integration.applications.descriptivestats.UnivariateUnweightedScaleDenseTest
Running org.apache.sysml.test.integration.functions.reorg.FullOrderTest
Tests run: 132, Failures: 0, Errors: 0, Skipped: 0, Time elapsed: 1,344.031 sec - in org.apache.sysml.test.integration.functions.reorg.FullOrderTest
Running org.apache.sysml.test.integration.applications.descriptivestats.UnivariateWeightedScaleDenseTest
Tests run: 24, Failures: 0, Errors: 0, Skipped: 0, Time elapsed: 359.428 sec - in org.apache.sysml.test.integration.applications.descriptivestats.UnivariateWeightedScaleDenseTest
Running org.apache.sysml.test.integration.functions.append.AppendChainTest
Tests run: 12, Failures: 0, Errors: 0, Skipped: 0, Time elapsed: 1,045.358 sec - in org.apache.sysml.test.integration.functions.append.AppendChainTest
Running org.apache.sysml.test.integration.applications.parfor.ParForNaiveBayesTest
Tests run: 10, Failures: 0, Errors: 0, Skipped: 0, Time elapsed: 527.112 sec - in org.apache.sysml.test.integration.applications.parfor.ParForNaiveBayesTest
Running org.apache.sysml.test.integration.applications.descriptivestats.UnivariateUnweightedScaleSparseTest
Tests run: 24, Failures: 0, Errors: 0, Skipped: 0, Time elapsed: 294.438 sec - in org.apache.sysml.test.integration.applications.descriptivestats.UnivariateUnweightedScaleSparseTest
Running org.apache.sysml.test.integration.applications.dml.HITSDMLTest
Tests run: 1, Failures: 0, Errors: 0, Skipped: 0, Time elapsed: 82.696 sec - in org.apache.sysml.test.integration.applications.dml.HITSDMLTest
Running org.apache.sysml.test.integration.functions.append.AppendMatrixTest
Tests run: 22, Failures: 0, Errors: 0, Skipped: 0, Time elapsed: 1,512.657 sec - in org.apache.sysml.test.integration.functions.append.AppendMatrixTest
Running org.apache.sysml.test.integration.applications.descriptivestats.UnivariateWeightedScaleSparseTest
Tests run: 24, Failures: 0, Errors: 0, Skipped: 0, Time elapsed: 339.774 sec - in org.apache.sysml.test.integration.applications.descriptivestats.UnivariateWeightedScaleSparseTest
Running org.apache.sysml.test.integration.applications.pydml.ArimaPyDMLTest
Tests run: 1, Failures: 0, Errors: 0, Skipped: 0, Time elapsed: 49.804 sec - in org.apache.sysml.test.integration.applications.pydml.ArimaPyDMLTest
Running org.apache.sysml.test.integration.applications.pydml.HITSPyDMLTest
Tests run: 1, Failures: 0, Errors: 0, Skipped: 0, Time elapsed: 77.31 sec - in org.apache.sysml.test.integration.applications.pydml.HITSPyDMLTest
Running org.apache.sysml.test.integration.applications.dml.LinearRegressionDMLTest
Tests run: 7, Failures: 0, Errors: 0, Skipped: 0, Time elapsed: 51.966 sec - in org.apache.sysml.test.integration.applications.dml.LinearRegressionDMLTest
Running org.apache.sysml.test.integration.applications.pydml.CsplineDSPyDMLTest
Tests run: 3, Failures: 0, Errors: 0, Skipped: 0, Time elapsed: 6.929 sec - in org.apache.sysml.test.integration.applications.pydml.CsplineDSPyDMLTest
Running org.apache.sysml.test.integration.applications.pydml.LinearLogRegPyDMLTest
Tests run: 7, Failures: 0, Errors: 0, Skipped: 0, Time elapsed: 83.879 sec - in org.apache.sysml.test.integration.applications.pydml.LinearLogRegPyDMLTest
Running org.apache.sysml.test.integration.applications.pydml.NaiveBayesPyDMLTest
Tests run: 6, Failures: 0, Errors: 0, Skipped: 0, Time elapsed: 81.134 sec - in org.apache.sysml.test.integration.applications.pydml.NaiveBayesPyDMLTest
Running org.apache.sysml.test.integration.applications.dml.CsplineCGDMLTest
Tests run: 3, Failures: 0, Errors: 0, Skipped: 0, Time elapsed: 14.735 sec - in org.apache.sysml.test.integration.applications.dml.CsplineCGDMLTest
Running org.apache.sysml.test.integration.applications.dml.L2SVMDMLTest
Tests run: 9, Failures: 0, Errors: 0, Skipped: 0, Time elapsed: 65.295 sec - in org.apache.sysml.test.integration.applications.dml.L2SVMDMLTest
Running org.apache.sysml.test.integration.applications.pydml.MDABivariateStatsPyDMLTest
Tests run: 4, Failures: 0, Errors: 0, Skipped: 0, Time elapsed: 294.309 sec - in org.apache.sysml.test.integration.applications.pydml.MDABivariateStatsPyDMLTest
Running org.apache.sysml.test.integration.applications.pydml.PageRankPyDMLTest
Tests run: 3, Failures: 0, Errors: 0, Skipped: 0, Time elapsed: 6.471 sec - in org.apache.sysml.test.integration.applications.pydml.PageRankPyDMLTest
Running org.apache.sysml.test.integration.applications.pydml.NaiveBayesParforPyDMLTest
Tests run: 6, Failures: 0, Errors: 0, Skipped: 0, Time elapsed: 81.336 sec - in org.apache.sysml.test.integration.applications.pydml.NaiveBayesParforPyDMLTest
Running org.apache.sysml.test.integration.applications.dml.NaiveBayesDMLTest
Tests run: 6, Failures: 0, Errors: 0, Skipped: 0, Time elapsed: 81.652 sec - in org.apache.sysml.test.integration.applications.dml.NaiveBayesDMLTest
Running org.apache.sysml.test.integration.applications.dml.MDABivariateStatsDMLTest
Tests run: 4, Failures: 0, Errors: 0, Skipped: 0, Time elapsed: 295.297 sec - in org.apache.sysml.test.integration.applications.dml.MDABivariateStatsDMLTest
Running org.apache.sysml.test.integration.applications.dml.PageRankDMLTest
Tests run: 3, Failures: 0, Errors: 0, Skipped: 0, Time elapsed: 6.582 sec - in org.apache.sysml.test.integration.applications.dml.PageRankDMLTest
Running org.apache.sysml.test.integration.applications.pydml.GLMPyDMLTest
Tests run: 30, Failures: 0, Errors: 0, Skipped: 0, Time elapsed: 587.84 sec - in org.apache.sysml.test.integration.applications.pydml.GLMPyDMLTest
Running org.apache.sysml.test.integration.applications.pydml.MultiClassSVMPyDMLTest
Tests run: 9, Failures: 0, Errors: 0, Skipped: 0, Time elapsed: 89.248 sec - in org.apache.sysml.test.integration.applications.pydml.MultiClassSVMPyDMLTest
Running org.apache.sysml.test.integration.applications.dml.ID3DMLTest
Tests run: 2, Failures: 0, Errors: 0, Skipped: 0, Time elapsed: 374.939 sec - in org.apache.sysml.test.integration.applications.dml.ID3DMLTest
Running org.apache.sysml.test.integration.applications.dml.GLMDMLTest
Tests run: 30, Failures: 0, Errors: 0, Skipped: 0, Time elapsed: 814.8 sec - in org.apache.sysml.test.integration.applications.dml.GLMDMLTest
Running org.apache.sysml.test.integration.applications.pydml.CsplineCGPyDMLTest
Tests run: 3, Failures: 0, Errors: 0, Skipped: 0, Time elapsed: 6.207 sec - in org.apache.sysml.test.integration.applications.pydml.CsplineCGPyDMLTest
Running org.apache.sysml.test.integration.applications.pydml.WelchTPyDMLTest
Tests run: 3, Failures: 0, Errors: 0, Skipped: 0, Time elapsed: 6.614 sec - in org.apache.sysml.test.integration.applications.pydml.WelchTPyDMLTest
Running org.apache.sysml.test.integration.applications.dml.MultiClassSVMDMLTest
Tests run: 9, Failures: 0, Errors: 0, Skipped: 0, Time elapsed: 89.224 sec - in org.apache.sysml.test.integration.applications.dml.MultiClassSVMDMLTest
Running org.apache.sysml.test.integration.applications.dml.CsplineDSDMLTest
Tests run: 3, Failures: 0, Errors: 0, Skipped: 0, Time elapsed: 10.539 sec - in org.apache.sysml.test.integration.applications.dml.CsplineDSDMLTest
Running org.apache.sysml.test.integration.applications.pydml.ApplyTransformPyDMLTest
Tests run: 7, Failures: 0, Errors: 0, Skipped: 0, Time elapsed: 1.254 sec - in org.apache.sysml.test.integration.applications.pydml.ApplyTransformPyDMLTest
Running org.apache.sysml.test.integration.applications.dml.NaiveBayesParforDMLTest
Tests run: 6, Failures: 0, Errors: 0, Skipped: 0, Time elapsed: 81.72 sec - in org.apache.sysml.test.integration.applications.dml.NaiveBayesParforDMLTest
Running org.apache.sysml.test.integration.applications.pydml.L2SVMPyDMLTest
Tests run: 9, Failures: 0, Errors: 0, Skipped: 0, Time elapsed: 65.45 sec - in org.apache.sysml.test.integration.applications.pydml.L2SVMPyDMLTest
Running org.apache.sysml.test.integration.applications.pydml.LinearRegressionPyDMLTest
Tests run: 7, Failures: 0, Errors: 0, Skipped: 0, Time elapsed: 52.03 sec - in org.apache.sysml.test.integration.applications.pydml.LinearRegressionPyDMLTest
Running org.apache.sysml.test.integration.applications.dml.LinearLogRegDMLTest
Tests run: 7, Failures: 0, Errors: 0, Skipped: 0, Time elapsed: 61.945 sec - in org.apache.sysml.test.integration.applications.dml.LinearLogRegDMLTest
Running org.apache.sysml.test.integration.applications.dml.GNMFDMLTest
Tests run: 3, Failures: 0, Errors: 0, Skipped: 0, Time elapsed: 67.389 sec - in org.apache.sysml.test.integration.applications.dml.GNMFDMLTest
Running org.apache.sysml.test.integration.applications.dml.WelchTDMLTest
Tests run: 3, Failures: 0, Errors: 0, Skipped: 0, Time elapsed: 6.586 sec - in org.apache.sysml.test.integration.applications.dml.WelchTDMLTest
Running org.apache.sysml.test.integration.applications.dml.ApplyTransformDMLTest
Tests run: 7, Failures: 0, Errors: 0, Skipped: 0, Time elapsed: 8.198 sec - in org.apache.sysml.test.integration.applications.dml.ApplyTransformDMLTest
Running org.apache.sysml.test.integration.applications.pydml.ID3PyDMLTest
Tests run: 2, Failures: 0, Errors: 0, Skipped: 0, Time elapsed: 325.387 sec - in org.apache.sysml.test.integration.applications.pydml.ID3PyDMLTest
Running org.apache.sysml.test.integration.applications.pydml.GNMFPyDMLTest
Tests run: 3, Failures: 0, Errors: 0, Skipped: 0, Time elapsed: 56.136 sec - in org.apache.sysml.test.integration.applications.pydml.GNMFPyDMLTest

Results :

Failed tests: 
  ReblockRecompileTest>AutomatedTestBase.tearDown:1403 Detailed matrices characteristics:
!  DML<->R # stored values in DML: 20
!  DML<->R # stored values in R: 3
!  DML<->R identical values(z=0): 17
!  DML<->R wrong values(z=1.0E-10): 3
!  DML<->R min error: 0.0
!  DML<->R max error: 7.0


Tests run: 4772, Failures: 1, Errors: 0, Skipped: 0

[INFO] 
[INFO] --- maven-failsafe-plugin:2.17:verify (default) @ systemml ---
[INFO] Failsafe report directory: <https://sparktc.ibmcloud.com/jenkins/job/SystemML-DailyTest/ws/target/failsafe-reports>
[INFO] ------------------------------------------------------------------------
[INFO] BUILD FAILURE
[INFO] ------------------------------------------------------------------------
[INFO] Total time: 02:15 h
[INFO] Finished at: 2016-01-30T04:46:45-06:00
[INFO] Final Memory: 55M/2350M
[INFO] ------------------------------------------------------------------------
[ERROR] Failed to execute goal org.apache.maven.plugins:maven-failsafe-plugin:2.17:verify
(default) on project systemml: There are test failures.
[ERROR] 
[ERROR] Please refer to <https://sparktc.ibmcloud.com/jenkins/job/SystemML-DailyTest/ws/target/failsafe-reports>
for the individual test results.
[ERROR] -> [Help 1]
[ERROR] 
[ERROR] To see the full stack trace of the errors, re-run Maven with the -e switch.
[ERROR] Re-run Maven using the -X switch to enable full debug logging.
[ERROR] 
[ERROR] For more information about the errors and possible solutions, please read the following
articles:
[ERROR] [Help 1] http://cwiki.apache.org/confluence/display/MAVEN/MojoFailureException
Build step 'Execute shell' marked build as failure
Run condition [Always] enabling perform for step [[Publish xUnit test result report]]
[xUnit] [INFO] - Starting to record.
[xUnit] [INFO] - Processing JUnit
[xUnit] [INFO] - [JUnit] - No test report file(s) were found with the pattern '**/target/surefire-reports/*.xml'
relative to '<https://sparktc.ibmcloud.com/jenkins/job/SystemML-DailyTest/ws/'> for
the testing framework 'JUnit'.  Did you enter a pattern relative to the correct directory?
 Did you generate the result report(s) for 'JUnit'?
[xUnit] [WARNING] - No test reports found for the metric 'JUnit' with the resolved pattern
'**/target/surefire-reports/*.xml'.
[xUnit] [INFO] - Skipping the metric tool processing.
[xUnit] [INFO] - There are errors when processing test results.
[xUnit] [INFO] - Skipping tests recording.

Mime
View raw message