systemml-dev mailing list archives

Site index · List index
Message view « Date » · « Thread »
Top « Date » · « Thread »
From jenk...@spark.tc
Subject Build failed in Jenkins: SystemML-DailyTest #168
Date Fri, 01 Apr 2016 22:33:26 GMT
See <https://sparktc.ibmcloud.com/jenkins/job/SystemML-DailyTest/168/>

------------------------------------------
[...truncated 1426 lines...]
Tests run: 6, Failures: 0, Errors: 0, Skipped: 0, Time elapsed: 232.778 sec - in org.apache.sysml.test.integration.functions.gdfo.GDFOLinregDSsimpl
Running org.apache.sysml.test.integration.functions.gdfo.GDFOMMChainLoop
Tests run: 2, Failures: 0, Errors: 0, Skipped: 0, Time elapsed: 44.927 sec - in org.apache.sysml.test.integration.functions.gdfo.GDFOMMChainLoop
Running org.apache.sysml.test.integration.functions.gdfo.HashInterestingPropertiesTest
Tests run: 3, Failures: 0, Errors: 0, Skipped: 0, Time elapsed: 1.376 sec - in org.apache.sysml.test.integration.functions.gdfo.HashInterestingPropertiesTest
16/04/01 14:13:03 WARN util.NativeCodeLoader: Unable to load native-hadoop library for your
platform... using builtin-java classes where applicable
Running org.apache.sysml.test.integration.functions.indexing.LeftIndexingSparseSparseTest
Tests run: 15, Failures: 0, Errors: 0, Skipped: 0, Time elapsed: 190.18 sec - in org.apache.sysml.test.integration.functions.indexing.LeftIndexingSparseSparseTest
16/04/01 14:14:07 INFO util.Utils: Shutdown hook called
16/04/01 14:14:07 INFO util.Utils: Deleting directory /tmp/spark-e3ef756a-5252-4a18-8728-6cacc8428d88
Running org.apache.sysml.test.integration.functions.data.FullReblockTest
Tests run: 54, Failures: 0, Errors: 0, Skipped: 0, Time elapsed: 563.508 sec - in org.apache.sysml.test.integration.functions.data.FullReblockTest
Running org.apache.sysml.test.integration.functions.ternary.CTableSequenceTest
Tests run: 24, Failures: 0, Errors: 0, Skipped: 0, Time elapsed: 359.518 sec - in org.apache.sysml.test.integration.functions.ternary.CTableSequenceTest
Running org.apache.sysml.test.integration.functions.blocks.VariableTest
Tests run: 3, Failures: 0, Errors: 0, Skipped: 0, Time elapsed: 8.254 sec - in org.apache.sysml.test.integration.functions.blocks.VariableTest
Running org.apache.sysml.test.integration.functions.blocks.WhileTest
Tests run: 2, Failures: 0, Errors: 0, Skipped: 0, Time elapsed: 6.783 sec - in org.apache.sysml.test.integration.functions.blocks.WhileTest
Running org.apache.sysml.test.integration.functions.ternary.QuantileWeightsTest
Tests run: 30, Failures: 0, Errors: 0, Skipped: 0, Time elapsed: 428.994 sec - in org.apache.sysml.test.integration.functions.ternary.QuantileWeightsTest
Running org.apache.sysml.test.integration.functions.caching.CachingPWriteExportTest
Tests run: 2, Failures: 0, Errors: 0, Skipped: 0, Time elapsed: 51.759 sec - in org.apache.sysml.test.integration.functions.caching.CachingPWriteExportTest
Running org.apache.sysml.test.integration.functions.jmlc.FrameTransformTest
Tests run: 4, Failures: 0, Errors: 0, Skipped: 0, Time elapsed: 5.986 sec - in org.apache.sysml.test.integration.functions.jmlc.FrameTransformTest
Running org.apache.sysml.test.integration.functions.jmlc.FrameDecodeTest
Tests run: 4, Failures: 0, Errors: 0, Skipped: 0, Time elapsed: 7.156 sec - in org.apache.sysml.test.integration.functions.jmlc.FrameDecodeTest
Running org.apache.sysml.test.integration.functions.jmlc.ReuseModelVariablesTest
Tests run: 8, Failures: 0, Errors: 0, Skipped: 0, Time elapsed: 12.231 sec - in org.apache.sysml.test.integration.functions.jmlc.ReuseModelVariablesTest
Running org.apache.sysml.test.integration.functions.indexing.RightIndexingVectorTest
Tests run: 3, Failures: 0, Errors: 0, Skipped: 0, Time elapsed: 128.553 sec - in org.apache.sysml.test.integration.functions.indexing.RightIndexingVectorTest
Running org.apache.sysml.test.integration.functions.jmlc.FrameReadMetaTest
Tests run: 2, Failures: 0, Errors: 0, Skipped: 0, Time elapsed: 4.15 sec - in org.apache.sysml.test.integration.functions.jmlc.FrameReadMetaTest
Running org.apache.sysml.test.integration.functions.updateinplace.UpdateInPlaceTest
Tests run: 15, Failures: 0, Errors: 0, Skipped: 0, Time elapsed: 9.783 sec - in org.apache.sysml.test.integration.functions.updateinplace.UpdateInPlaceTest
Running org.apache.sysml.test.integration.applications.descriptivestats.BivariateCategoricalCategoricallTest
Tests run: 3, Failures: 0, Errors: 0, Skipped: 0, Time elapsed: 30.623 sec - in org.apache.sysml.test.integration.applications.descriptivestats.BivariateCategoricalCategoricallTest
Running org.apache.sysml.test.integration.applications.descriptivestats.BivariateOrdinalOrdinalTest
Tests run: 2, Failures: 0, Errors: 0, Skipped: 0, Time elapsed: 18.728 sec - in org.apache.sysml.test.integration.applications.descriptivestats.BivariateOrdinalOrdinalTest
Running org.apache.sysml.test.integration.functions.jmlc.SystemTMulticlassSVMScoreTest
Tests run: 2, Failures: 0, Errors: 0, Skipped: 0, Time elapsed: 121.614 sec - in org.apache.sysml.test.integration.functions.jmlc.SystemTMulticlassSVMScoreTest
Running org.apache.sysml.test.integration.applications.descriptivestats.BivariateScaleCategoricalTest
Tests run: 2, Failures: 0, Errors: 0, Skipped: 0, Time elapsed: 18.491 sec - in org.apache.sysml.test.integration.applications.descriptivestats.BivariateScaleCategoricalTest
Running org.apache.sysml.test.integration.functions.indexing.RightIndexingMatrixTest
Tests run: 6, Failures: 0, Errors: 0, Skipped: 0, Time elapsed: 379.63 sec - in org.apache.sysml.test.integration.functions.indexing.RightIndexingMatrixTest
Running org.apache.sysml.test.integration.functions.indexing.LeftIndexingScalarTest
Tests run: 3, Failures: 0, Errors: 0, Skipped: 0, Time elapsed: 356.317 sec - in org.apache.sysml.test.integration.functions.indexing.LeftIndexingScalarTest
Running org.apache.sysml.test.integration.scalability.PageRankTest
Tests run: 1, Failures: 0, Errors: 0, Skipped: 0, Time elapsed: 2.705 sec - in org.apache.sysml.test.integration.scalability.PageRankTest
Running org.apache.sysml.test.integration.functions.mlcontext.GNMFTest
Tests run: 6, Failures: 0, Errors: 0, Skipped: 0, Time elapsed: 438.505 sec - in org.apache.sysml.test.integration.functions.mlcontext.GNMFTest
Running org.apache.sysml.test.integration.scalability.LinearRegressionTest
Tests run: 1, Failures: 0, Errors: 0, Skipped: 0, Time elapsed: 2.147 sec - in org.apache.sysml.test.integration.scalability.LinearRegressionTest
Running org.apache.sysml.test.integration.applications.descriptivestats.BivariateScaleScaleTest
Tests run: 2, Failures: 0, Errors: 0, Skipped: 0, Time elapsed: 16.803 sec - in org.apache.sysml.test.integration.applications.descriptivestats.BivariateScaleScaleTest
Running org.apache.sysml.test.integration.applications.descriptivestats.OrderStatisticsTest
Tests run: 1, Failures: 0, Errors: 0, Skipped: 0, Time elapsed: 1.249 sec - in org.apache.sysml.test.integration.applications.descriptivestats.OrderStatisticsTest
Running org.apache.sysml.test.integration.applications.descriptivestats.UnivariateCategoricalTest
Tests run: 2, Failures: 0, Errors: 0, Skipped: 0, Time elapsed: 13.684 sec - in org.apache.sysml.test.integration.applications.descriptivestats.UnivariateCategoricalTest
Running org.apache.sysml.test.integration.applications.dml.ArimaDMLTest
Tests run: 1, Failures: 0, Errors: 0, Skipped: 0, Time elapsed: 113.881 sec - in org.apache.sysml.test.integration.applications.dml.ArimaDMLTest
Running org.apache.sysml.test.integration.applications.parfor.ParForBivariateStatsTest
Tests run: 5, Failures: 0, Errors: 0, Skipped: 0, Time elapsed: 101.912 sec - in org.apache.sysml.test.integration.applications.parfor.ParForBivariateStatsTest
Running org.apache.sysml.test.integration.functions.indexing.LeftIndexingSparseDenseTest
Tests run: 15, Failures: 0, Errors: 0, Skipped: 0, Time elapsed: 405.572 sec - in org.apache.sysml.test.integration.functions.indexing.LeftIndexingSparseDenseTest
16/04/01 14:19:50 INFO util.Utils: Shutdown hook called
16/04/01 14:19:50 INFO util.Utils: Deleting directory /tmp/spark-6402f582-0af7-414f-8427-90aaa7ef8749
Running org.apache.sysml.test.integration.applications.parfor.ParForCVMulticlassSVMTest
Tests run: 6, Failures: 0, Errors: 0, Skipped: 0, Time elapsed: 60.365 sec - in org.apache.sysml.test.integration.applications.parfor.ParForCVMulticlassSVMTest
Running org.apache.sysml.test.integration.applications.parfor.ParForUnivariateStatsTest
Tests run: 3, Failures: 0, Errors: 0, Skipped: 0, Time elapsed: 24.984 sec - in org.apache.sysml.test.integration.applications.parfor.ParForUnivariateStatsTest
Running org.apache.sysml.test.integration.functions.reorg.FullOrderTest
Tests run: 132, Failures: 0, Errors: 0, Skipped: 0, Time elapsed: 1,905.259 sec - in org.apache.sysml.test.integration.functions.reorg.FullOrderTest
Running org.apache.sysml.test.integration.functions.indexing.Jdk7IssueRightIndexingTest
Tests run: 8, Failures: 0, Errors: 0, Skipped: 0, Time elapsed: 677.405 sec - in org.apache.sysml.test.integration.functions.indexing.Jdk7IssueRightIndexingTest
Running org.apache.sysml.test.integration.applications.descriptivestats.UnivariateUnweightedScaleDenseTest
Tests run: 24, Failures: 0, Errors: 0, Skipped: 0, Time elapsed: 392.583 sec - in org.apache.sysml.test.integration.applications.descriptivestats.UnivariateUnweightedScaleDenseTest
Running org.apache.sysml.test.integration.applications.parfor.ParForCorrelationTest
Tests run: 12, Failures: 0, Errors: 0, Skipped: 0, Time elapsed: 287.645 sec - in org.apache.sysml.test.integration.applications.parfor.ParForCorrelationTest
Running org.apache.sysml.test.integration.applications.parfor.ParForCorrelationTestLarge
Tests run: 2, Failures: 0, Errors: 0, Skipped: 0, Time elapsed: 64.497 sec - in org.apache.sysml.test.integration.applications.parfor.ParForCorrelationTestLarge
Running org.apache.sysml.test.integration.functions.unary.matrix.RemoveEmptyTest
Tests run: 56, Failures: 0, Errors: 0, Skipped: 0, Time elapsed: 2,656.063 sec - in org.apache.sysml.test.integration.functions.unary.matrix.RemoveEmptyTest
Running org.apache.sysml.test.integration.functions.indexing.LeftIndexingTest
Tests run: 3, Failures: 0, Errors: 0, Skipped: 0, Time elapsed: 834.717 sec - in org.apache.sysml.test.integration.functions.indexing.LeftIndexingTest
Running org.apache.sysml.test.integration.applications.descriptivestats.UnivariateWeightedScaleDenseTest
Tests run: 24, Failures: 0, Errors: 0, Skipped: 0, Time elapsed: 406.717 sec - in org.apache.sysml.test.integration.applications.descriptivestats.UnivariateWeightedScaleDenseTest
Running org.apache.sysml.test.integration.applications.descriptivestats.UnivariateUnweightedScaleSparseTest
Tests run: 24, Failures: 0, Errors: 0, Skipped: 0, Time elapsed: 334.263 sec - in org.apache.sysml.test.integration.applications.descriptivestats.UnivariateUnweightedScaleSparseTest
Running org.apache.sysml.test.integration.applications.parfor.ParForNaiveBayesTest
Tests run: 10, Failures: 0, Errors: 0, Skipped: 0, Time elapsed: 647.928 sec - in org.apache.sysml.test.integration.applications.parfor.ParForNaiveBayesTest
Running org.apache.sysml.test.integration.applications.dml.HITSDMLTest
Tests run: 1, Failures: 0, Errors: 0, Skipped: 0, Time elapsed: 106.726 sec - in org.apache.sysml.test.integration.applications.dml.HITSDMLTest
Running org.apache.sysml.test.integration.applications.descriptivestats.UnivariateWeightedScaleSparseTest
Tests run: 24, Failures: 0, Errors: 0, Skipped: 0, Time elapsed: 359.144 sec - in org.apache.sysml.test.integration.applications.descriptivestats.UnivariateWeightedScaleSparseTest
Running org.apache.sysml.test.integration.functions.data.RandRuntimePlatformTest
Tests run: 71, Failures: 0, Errors: 0, Skipped: 0, Time elapsed: 2,526.243 sec - in org.apache.sysml.test.integration.functions.data.RandRuntimePlatformTest
Running org.apache.sysml.test.integration.applications.pydml.ArimaPyDMLTest
Tests run: 1, Failures: 0, Errors: 0, Skipped: 0, Time elapsed: 49.591 sec - in org.apache.sysml.test.integration.applications.pydml.ArimaPyDMLTest
Running org.apache.sysml.test.integration.applications.pydml.HITSPyDMLTest
Tests run: 1, Failures: 0, Errors: 0, Skipped: 0, Time elapsed: 77.429 sec - in org.apache.sysml.test.integration.applications.pydml.HITSPyDMLTest
Running org.apache.sysml.test.integration.applications.dml.LinearRegressionDMLTest
Tests run: 7, Failures: 0, Errors: 0, Skipped: 0, Time elapsed: 52.02 sec - in org.apache.sysml.test.integration.applications.dml.LinearRegressionDMLTest
Running org.apache.sysml.test.integration.applications.pydml.CsplineDSPyDMLTest
Tests run: 3, Failures: 0, Errors: 0, Skipped: 0, Time elapsed: 7.208 sec - in org.apache.sysml.test.integration.applications.pydml.CsplineDSPyDMLTest
Running org.apache.sysml.test.integration.applications.pydml.LinearLogRegPyDMLTest
Tests run: 7, Failures: 0, Errors: 0, Skipped: 0, Time elapsed: 88.727 sec - in org.apache.sysml.test.integration.applications.pydml.LinearLogRegPyDMLTest
Running org.apache.sysml.test.integration.applications.pydml.NaiveBayesPyDMLTest
Tests run: 6, Failures: 0, Errors: 0, Skipped: 0, Time elapsed: 82.283 sec - in org.apache.sysml.test.integration.applications.pydml.NaiveBayesPyDMLTest
Running org.apache.sysml.test.integration.applications.dml.CsplineCGDMLTest
Tests run: 3, Failures: 0, Errors: 0, Skipped: 0, Time elapsed: 22.225 sec - in org.apache.sysml.test.integration.applications.dml.CsplineCGDMLTest
Running org.apache.sysml.test.integration.applications.dml.L2SVMDMLTest
Tests run: 9, Failures: 0, Errors: 0, Skipped: 0, Time elapsed: 65.234 sec - in org.apache.sysml.test.integration.applications.dml.L2SVMDMLTest
Running org.apache.sysml.test.integration.applications.pydml.MDABivariateStatsPyDMLTest
Tests run: 4, Failures: 0, Errors: 0, Skipped: 0, Time elapsed: 297.312 sec - in org.apache.sysml.test.integration.applications.pydml.MDABivariateStatsPyDMLTest
Running org.apache.sysml.test.integration.applications.pydml.PageRankPyDMLTest
Tests run: 3, Failures: 0, Errors: 0, Skipped: 0, Time elapsed: 6.233 sec - in org.apache.sysml.test.integration.applications.pydml.PageRankPyDMLTest
Running org.apache.sysml.test.integration.applications.pydml.NaiveBayesParforPyDMLTest
Tests run: 6, Failures: 0, Errors: 0, Skipped: 0, Time elapsed: 82.395 sec - in org.apache.sysml.test.integration.applications.pydml.NaiveBayesParforPyDMLTest
Running org.apache.sysml.test.integration.applications.dml.NaiveBayesDMLTest
Tests run: 6, Failures: 0, Errors: 0, Skipped: 0, Time elapsed: 83.156 sec - in org.apache.sysml.test.integration.applications.dml.NaiveBayesDMLTest
Running org.apache.sysml.test.integration.applications.dml.MDABivariateStatsDMLTest
Tests run: 4, Failures: 0, Errors: 0, Skipped: 0, Time elapsed: 299.33 sec - in org.apache.sysml.test.integration.applications.dml.MDABivariateStatsDMLTest
Running org.apache.sysml.test.integration.applications.dml.PageRankDMLTest
Tests run: 3, Failures: 0, Errors: 0, Skipped: 0, Time elapsed: 6.169 sec - in org.apache.sysml.test.integration.applications.dml.PageRankDMLTest
Running org.apache.sysml.test.integration.applications.pydml.GLMPyDMLTest
Tests run: 30, Failures: 0, Errors: 0, Skipped: 0, Time elapsed: 604.306 sec - in org.apache.sysml.test.integration.applications.pydml.GLMPyDMLTest
Running org.apache.sysml.test.integration.applications.pydml.MultiClassSVMPyDMLTest
Tests run: 9, Failures: 0, Errors: 0, Skipped: 0, Time elapsed: 88.494 sec - in org.apache.sysml.test.integration.applications.pydml.MultiClassSVMPyDMLTest
Running org.apache.sysml.test.integration.applications.dml.ID3DMLTest
Tests run: 2, Failures: 0, Errors: 0, Skipped: 0, Time elapsed: 368.79 sec - in org.apache.sysml.test.integration.applications.dml.ID3DMLTest
Running org.apache.sysml.test.integration.applications.dml.GLMDMLTest
Tests run: 30, Failures: 0, Errors: 0, Skipped: 0, Time elapsed: 1,198.341 sec - in org.apache.sysml.test.integration.applications.dml.GLMDMLTest
Running org.apache.sysml.test.integration.applications.pydml.CsplineCGPyDMLTest
Tests run: 3, Failures: 0, Errors: 0, Skipped: 0, Time elapsed: 6.275 sec - in org.apache.sysml.test.integration.applications.pydml.CsplineCGPyDMLTest
Running org.apache.sysml.test.integration.applications.pydml.WelchTPyDMLTest
Tests run: 3, Failures: 0, Errors: 0, Skipped: 0, Time elapsed: 6.529 sec - in org.apache.sysml.test.integration.applications.pydml.WelchTPyDMLTest
Running org.apache.sysml.test.integration.applications.dml.MultiClassSVMDMLTest
Tests run: 9, Failures: 0, Errors: 0, Skipped: 0, Time elapsed: 88.027 sec - in org.apache.sysml.test.integration.applications.dml.MultiClassSVMDMLTest
Running org.apache.sysml.test.integration.applications.dml.CsplineDSDMLTest
Tests run: 3, Failures: 0, Errors: 0, Skipped: 0, Time elapsed: 23.285 sec - in org.apache.sysml.test.integration.applications.dml.CsplineDSDMLTest
Running org.apache.sysml.test.integration.applications.pydml.ApplyTransformPyDMLTest
Tests run: 7, Failures: 0, Errors: 0, Skipped: 0, Time elapsed: 1.231 sec - in org.apache.sysml.test.integration.applications.pydml.ApplyTransformPyDMLTest
Running org.apache.sysml.test.integration.applications.dml.NaiveBayesParforDMLTest
Tests run: 6, Failures: 0, Errors: 0, Skipped: 0, Time elapsed: 82.5 sec - in org.apache.sysml.test.integration.applications.dml.NaiveBayesParforDMLTest
Running org.apache.sysml.test.integration.applications.pydml.L2SVMPyDMLTest
Tests run: 9, Failures: 0, Errors: 0, Skipped: 0, Time elapsed: 65.33 sec - in org.apache.sysml.test.integration.applications.pydml.L2SVMPyDMLTest
Running org.apache.sysml.test.integration.applications.pydml.LinearRegressionPyDMLTest
Tests run: 7, Failures: 0, Errors: 0, Skipped: 0, Time elapsed: 52.543 sec - in org.apache.sysml.test.integration.applications.pydml.LinearRegressionPyDMLTest
Running org.apache.sysml.test.integration.applications.dml.LinearLogRegDMLTest
Tests run: 7, Failures: 0, Errors: 0, Skipped: 0, Time elapsed: 62.979 sec - in org.apache.sysml.test.integration.applications.dml.LinearLogRegDMLTest
Running org.apache.sysml.test.integration.applications.dml.GNMFDMLTest
Tests run: 3, Failures: 0, Errors: 0, Skipped: 0, Time elapsed: 82.163 sec - in org.apache.sysml.test.integration.applications.dml.GNMFDMLTest
Running org.apache.sysml.test.integration.applications.dml.WelchTDMLTest
Tests run: 3, Failures: 0, Errors: 0, Skipped: 0, Time elapsed: 6.561 sec - in org.apache.sysml.test.integration.applications.dml.WelchTDMLTest
Running org.apache.sysml.test.integration.applications.dml.ApplyTransformDMLTest
Tests run: 7, Failures: 0, Errors: 0, Skipped: 0, Time elapsed: 24.768 sec - in org.apache.sysml.test.integration.applications.dml.ApplyTransformDMLTest
Running org.apache.sysml.test.integration.applications.pydml.ID3PyDMLTest
Tests run: 2, Failures: 0, Errors: 0, Skipped: 0, Time elapsed: 328.045 sec - in org.apache.sysml.test.integration.applications.pydml.ID3PyDMLTest
Running org.apache.sysml.test.integration.applications.pydml.GNMFPyDMLTest
Tests run: 3, Failures: 0, Errors: 0, Skipped: 0, Time elapsed: 57.346 sec - in org.apache.sysml.test.integration.applications.pydml.GNMFPyDMLTest

Results :

Failed tests: 
  SparsityRecompileTest.testParForRecompile:124->runRecompileTest:156->AutomatedTestBase.runTest:1191
failed to run script ./src/test/scripts/functions/recompile/parfor_recompile_sparse.dml
exception: org.apache.sysml.api.DMLException: org.apache.sysml.runtime.DMLRuntimeException:
org.apache.sysml.runtime.DMLRuntimeException: PARFOR: Failed to execute loop in parallel.
message: org.apache.sysml.runtime.DMLRuntimeException: org.apache.sysml.runtime.DMLRuntimeException:
PARFOR: Failed to execute loop in parallel.
stack trace:
>org.apache.sysml.api.DMLScript.executeScript(DMLScript.java:350)
>org.apache.sysml.api.DMLScript.main(DMLScript.java:197)
>org.apache.sysml.test.integration.AutomatedTestBase.runTest(AutomatedTestBase.java:1171)
>org.apache.sysml.test.integration.functions.recompile.SparsityRecompileTest.runRecompileTest(SparsityRecompileTest.java:156)
>org.apache.sysml.test.integration.functions.recompile.SparsityRecompileTest.testParForRecompile(SparsityRecompileTest.java:124)
>sun.reflect.NativeMethodAccessorImpl.invoke0(Native Method)
>sun.reflect.NativeMethodAccessorImpl.invoke(NativeMethodAccessorImpl.java:62)
>sun.reflect.DelegatingMethodAccessorImpl.invoke(DelegatingMethodAccessorImpl.java:43)
>java.lang.reflect.Method.invoke(Method.java:497)
>org.junit.runners.model.FrameworkMethod$1.runReflectiveCall(FrameworkMethod.java:47)
>org.junit.internal.runners.model.ReflectiveCallable.run(ReflectiveCallable.java:12)
>org.junit.runners.model.FrameworkMethod.invokeExplosively(FrameworkMethod.java:44)
>org.junit.internal.runners.statements.InvokeMethod.evaluate(InvokeMethod.java:17)
>org.junit.internal.runners.statements.RunBefores.evaluate(RunBefores.java:26)
>org.junit.internal.runners.statements.RunAfters.evaluate(RunAfters.java:27)
>org.junit.runners.ParentRunner.runLeaf(ParentRunner.java:271)
>org.junit.runners.BlockJUnit4ClassRunner.runChild(BlockJUnit4ClassRunner.java:70)
>org.junit.runners.BlockJUnit4ClassRunner.runChild(BlockJUnit4ClassRunner.java:50)
>org.junit.runners.ParentRunner$3.run(ParentRunner.java:238)
>org.apache.maven.surefire.junitcore.pc.Scheduler$1.run(Scheduler.java:318)
>org.apache.maven.surefire.junitcore.pc.InvokerStrategy.schedule(InvokerStrategy.java:41)
>org.apache.maven.surefire.junitcore.pc.Scheduler.schedule(Scheduler.java:274)
>org.junit.runners.ParentRunner.runChildren(ParentRunner.java:236)
>org.junit.runners.ParentRunner.access$000(ParentRunner.java:53)
>org.junit.runners.ParentRunner$2.evaluate(ParentRunner.java:229)
>org.junit.runners.ParentRunner.run(ParentRunner.java:309)
>org.junit.runners.Suite.runChild(Suite.java:127)
>org.junit.runners.Suite.runChild(Suite.java:26)
>org.junit.runners.ParentRunner$3.run(ParentRunner.java:238)
>org.apache.maven.surefire.junitcore.pc.Scheduler$1.run(Scheduler.java:318)
>org.apache.maven.surefire.junitcore.pc.InvokerStrategy.schedule(InvokerStrategy.java:41)
>org.apache.maven.surefire.junitcore.pc.Scheduler.schedule(Scheduler.java:274)
>org.junit.runners.ParentRunner.runChildren(ParentRunner.java:236)
>org.junit.runners.ParentRunner.access$000(ParentRunner.java:53)
>org.junit.runners.ParentRunner$2.evaluate(ParentRunner.java:229)
>org.junit.runners.ParentRunner.run(ParentRunner.java:309)
>org.junit.runners.Suite.runChild(Suite.java:127)
>org.junit.runners.Suite.runChild(Suite.java:26)
>org.junit.runners.ParentRunner$3.run(ParentRunner.java:238)
>org.apache.maven.surefire.junitcore.pc.Scheduler$1.run(Scheduler.java:318)
>org.apache.maven.surefire.junitcore.pc.InvokerStrategy.schedule(InvokerStrategy.java:41)
>org.apache.maven.surefire.junitcore.pc.Scheduler.schedule(Scheduler.java:274)
>org.junit.runners.ParentRunner.runChildren(ParentRunner.java:236)
>org.junit.runners.ParentRunner.access$000(ParentRunner.java:53)
>org.junit.runners.ParentRunner$2.evaluate(ParentRunner.java:229)
>org.junit.runners.ParentRunner.run(ParentRunner.java:309)
>org.apache.maven.surefire.junitcore.pc.ParallelComputerBuilder$PC$2.run(ParallelComputerBuilder.java:491)
>org.junit.runner.JUnitCore.run(JUnitCore.java:160)
>org.junit.runner.JUnitCore.run(JUnitCore.java:138)
>org.apache.maven.surefire.junitcore.JUnitCoreWrapper.createRequestAndRun(JUnitCoreWrapper.java:113)
>org.apache.maven.surefire.junitcore.JUnitCoreWrapper.executeEager(JUnitCoreWrapper.java:85)
>org.apache.maven.surefire.junitcore.JUnitCoreWrapper.execute(JUnitCoreWrapper.java:54)
>org.apache.maven.surefire.junitcore.JUnitCoreProvider.invoke(JUnitCoreProvider.java:134)
>org.apache.maven.surefire.booter.ForkedBooter.invokeProviderInSameClassLoader(ForkedBooter.java:200)
>org.apache.maven.surefire.booter.ForkedBooter.runSuitesInProcess(ForkedBooter.java:153)
>org.apache.maven.surefire.booter.ForkedBooter.main(ForkedBooter.java:103)

Tests run: 4859, Failures: 1, Errors: 0, Skipped: 0

[INFO] 
[INFO] --- maven-failsafe-plugin:2.17:verify (default) @ systemml ---
[INFO] Failsafe report directory: <https://sparktc.ibmcloud.com/jenkins/job/SystemML-DailyTest/ws/target/failsafe-reports>
[INFO] ------------------------------------------------------------------------
[INFO] BUILD FAILURE
[INFO] ------------------------------------------------------------------------
[INFO] Total time: 02:58 h
[INFO] Finished at: 2016-04-01T15:33:25-07:00
[INFO] Final Memory: 64M/2442M
[INFO] ------------------------------------------------------------------------
[ERROR] Failed to execute goal org.apache.maven.plugins:maven-failsafe-plugin:2.17:verify
(default) on project systemml: There are test failures.
[ERROR] 
[ERROR] Please refer to <https://sparktc.ibmcloud.com/jenkins/job/SystemML-DailyTest/ws/target/failsafe-reports>
for the individual test results.
[ERROR] -> [Help 1]
[ERROR] 
[ERROR] To see the full stack trace of the errors, re-run Maven with the -e switch.
[ERROR] Re-run Maven using the -X switch to enable full debug logging.
[ERROR] 
[ERROR] For more information about the errors and possible solutions, please read the following
articles:
[ERROR] [Help 1] http://cwiki.apache.org/confluence/display/MAVEN/MojoFailureException
Build step 'Execute shell' marked build as failure
Run condition [Always] enabling perform for step [[]]

Mime
View raw message