systemml-dev mailing list archives

Site index · List index
Message view « Date » · « Thread »
Top « Date » · « Thread »
From jenk...@spark.tc
Subject Build failed in Jenkins: SystemML-DailyTest #170
Date Sat, 02 Apr 2016 21:51:59 GMT
See <https://sparktc.ibmcloud.com/jenkins/job/SystemML-DailyTest/170/>

------------------------------------------
[...truncated 1429 lines...]
Tests run: 2, Failures: 0, Errors: 0, Skipped: 0, Time elapsed: 84.792 sec - in org.apache.sysml.test.integration.functions.jmlc.SystemTMulticlassSVMScoreTest
Running org.apache.sysml.test.integration.functions.vect.AutoVectorizationTest
Tests run: 24, Failures: 0, Errors: 0, Skipped: 0, Time elapsed: 111.183 sec - in org.apache.sysml.test.integration.functions.vect.AutoVectorizationTest
Running org.apache.sysml.test.integration.functions.indexing.LeftIndexingSparseSparseTest
Tests run: 15, Failures: 0, Errors: 0, Skipped: 0, Time elapsed: 118.901 sec - in org.apache.sysml.test.integration.functions.indexing.LeftIndexingSparseSparseTest
16/04/02 15:39:20 INFO util.Utils: Shutdown hook called
16/04/02 15:39:20 INFO util.Utils: Deleting directory /tmp/spark-4038426c-a957-4716-aeee-7688f9fcb712
Running org.apache.sysml.test.integration.functions.reorg.MatrixReshapeTest
Tests run: 36, Failures: 0, Errors: 0, Skipped: 0, Time elapsed: 613.781 sec - in org.apache.sysml.test.integration.functions.reorg.MatrixReshapeTest
16/04/02 15:39:27 WARN util.NativeCodeLoader: Unable to load native-hadoop library for your
platform... using builtin-java classes where applicable
Running org.apache.sysml.test.integration.functions.indexing.RightIndexingVectorTest
Tests run: 3, Failures: 0, Errors: 0, Skipped: 0, Time elapsed: 92.865 sec - in org.apache.sysml.test.integration.functions.indexing.RightIndexingVectorTest
Running org.apache.sysml.test.integration.functions.transform.TransformTest
Tests run: 80, Failures: 0, Errors: 0, Skipped: 0, Time elapsed: 354.898 sec - in org.apache.sysml.test.integration.functions.transform.TransformTest
Running org.apache.sysml.test.integration.functions.indexing.RightIndexingMatrixTest
Tests run: 6, Failures: 0, Errors: 0, Skipped: 0, Time elapsed: 217.648 sec - in org.apache.sysml.test.integration.functions.indexing.RightIndexingMatrixTest
Running org.apache.sysml.test.integration.functions.quaternary.WeightedUnaryMatrixMultTest
Tests run: 26, Failures: 0, Errors: 0, Skipped: 0, Time elapsed: 555.557 sec - in org.apache.sysml.test.integration.functions.quaternary.WeightedUnaryMatrixMultTest
16/04/02 15:41:16 INFO util.Utils: Shutdown hook called
16/04/02 15:41:16 INFO util.Utils: Deleting directory /tmp/spark-1c980101-403a-4589-becc-648de929b98d
Running org.apache.sysml.test.integration.functions.quaternary.WeightedSquaredLossTest
Tests run: 55, Failures: 0, Errors: 0, Skipped: 0, Time elapsed: 831.447 sec - in org.apache.sysml.test.integration.functions.quaternary.WeightedSquaredLossTest
16/04/02 15:43:19 INFO util.Utils: Shutdown hook called
16/04/02 15:43:19 INFO util.Utils: Deleting directory /tmp/spark-3529d8ff-40d1-4bd5-80ca-b8fc690e9da0
Running org.apache.sysml.test.integration.functions.indexing.LeftIndexingScalarTest
Tests run: 3, Failures: 0, Errors: 0, Skipped: 0, Time elapsed: 246.501 sec - in org.apache.sysml.test.integration.functions.indexing.LeftIndexingScalarTest
Running org.apache.sysml.test.integration.functions.updateinplace.UpdateInPlaceTest
Tests run: 15, Failures: 0, Errors: 0, Skipped: 0, Time elapsed: 8.049 sec - in org.apache.sysml.test.integration.functions.updateinplace.UpdateInPlaceTest
Running org.apache.sysml.test.integration.functions.append.RBindCBindMatrixTest
Tests run: 12, Failures: 0, Errors: 0, Skipped: 0, Time elapsed: 145.899 sec - in org.apache.sysml.test.integration.functions.append.RBindCBindMatrixTest
Running org.apache.sysml.test.integration.functions.append.StringAppendTest
Tests run: 9, Failures: 0, Errors: 0, Skipped: 0, Time elapsed: 38.56 sec - in org.apache.sysml.test.integration.functions.append.StringAppendTest
Running org.apache.sysml.test.integration.applications.descriptivestats.BivariateCategoricalCategoricallTest
Tests run: 3, Failures: 0, Errors: 0, Skipped: 0, Time elapsed: 19.666 sec - in org.apache.sysml.test.integration.applications.descriptivestats.BivariateCategoricalCategoricallTest
Running org.apache.sysml.test.integration.functions.indexing.LeftIndexingSparseDenseTest
Tests run: 15, Failures: 0, Errors: 0, Skipped: 0, Time elapsed: 294.318 sec - in org.apache.sysml.test.integration.functions.indexing.LeftIndexingSparseDenseTest
16/04/02 15:44:22 INFO util.Utils: Shutdown hook called
16/04/02 15:44:22 INFO util.Utils: Deleting directory /tmp/spark-ea859c0c-8ce3-4fbc-a006-e5e80ebce66e
Running org.apache.sysml.test.integration.scalability.LinearRegressionTest
Tests run: 1, Failures: 0, Errors: 0, Skipped: 0, Time elapsed: 1.15 sec - in org.apache.sysml.test.integration.scalability.LinearRegressionTest
Running org.apache.sysml.test.integration.scalability.PageRankTest
Tests run: 1, Failures: 0, Errors: 0, Skipped: 0, Time elapsed: 1.397 sec - in org.apache.sysml.test.integration.scalability.PageRankTest
Running org.apache.sysml.test.integration.applications.descriptivestats.BivariateOrdinalOrdinalTest
Tests run: 2, Failures: 0, Errors: 0, Skipped: 0, Time elapsed: 8.458 sec - in org.apache.sysml.test.integration.applications.descriptivestats.BivariateOrdinalOrdinalTest
Running org.apache.sysml.test.integration.applications.parfor.ParForBivariateStatsTest
Tests run: 5, Failures: 0, Errors: 0, Skipped: 0, Time elapsed: 56.836 sec - in org.apache.sysml.test.integration.applications.parfor.ParForBivariateStatsTest
Running org.apache.sysml.test.integration.applications.descriptivestats.BivariateScaleCategoricalTest
Tests run: 2, Failures: 0, Errors: 0, Skipped: 0, Time elapsed: 8.762 sec - in org.apache.sysml.test.integration.applications.descriptivestats.BivariateScaleCategoricalTest
Running org.apache.sysml.test.integration.applications.descriptivestats.BivariateScaleScaleTest
Tests run: 2, Failures: 0, Errors: 0, Skipped: 0, Time elapsed: 8.84 sec - in org.apache.sysml.test.integration.applications.descriptivestats.BivariateScaleScaleTest
Running org.apache.sysml.test.integration.applications.descriptivestats.OrderStatisticsTest
Tests run: 1, Failures: 0, Errors: 0, Skipped: 0, Time elapsed: 0.289 sec - in org.apache.sysml.test.integration.applications.descriptivestats.OrderStatisticsTest
Running org.apache.sysml.test.integration.applications.descriptivestats.UnivariateCategoricalTest
Tests run: 2, Failures: 0, Errors: 0, Skipped: 0, Time elapsed: 9.173 sec - in org.apache.sysml.test.integration.applications.descriptivestats.UnivariateCategoricalTest
Running org.apache.sysml.test.integration.applications.parfor.ParForCVMulticlassSVMTest
Tests run: 6, Failures: 0, Errors: 0, Skipped: 0, Time elapsed: 33.05 sec - in org.apache.sysml.test.integration.applications.parfor.ParForCVMulticlassSVMTest
Running org.apache.sysml.test.integration.applications.dml.ArimaDMLTest
Tests run: 1, Failures: 0, Errors: 0, Skipped: 0, Time elapsed: 72.85 sec - in org.apache.sysml.test.integration.applications.dml.ArimaDMLTest
Running org.apache.sysml.test.integration.functions.append.AppendVectorTest
Tests run: 6, Failures: 0, Errors: 0, Skipped: 0, Time elapsed: 303.077 sec - in org.apache.sysml.test.integration.functions.append.AppendVectorTest
Running org.apache.sysml.test.integration.applications.parfor.ParForUnivariateStatsTest
Tests run: 3, Failures: 0, Errors: 0, Skipped: 0, Time elapsed: 13.753 sec - in org.apache.sysml.test.integration.applications.parfor.ParForUnivariateStatsTest
Running org.apache.sysml.test.integration.functions.indexing.Jdk7IssueRightIndexingTest
Tests run: 8, Failures: 0, Errors: 0, Skipped: 0, Time elapsed: 491.804 sec - in org.apache.sysml.test.integration.functions.indexing.Jdk7IssueRightIndexingTest
Running org.apache.sysml.test.integration.functions.quaternary.WeightedDivMatrixMultTest
Tests run: 90, Failures: 0, Errors: 0, Skipped: 0, Time elapsed: 1,131.283 sec - in org.apache.sysml.test.integration.functions.quaternary.WeightedDivMatrixMultTest
16/04/02 15:48:26 INFO util.Utils: Shutdown hook called
16/04/02 15:48:26 INFO util.Utils: Deleting directory /tmp/spark-2e247dc9-d0c7-4ecb-b4e6-46b57e74ab1a
Running org.apache.sysml.test.integration.functions.quaternary.WeightedSigmoidTest
Tests run: 56, Failures: 0, Errors: 0, Skipped: 0, Time elapsed: 992.316 sec - in org.apache.sysml.test.integration.functions.quaternary.WeightedSigmoidTest
16/04/02 15:49:26 INFO util.Utils: Shutdown hook called
16/04/02 15:49:26 INFO util.Utils: Deleting directory /tmp/spark-98fe8672-be15-40fd-a8f5-bb0524b95b4b
Running org.apache.sysml.test.integration.functions.indexing.LeftIndexingTest
Tests run: 3, Failures: 0, Errors: 0, Skipped: 0, Time elapsed: 657.611 sec - in org.apache.sysml.test.integration.functions.indexing.LeftIndexingTest
Running org.apache.sysml.test.integration.applications.parfor.ParForCorrelationTest
Tests run: 12, Failures: 0, Errors: 0, Skipped: 0, Time elapsed: 282.542 sec - in org.apache.sysml.test.integration.applications.parfor.ParForCorrelationTest
Running org.apache.sysml.test.integration.applications.descriptivestats.UnivariateUnweightedScaleDenseTest
Tests run: 24, Failures: 0, Errors: 0, Skipped: 0, Time elapsed: 335.135 sec - in org.apache.sysml.test.integration.applications.descriptivestats.UnivariateUnweightedScaleDenseTest
Running org.apache.sysml.test.integration.applications.parfor.ParForCorrelationTestLarge
Tests run: 2, Failures: 0, Errors: 0, Skipped: 0, Time elapsed: 44.774 sec - in org.apache.sysml.test.integration.applications.parfor.ParForCorrelationTestLarge
Running org.apache.sysml.test.integration.functions.reorg.FullOrderTest
Tests run: 132, Failures: 0, Errors: 0, Skipped: 0, Time elapsed: 1,355.768 sec - in org.apache.sysml.test.integration.functions.reorg.FullOrderTest
Running org.apache.sysml.test.integration.applications.descriptivestats.UnivariateWeightedScaleDenseTest
Tests run: 24, Failures: 0, Errors: 0, Skipped: 0, Time elapsed: 350.008 sec - in org.apache.sysml.test.integration.applications.descriptivestats.UnivariateWeightedScaleDenseTest
Running org.apache.sysml.test.integration.functions.append.AppendChainTest
Tests run: 12, Failures: 0, Errors: 0, Skipped: 0, Time elapsed: 1,056.524 sec - in org.apache.sysml.test.integration.functions.append.AppendChainTest
Running org.apache.sysml.test.integration.applications.parfor.ParForNaiveBayesTest
Tests run: 10, Failures: 0, Errors: 0, Skipped: 0, Time elapsed: 514.345 sec - in org.apache.sysml.test.integration.applications.parfor.ParForNaiveBayesTest
Running org.apache.sysml.test.integration.applications.descriptivestats.UnivariateUnweightedScaleSparseTest
Tests run: 24, Failures: 0, Errors: 0, Skipped: 0, Time elapsed: 263.607 sec - in org.apache.sysml.test.integration.applications.descriptivestats.UnivariateUnweightedScaleSparseTest
Running org.apache.sysml.test.integration.applications.dml.HITSDMLTest
Tests run: 1, Failures: 0, Errors: 0, Skipped: 0, Time elapsed: 92.596 sec - in org.apache.sysml.test.integration.applications.dml.HITSDMLTest
Running org.apache.sysml.test.integration.functions.append.AppendMatrixTest
Tests run: 22, Failures: 0, Errors: 0, Skipped: 0, Time elapsed: 1,458.513 sec - in org.apache.sysml.test.integration.functions.append.AppendMatrixTest
Running org.apache.sysml.test.integration.applications.descriptivestats.UnivariateWeightedScaleSparseTest
Tests run: 24, Failures: 0, Errors: 0, Skipped: 0, Time elapsed: 347.357 sec - in org.apache.sysml.test.integration.applications.descriptivestats.UnivariateWeightedScaleSparseTest
Running org.apache.sysml.test.integration.applications.pydml.ArimaPyDMLTest
Tests run: 1, Failures: 0, Errors: 0, Skipped: 0, Time elapsed: 49.736 sec - in org.apache.sysml.test.integration.applications.pydml.ArimaPyDMLTest
Running org.apache.sysml.test.integration.applications.pydml.HITSPyDMLTest
Tests run: 1, Failures: 0, Errors: 0, Skipped: 0, Time elapsed: 76.954 sec - in org.apache.sysml.test.integration.applications.pydml.HITSPyDMLTest
Running org.apache.sysml.test.integration.applications.dml.LinearRegressionDMLTest
Tests run: 7, Failures: 0, Errors: 0, Skipped: 0, Time elapsed: 51.413 sec - in org.apache.sysml.test.integration.applications.dml.LinearRegressionDMLTest
Running org.apache.sysml.test.integration.applications.pydml.CsplineDSPyDMLTest
Tests run: 3, Failures: 0, Errors: 0, Skipped: 0, Time elapsed: 6.859 sec - in org.apache.sysml.test.integration.applications.pydml.CsplineDSPyDMLTest
Running org.apache.sysml.test.integration.applications.pydml.LinearLogRegPyDMLTest
Tests run: 7, Failures: 0, Errors: 0, Skipped: 0, Time elapsed: 83.8 sec - in org.apache.sysml.test.integration.applications.pydml.LinearLogRegPyDMLTest
Running org.apache.sysml.test.integration.applications.pydml.NaiveBayesPyDMLTest
Tests run: 6, Failures: 0, Errors: 0, Skipped: 0, Time elapsed: 81.043 sec - in org.apache.sysml.test.integration.applications.pydml.NaiveBayesPyDMLTest
Running org.apache.sysml.test.integration.applications.dml.CsplineCGDMLTest
Tests run: 3, Failures: 0, Errors: 0, Skipped: 0, Time elapsed: 13.308 sec - in org.apache.sysml.test.integration.applications.dml.CsplineCGDMLTest
Running org.apache.sysml.test.integration.applications.dml.L2SVMDMLTest
Tests run: 9, Failures: 0, Errors: 0, Skipped: 0, Time elapsed: 64.822 sec - in org.apache.sysml.test.integration.applications.dml.L2SVMDMLTest
Running org.apache.sysml.test.integration.applications.pydml.MDABivariateStatsPyDMLTest
Tests run: 4, Failures: 0, Errors: 0, Skipped: 0, Time elapsed: 293.354 sec - in org.apache.sysml.test.integration.applications.pydml.MDABivariateStatsPyDMLTest
Running org.apache.sysml.test.integration.applications.pydml.PageRankPyDMLTest
Tests run: 3, Failures: 0, Errors: 0, Skipped: 0, Time elapsed: 6.391 sec - in org.apache.sysml.test.integration.applications.pydml.PageRankPyDMLTest
Running org.apache.sysml.test.integration.applications.pydml.NaiveBayesParforPyDMLTest
Tests run: 6, Failures: 0, Errors: 0, Skipped: 0, Time elapsed: 81.254 sec - in org.apache.sysml.test.integration.applications.pydml.NaiveBayesParforPyDMLTest
Running org.apache.sysml.test.integration.applications.dml.NaiveBayesDMLTest
Tests run: 6, Failures: 0, Errors: 0, Skipped: 0, Time elapsed: 81.954 sec - in org.apache.sysml.test.integration.applications.dml.NaiveBayesDMLTest
Running org.apache.sysml.test.integration.applications.dml.MDABivariateStatsDMLTest
Tests run: 4, Failures: 0, Errors: 0, Skipped: 0, Time elapsed: 295.544 sec - in org.apache.sysml.test.integration.applications.dml.MDABivariateStatsDMLTest
Running org.apache.sysml.test.integration.applications.dml.PageRankDMLTest
Tests run: 3, Failures: 0, Errors: 0, Skipped: 0, Time elapsed: 6.381 sec - in org.apache.sysml.test.integration.applications.dml.PageRankDMLTest
Running org.apache.sysml.test.integration.applications.pydml.GLMPyDMLTest
Tests run: 30, Failures: 0, Errors: 0, Skipped: 0, Time elapsed: 586.044 sec - in org.apache.sysml.test.integration.applications.pydml.GLMPyDMLTest
Running org.apache.sysml.test.integration.applications.pydml.MultiClassSVMPyDMLTest
Tests run: 9, Failures: 0, Errors: 0, Skipped: 0, Time elapsed: 88.798 sec - in org.apache.sysml.test.integration.applications.pydml.MultiClassSVMPyDMLTest
Running org.apache.sysml.test.integration.applications.dml.ID3DMLTest
Tests run: 2, Failures: 0, Errors: 0, Skipped: 0, Time elapsed: 365.284 sec - in org.apache.sysml.test.integration.applications.dml.ID3DMLTest
Running org.apache.sysml.test.integration.applications.dml.GLMDMLTest
Tests run: 30, Failures: 0, Errors: 0, Skipped: 0, Time elapsed: 853.589 sec - in org.apache.sysml.test.integration.applications.dml.GLMDMLTest
Running org.apache.sysml.test.integration.applications.pydml.CsplineCGPyDMLTest
Tests run: 3, Failures: 0, Errors: 0, Skipped: 0, Time elapsed: 6.225 sec - in org.apache.sysml.test.integration.applications.pydml.CsplineCGPyDMLTest
Running org.apache.sysml.test.integration.applications.pydml.WelchTPyDMLTest
Tests run: 3, Failures: 0, Errors: 0, Skipped: 0, Time elapsed: 6.629 sec - in org.apache.sysml.test.integration.applications.pydml.WelchTPyDMLTest
Running org.apache.sysml.test.integration.applications.dml.MultiClassSVMDMLTest
Tests run: 9, Failures: 0, Errors: 0, Skipped: 0, Time elapsed: 88.008 sec - in org.apache.sysml.test.integration.applications.dml.MultiClassSVMDMLTest
Running org.apache.sysml.test.integration.applications.dml.CsplineDSDMLTest
Tests run: 3, Failures: 0, Errors: 0, Skipped: 0, Time elapsed: 12.262 sec - in org.apache.sysml.test.integration.applications.dml.CsplineDSDMLTest
Running org.apache.sysml.test.integration.applications.pydml.ApplyTransformPyDMLTest
Tests run: 7, Failures: 0, Errors: 0, Skipped: 0, Time elapsed: 1.251 sec - in org.apache.sysml.test.integration.applications.pydml.ApplyTransformPyDMLTest
Running org.apache.sysml.test.integration.applications.dml.NaiveBayesParforDMLTest
Tests run: 6, Failures: 0, Errors: 0, Skipped: 0, Time elapsed: 82.143 sec - in org.apache.sysml.test.integration.applications.dml.NaiveBayesParforDMLTest
Running org.apache.sysml.test.integration.applications.pydml.L2SVMPyDMLTest
Tests run: 9, Failures: 0, Errors: 0, Skipped: 0, Time elapsed: 65.809 sec - in org.apache.sysml.test.integration.applications.pydml.L2SVMPyDMLTest
Running org.apache.sysml.test.integration.applications.pydml.LinearRegressionPyDMLTest
Tests run: 7, Failures: 0, Errors: 0, Skipped: 0, Time elapsed: 51.518 sec - in org.apache.sysml.test.integration.applications.pydml.LinearRegressionPyDMLTest
Running org.apache.sysml.test.integration.applications.dml.LinearLogRegDMLTest
Tests run: 7, Failures: 0, Errors: 0, Skipped: 0, Time elapsed: 61.521 sec - in org.apache.sysml.test.integration.applications.dml.LinearLogRegDMLTest
Running org.apache.sysml.test.integration.applications.dml.GNMFDMLTest
Tests run: 3, Failures: 0, Errors: 0, Skipped: 0, Time elapsed: 61.158 sec - in org.apache.sysml.test.integration.applications.dml.GNMFDMLTest
Running org.apache.sysml.test.integration.applications.dml.WelchTDMLTest
Tests run: 3, Failures: 0, Errors: 0, Skipped: 0, Time elapsed: 6.616 sec - in org.apache.sysml.test.integration.applications.dml.WelchTDMLTest
Running org.apache.sysml.test.integration.applications.dml.ApplyTransformDMLTest
Tests run: 7, Failures: 0, Errors: 0, Skipped: 0, Time elapsed: 10.953 sec - in org.apache.sysml.test.integration.applications.dml.ApplyTransformDMLTest
Running org.apache.sysml.test.integration.applications.pydml.ID3PyDMLTest
Tests run: 2, Failures: 0, Errors: 0, Skipped: 0, Time elapsed: 328.701 sec - in org.apache.sysml.test.integration.applications.pydml.ID3PyDMLTest
Running org.apache.sysml.test.integration.applications.pydml.GNMFPyDMLTest
Tests run: 3, Failures: 0, Errors: 0, Skipped: 0, Time elapsed: 57.567 sec - in org.apache.sysml.test.integration.applications.pydml.GNMFPyDMLTest

Results :

Failed tests: 
  SparsityFunctionRecompileTest.testParForRecompileNoIPA:158->runRecompileTest:196->AutomatedTestBase.runTest:1191
failed to run script ./src/test/scripts/functions/recompile/parfor_recompile_func_sparse.dml
exception: org.apache.sysml.api.DMLException: org.apache.sysml.runtime.DMLRuntimeException:
org.apache.sysml.runtime.DMLRuntimeException: ERROR: Runtime error in program block generated
from statement block between lines 49 and 49 -- Error evaluating instruction: CP°extfunct°.defaultNS°foo1°1°1°V·MATRIX·DOUBLE°V
message: org.apache.sysml.runtime.DMLRuntimeException: org.apache.sysml.runtime.DMLRuntimeException:
ERROR: Runtime error in program block generated from statement block between lines 49 and
49 -- Error evaluating instruction: CP°extfunct°.defaultNS°foo1°1°1°V·MATRIX·DOUBLE°V
stack trace:
>org.apache.sysml.api.DMLScript.executeScript(DMLScript.java:350)
>org.apache.sysml.api.DMLScript.main(DMLScript.java:197)
>org.apache.sysml.test.integration.AutomatedTestBase.runTest(AutomatedTestBase.java:1171)
>org.apache.sysml.test.integration.functions.recompile.SparsityFunctionRecompileTest.runRecompileTest(SparsityFunctionRecompileTest.java:196)
>org.apache.sysml.test.integration.functions.recompile.SparsityFunctionRecompileTest.testParForRecompileNoIPA(SparsityFunctionRecompileTest.java:158)
>sun.reflect.NativeMethodAccessorImpl.invoke0(Native Method)
>sun.reflect.NativeMethodAccessorImpl.invoke(NativeMethodAccessorImpl.java:62)
>sun.reflect.DelegatingMethodAccessorImpl.invoke(DelegatingMethodAccessorImpl.java:43)
>java.lang.reflect.Method.invoke(Method.java:497)
>org.junit.runners.model.FrameworkMethod$1.runReflectiveCall(FrameworkMethod.java:47)
>org.junit.internal.runners.model.ReflectiveCallable.run(ReflectiveCallable.java:12)
>org.junit.runners.model.FrameworkMethod.invokeExplosively(FrameworkMethod.java:44)
>org.junit.internal.runners.statements.InvokeMethod.evaluate(InvokeMethod.java:17)
>org.junit.internal.runners.statements.RunBefores.evaluate(RunBefores.java:26)
>org.junit.internal.runners.statements.RunAfters.evaluate(RunAfters.java:27)
>org.junit.runners.ParentRunner.runLeaf(ParentRunner.java:271)
>org.junit.runners.BlockJUnit4ClassRunner.runChild(BlockJUnit4ClassRunner.java:70)
>org.junit.runners.BlockJUnit4ClassRunner.runChild(BlockJUnit4ClassRunner.java:50)
>org.junit.runners.ParentRunner$3.run(ParentRunner.java:238)
>org.apache.maven.surefire.junitcore.pc.Scheduler$1.run(Scheduler.java:318)
>org.apache.maven.surefire.junitcore.pc.InvokerStrategy.schedule(InvokerStrategy.java:41)
>org.apache.maven.surefire.junitcore.pc.Scheduler.schedule(Scheduler.java:274)
>org.junit.runners.ParentRunner.runChildren(ParentRunner.java:236)
>org.junit.runners.ParentRunner.access$000(ParentRunner.java:53)
>org.junit.runners.ParentRunner$2.evaluate(ParentRunner.java:229)
>org.junit.runners.ParentRunner.run(ParentRunner.java:309)
>org.junit.runners.Suite.runChild(Suite.java:127)
>org.junit.runners.Suite.runChild(Suite.java:26)
>org.junit.runners.ParentRunner$3.run(ParentRunner.java:238)
>org.apache.maven.surefire.junitcore.pc.Scheduler$1.run(Scheduler.java:318)
>org.apache.maven.surefire.junitcore.pc.InvokerStrategy.schedule(InvokerStrategy.java:41)
>org.apache.maven.surefire.junitcore.pc.Scheduler.schedule(Scheduler.java:274)
>org.junit.runners.ParentRunner.runChildren(ParentRunner.java:236)
>org.junit.runners.ParentRunner.access$000(ParentRunner.java:53)
>org.junit.runners.ParentRunner$2.evaluate(ParentRunner.java:229)
>org.junit.runners.ParentRunner.run(ParentRunner.java:309)
>org.junit.runners.Suite.runChild(Suite.java:127)
>org.junit.runners.Suite.runChild(Suite.java:26)
>org.junit.runners.ParentRunner$3.run(ParentRunner.java:238)
>org.apache.maven.surefire.junitcore.pc.Scheduler$1.run(Scheduler.java:318)
>org.apache.maven.surefire.junitcore.pc.InvokerStrategy.schedule(InvokerStrategy.java:41)
>org.apache.maven.surefire.junitcore.pc.Scheduler.schedule(Scheduler.java:274)
>org.junit.runners.ParentRunner.runChildren(ParentRunner.java:236)
>org.junit.runners.ParentRunner.access$000(ParentRunner.java:53)
>org.junit.runners.ParentRunner$2.evaluate(ParentRunner.java:229)
>org.junit.runners.ParentRunner.run(ParentRunner.java:309)
>org.apache.maven.surefire.junitcore.pc.ParallelComputerBuilder$PC$2.run(ParallelComputerBuilder.java:491)
>org.junit.runner.JUnitCore.run(JUnitCore.java:160)
>org.junit.runner.JUnitCore.run(JUnitCore.java:138)
>org.apache.maven.surefire.junitcore.JUnitCoreWrapper.createRequestAndRun(JUnitCoreWrapper.java:113)
>org.apache.maven.surefire.junitcore.JUnitCoreWrapper.executeEager(JUnitCoreWrapper.java:85)
>org.apache.maven.surefire.junitcore.JUnitCoreWrapper.execute(JUnitCoreWrapper.java:54)
>org.apache.maven.surefire.junitcore.JUnitCoreProvider.invoke(JUnitCoreProvider.java:134)
>org.apache.maven.surefire.booter.ForkedBooter.invokeProviderInSameClassLoader(ForkedBooter.java:200)
>org.apache.maven.surefire.booter.ForkedBooter.runSuitesInProcess(ForkedBooter.java:153)
>org.apache.maven.surefire.booter.ForkedBooter.main(ForkedBooter.java:103)

Tests run: 4859, Failures: 1, Errors: 0, Skipped: 0

[INFO] 
[INFO] --- maven-failsafe-plugin:2.17:verify (default) @ systemml ---
[INFO] Failsafe report directory: <https://sparktc.ibmcloud.com/jenkins/job/SystemML-DailyTest/ws/target/failsafe-reports>
[INFO] ------------------------------------------------------------------------
[INFO] BUILD FAILURE
[INFO] ------------------------------------------------------------------------
[INFO] Total time: 02:16 h
[INFO] Finished at: 2016-04-02T16:51:59-05:00
[INFO] Final Memory: 59M/2501M
[INFO] ------------------------------------------------------------------------
[ERROR] Failed to execute goal org.apache.maven.plugins:maven-failsafe-plugin:2.17:verify
(default) on project systemml: There are test failures.
[ERROR] 
[ERROR] Please refer to <https://sparktc.ibmcloud.com/jenkins/job/SystemML-DailyTest/ws/target/failsafe-reports>
for the individual test results.
[ERROR] -> [Help 1]
[ERROR] 
[ERROR] To see the full stack trace of the errors, re-run Maven with the -e switch.
[ERROR] Re-run Maven using the -X switch to enable full debug logging.
[ERROR] 
[ERROR] For more information about the errors and possible solutions, please read the following
articles:
[ERROR] [Help 1] http://cwiki.apache.org/confluence/display/MAVEN/MojoFailureException
Build step 'Execute shell' marked build as failure
Run condition [Always] enabling perform for step [[]]

Mime
View raw message