systemml-dev mailing list archives

Site index · List index
Message view « Date » · « Thread »
Top « Date » · « Thread »
Subject Build failed in Jenkins: SystemML-DailyTest #252
Date Thu, 12 May 2016 19:35:20 GMT
See <>


[Deron Eriksson] [SYSTEMML-682] Update LICENSE and NOTICE for in-memory jar

[mwdusenb] [SYSTEMML-654] Support DML functions override built-in functions

[Deron Eriksson] [SYSTEMML-684] Update LICENSE and NOTICE for standalone jar

[...truncated 226 lines...]
[INFO] Copying spire_2.10-0.7.4.jar to <>
[INFO] Copying parquet-jackson-1.6.0rc3.jar to <>
[INFO] Copying config-1.2.1.jar to <>
[INFO] Copying ivy-2.4.0.jar to <>
[INFO] Copying javax.inject-1.jar to <>
[INFO] Copying commons-beanutils-core-1.8.0.jar to <>
[INFO] Copying hadoop-mapreduce-client-jobclient-2.4.1.jar to <>
[INFO] Copying stax-api-1.0-2.jar to <>
[INFO] Copying jetty-6.1.26.jar to <>
[INFO] Copying scala-actors-2.10.5.jar to <>
[INFO] Copying org.abego.treelayout.core-1.0.1.jar to <>
[INFO] Copying spark-streaming_2.10-1.4.1.jar to <>
[INFO] Copying jsch-0.1.42.jar to <>
[INFO] Copying spark-core_2.10-1.4.1.jar to <>
[INFO] Copying oro-2.0.8.jar to <>
[INFO] Copying pmml-agent-1.1.15.jar to <>
[INFO] Copying jackson-core-asl-1.8.8.jar to <>
[INFO] Copying chill_2.10-0.5.0.jar to <>
[INFO] Copying opencsv-1.8.jar to <>
[INFO] Copying stax-api-1.0.1.jar to <>
[INFO] Copying pmml-model-1.1.15.jar to <>
[INFO] Copying tachyon-0.6.4.jar to <>
[INFO] Copying scala-reflect-2.10.5.jar to <>
[INFO] Copying hadoop-yarn-api-2.4.1.jar to <>
[INFO] Copying commons-daemon-1.0.13.jar to <>
[INFO] Copying scalatest_2.10-2.2.1.jar to <>
[INFO] Copying jackson-xc-1.8.3.jar to <>
[INFO] Copying curator-client-2.4.0.jar to <>
[INFO] Copying hadoop-yarn-server-common-2.4.1.jar to <>
[INFO] Copying commons-compress-1.4.1.jar to <>
[INFO] Copying hadoop-mapreduce-client-app-2.4.1.jar to <>
[INFO] Copying tachyon-client-0.6.4.jar to <>
[INFO] Copying mail-1.4.jar to <>
[INFO] Copying commons-math3-3.1.1.jar to <>
[INFO] Copying json4s-core_2.10-3.2.10.jar to <>
[INFO] Copying tools.jar to <>
[INFO] Copying parquet-generator-1.6.0rc3.jar to <>
[INFO] Copying hadoop-yarn-common-2.4.1.jar to <>
[INFO] Copying core-1.1.2.jar to <>
[INFO] Copying jetty-util-6.1.26.jar to <>
[INFO] Copying jackson-core-2.4.4.jar to <>
[INFO] Copying test-interface-1.0.jar to <>
[INFO] Copying snappy-java- to <>
[INFO] Copying hamcrest-core-1.3.jar to <>
[INFO] Copying uncommons-maths-1.2.2a.jar to <>
[INFO] Copying jsp-api-2.1.jar to <>
[INFO] Copying jersey-server-1.9.jar to <>
[INFO] Copying pyrolite-4.4.jar to <>
[INFO] Copying compress-lzf-1.0.3.jar to <>
[INFO] Copying xmlenc-0.52.jar to <>
[INFO] Copying zookeeper-3.4.5.jar to <>
[INFO] Copying jasper-runtime-5.5.23.jar to <>
[INFO] Copying hadoop-hdfs-2.4.1.jar to <>
[INFO] Copying antlr4-runtime-4.3.jar to <>
[INFO] Copying curator-framework-2.4.0.jar to <>
[INFO] Copying jodd-core-3.6.3.jar to <>
[INFO] Copying commons-net-2.2.jar to <>
[INFO] Copying json4s-ast_2.10-3.2.10.jar to <>
[INFO] Copying commons-lang3-3.3.2.jar to <>
[INFO] Copying py4j- to <>
[INFO] Copying stream-2.7.0.jar to <>
[INFO] Copying hadoop-mapreduce-client-shuffle-2.4.1.jar to <>
[INFO] Copying slf4j-api-1.7.10.jar to <>
[INFO] Copying paranamer-2.6.jar to <>
[INFO] Copying objenesis-1.0.jar to <>
[INFO] Copying breeze-macros_2.10-0.11.2.jar to <>
[INFO] Copying commons-configuration-1.6.jar to <>
[INFO] Copying commons-digester-1.8.jar to <>
[INFO] Copying commons-beanutils-1.7.0.jar to <>
[INFO] Copying parquet-format-2.2.0-rc1.jar to <>
[INFO] Copying commons-collections-3.2.1.jar to <>
[INFO] Copying junit-4.11.jar to <>
[INFO] Copying hadoop-annotations-2.4.1.jar to <>
[INFO] Copying mockito-core-1.9.5.jar to <>
[INFO] Copying pmml-schema-1.1.15.jar to <>
[INFO] Copying spark-mllib_2.10-1.4.1.jar to <>
[INFO] Copying metrics-json-3.1.0.jar to <>
[INFO] Copying jaxb-impl-2.2.7.jar to <>
[INFO] Copying scala-library-2.10.5.jar to <>
[INFO] Copying hadoop-yarn-server-web-proxy-2.4.1.jar to <>
[INFO] Copying jcl-over-slf4j-1.7.10.jar to <>
[INFO] Copying metrics-core-3.1.0.jar to <>
[INFO] Copying spark-catalyst_2.10-1.4.1.jar to <>
[INFO] Copying commons-cli-1.2.jar to <>
[INFO] Copying lz4-1.2.0.jar to <>
[INFO] Copying jaxb-core-2.2.7.jar to <>
[INFO] Copying httpclient-4.2.5.jar to <>
[INFO] Copying unused-1.0.0.jar to <>
[INFO] Copying parquet-encoding-1.6.0rc3.jar to <>
[INFO] Copying RoaringBitmap-0.4.5.jar to <>
[INFO] Copying reflectasm-1.07-shaded.jar to <>
[INFO] Copying scalap-2.10.5.jar to <>
[INFO] Copying chill-java-0.5.0.jar to <>
[INFO] Copying jettison-1.1.jar to <>
[INFO] Copying antlr4-4.3.jar to <>
[INFO] Copying akka-actor_2.10-2.3.4-spark.jar to <>
[INFO] Copying guice-servlet-3.0.jar to <>
[INFO] Copying netty-all-4.0.23.Final.jar to <>
[INFO] Copying parquet-hadoop-1.6.0rc3.jar to <>
[INFO] Copying jackson-module-scala_2.10-2.4.4.jar to <>
[INFO] Copying akka-slf4j_2.10-2.3.4-spark.jar to <>
[INFO] Copying hadoop-yarn-server-nodemanager-2.4.1.jar to <>
[INFO] Copying spark-network-common_2.10-1.4.1.jar to <>
[INFO] Copying avro-1.7.4.jar to <>
[INFO] Copying netty-3.6.2.Final.jar to <>
[INFO] Copying commons-httpclient-3.1.jar to <>
[INFO] Copying breeze_2.10-0.11.2.jar to <>
[INFO] --- maven-resources-plugin:2.4:copy-resources (copy-resources) @ systemml ---
[INFO] Using 'UTF-8' encoding to copy filtered resources.
[INFO] Copying 7 resources
[INFO] --- build-helper-maven-plugin:1.8:add-test-source (add-test-source) @ systemml ---
[INFO] Test Source directory: <>
[INFO] --- maven-resources-plugin:2.4:testResources (default-testResources) @ systemml ---
[INFO] Using 'UTF-8' encoding to copy filtered resources.
[INFO] Copying 1 resource
[INFO] Copying 4 resources
[INFO] --- scala-maven-plugin:3.2.2:testCompile (scala-test-compile-first) @ systemml ---
[WARNING]  Expected all dependencies to require Scala version: 2.10.5
[WARNING]  com.twitter:chill_2.10:0.5.0 requires scala version: 2.10.4
[WARNING] Multiple versions of scala libraries detected!
[INFO] <>:-1:
info: compiling
[INFO] <>:-1:
info: compiling
[INFO] <>:-1:
info: compiling
[INFO] Compiling 423 source files to <>
at 1463081698839
[INFO] prepare-compile in 0 s
[INFO] compile in 8 s
[INFO] --- maven-compiler-plugin:3.2:testCompile (default-testCompile) @ systemml ---
[INFO] Changes detected - recompiling the module!
[INFO] Compiling 420 source files to <>
[INFO] --- maven-surefire-plugin:2.18:test (default-test) @ systemml ---
[INFO] Surefire report directory: <>

 T E S T S

Results :

Tests run: 0, Failures: 0, Errors: 0, Skipped: 0

[JENKINS] Recording test results
[INFO] --- maven-jar-plugin:2.4:jar (default-jar) @ systemml ---
[INFO] Building jar: <>
[INFO] --- maven-dependency-plugin:2.4:unpack (unpack) @ systemml ---
[INFO] Configured Artifact: org.apache.hadoop:hadoop-test:1.2.1:jar
[INFO] Unpacking /home/jenkins/.m2/repository/org/apache/hadoop/hadoop-test/1.2.1/hadoop-test-1.2.1.jar
to <>
with includes "**/*" and excludes ""
[INFO] --- maven-shade-plugin:2.3:shade (default) @ systemml ---
[INFO] Including in the shaded jar.
[INFO] Including org.apache.wink:wink-json4j:jar:1.4 in the shaded jar.
[INFO] Including org.antlr:antlr4-annotations:jar:4.3 in the shaded jar.
[INFO] Including org.antlr:antlr4-runtime:jar:4.3 in the shaded jar.
[INFO] Including org.abego.treelayout:org.abego.treelayout.core:jar:1.0.1 in the shaded jar.
[INFO] Replacing original artifact with shaded artifact.
[INFO] Replacing <>
with <>
[INFO] Dependency-reduced POM written at: <>
[INFO] Dependency-reduced POM written at: <>
[INFO] Dependency-reduced POM written at: <>
[INFO] Dependency-reduced POM written at: <>
[INFO] Dependency-reduced POM written at: <>
[INFO] Dependency-reduced POM written at: <>
[INFO] Dependency-reduced POM written at: <>
[INFO] Dependency-reduced POM written at: <>
[INFO] Dependency-reduced POM written at: <>
[INFO] --- maven-clean-plugin:3.0.0:clean (clean-original-jar) @ systemml ---
[INFO] Deleting <>
(includes = [original-*.jar], excludes = [])
[INFO] --- maven-antrun-plugin:1.8:run (copy) @ systemml ---
[INFO] Executing tasks

copy and rename JAR:
     [copy] Copying 1 file to <>
[INFO] Executed tasks
[INFO] --- apache-rat-plugin:0.11:check (default) @ systemml ---
[INFO] 51 implicit excludes (use -debug for more details).
[INFO] Exclude: .gitignore
[INFO] Exclude: .repository/
[INFO] Exclude: .idea/
[INFO] Exclude: .git
[INFO] Exclude: .settings
[INFO] Exclude: .classpath
[INFO] Exclude: .project
[INFO] Exclude: docs
[INFO] Exclude: **/docs/**
[INFO] Exclude: **/*.csv
[INFO] Exclude: **/*.json
[INFO] Exclude: **/*.mtx
[INFO] Exclude: **/*.mtd
[INFO] Exclude: **/target/**
[INFO] Exclude: **/
[INFO] Exclude: samples/jupyter-notebooks/*.ipynb
[INFO] Exclude: src/main/java/*.tokens
[INFO] Exclude: src/test/scripts/functions/external/kMeans/kMeansWrapperOutput
[INFO] Exclude: src/test/scripts/functions/external/kMeans2/kMeansWrapperOutput1
[INFO] Exclude: src/test/scripts/functions/external/kMeans2/kMeansWrapperOutput2
[INFO] Exclude: src/test/scripts/functions/external/seqMiner/FreqSeqFile
[INFO] Exclude: src/test/scripts/functions/external/seqMiner/FreqSeqSupportFile
[INFO] Exclude: src/test/scripts/functions/io/csv/in/
[INFO] Exclude: src/test/scripts/functions/io/csv/in/
[INFO] Exclude: src/test/scripts/functions/io/csv/in/
[INFO] Exclude: src/test/scripts/functions/io/csv/in/
[INFO] Exclude: src/test/scripts/functions/io/csv/in/
[INFO] Exclude: src/test/scripts/functions/io/csv/in/
[INFO] Exclude: src/test/scripts/functions/io/csv/in/
[INFO] Exclude: src/test/scripts/functions/io/csv/in/
[INFO] Exclude: src/test/scripts/functions/jmlc/**/*.impute
[INFO] Exclude: src/test/scripts/functions/jmlc/**/*.map
[INFO] Exclude: src/test/scripts/functions/jmlc/**/*.mode
[INFO] Exclude: src/test/scripts/functions/jmlc/**/*.ndistinct
[INFO] Exclude: src/test/scripts/functions/jmlc/**/*.node
[INFO] Exclude: src/test/scripts/functions/jmlc/tfmtd_example/Bin/saleprice.bin
[INFO] Exclude: src/test/scripts/functions/jmlc/tfmtd_example/Bin/sqft.bin
[INFO] Exclude: src/test/scripts/functions/jmlc/tfmtd_example/column.names
[INFO] Exclude: src/test/scripts/functions/jmlc/tfmtd_example/dummycoded.column.names
[INFO] Exclude: src/test/scripts/functions/jmlc/tfmtd_frame_example/tfmtd_frame
[INFO] Exclude: src/test/scripts/functions/transform/input/homes/homesNAN.csv.colnames
[INFO] 2675 resources included (use -debug for more details)
[INFO] Rat check: Summary of files. Unapproved: 2 unknown: 2 generated: 0 approved: 2651 licence.
[INFO] ------------------------------------------------------------------------
[INFO] ------------------------------------------------------------------------
[INFO] Total time: 53.753 s
[INFO] Finished at: 2016-05-12T14:35:18-05:00
[INFO] Final Memory: 104M/2998M
[INFO] ------------------------------------------------------------------------
[ERROR] Failed to execute goal org.apache.rat:apache-rat-plugin:0.11:check (default) on project
systemml: Too many files with unapproved license: 2 See RAT report in: <>
-> [Help 1]
[ERROR] To see the full stack trace of the errors, re-run Maven with the -e switch.
[ERROR] Re-run Maven using the -X switch to enable full debug logging.
[ERROR] For more information about the errors and possible solutions, please read the following
[ERROR] [Help 1]
[JENKINS] Archiving <>
to org.apache.systemml/systemml/0.10.0-incubating-SNAPSHOT/systemml-0.10.0-incubating-SNAPSHOT.pom
[JENKINS] Archiving <>
to org.apache.systemml/systemml/0.10.0-incubating-SNAPSHOT/systemml-0.10.0-incubating-SNAPSHOT.jar
channel stopped
Run condition [Always] enabling perform for step [[]]

View raw message