systemml-dev mailing list archives

Site index · List index
Message view « Date » · « Thread »
Top « Date » · « Thread »
From jenk...@spark.tc
Subject Build failed in Jenkins: SystemML-DailyTest #237
Date Thu, 05 May 2016 09:48:18 GMT
See <https://sparktc.ibmcloud.com/jenkins/job/SystemML-DailyTest/237/changes>

Changes:

[Deron Eriksson] Delete obsolete Zeppelin tar.gz example

[Deron Eriksson] [SYSTEMML-647] Replace castAsScalar calls

------------------------------------------
[...truncated 1422 lines...]
    D-DML<->D-R # stored values in D-DML: 470374
    D-DML<->D-R identical values(z=0): 470327
    D-DML<->D-R wrong values(z=1.0E-10): 0
    D-DML<->D-R min error: 0.0
    D-DML<->D-R max error: 1.4210854715202004E-14

	at org.junit.Assert.fail(Assert.java:88)
	at org.junit.Assert.assertTrue(Assert.java:41)
	at org.apache.sysml.test.utils.TestUtils.displayAssertionBuffer(TestUtils.java:963)
	at org.apache.sysml.test.integration.AutomatedTestBase.tearDown(AutomatedTestBase.java:1408)
	at sun.reflect.NativeMethodAccessorImpl.invoke0(Native Method)
	at sun.reflect.NativeMethodAccessorImpl.invoke(NativeMethodAccessorImpl.java:62)
	at sun.reflect.DelegatingMethodAccessorImpl.invoke(DelegatingMethodAccessorImpl.java:43)
	at java.lang.reflect.Method.invoke(Method.java:497)
	at org.junit.runners.model.FrameworkMethod$1.runReflectiveCall(FrameworkMethod.java:47)
	at org.junit.internal.runners.model.ReflectiveCallable.run(ReflectiveCallable.java:12)
	at org.junit.runners.model.FrameworkMethod.invokeExplosively(FrameworkMethod.java:44)
	at org.junit.internal.runners.statements.RunAfters.evaluate(RunAfters.java:33)
	at org.junit.runners.ParentRunner.runLeaf(ParentRunner.java:271)
	at org.junit.runners.BlockJUnit4ClassRunner.runChild(BlockJUnit4ClassRunner.java:70)
	at org.junit.runners.BlockJUnit4ClassRunner.runChild(BlockJUnit4ClassRunner.java:50)
	at org.junit.runners.ParentRunner$3.run(ParentRunner.java:238)
	at org.apache.maven.surefire.junitcore.pc.Scheduler$1.run(Scheduler.java:318)
	at org.apache.maven.surefire.junitcore.pc.InvokerStrategy.schedule(InvokerStrategy.java:41)
	at org.apache.maven.surefire.junitcore.pc.Scheduler.schedule(Scheduler.java:274)
	at org.junit.runners.ParentRunner.runChildren(ParentRunner.java:236)
	at org.junit.runners.ParentRunner.access$000(ParentRunner.java:53)
	at org.junit.runners.ParentRunner$2.evaluate(ParentRunner.java:229)
	at org.junit.runners.ParentRunner.run(ParentRunner.java:309)
	at org.junit.runners.Suite.runChild(Suite.java:127)
	at org.junit.runners.Suite.runChild(Suite.java:26)
	at org.junit.runners.ParentRunner$3.run(ParentRunner.java:238)
	at org.apache.maven.surefire.junitcore.pc.Scheduler$1.run(Scheduler.java:318)
	at org.apache.maven.surefire.junitcore.pc.InvokerStrategy.schedule(InvokerStrategy.java:41)
	at org.apache.maven.surefire.junitcore.pc.Scheduler.schedule(Scheduler.java:274)
	at org.junit.runners.ParentRunner.runChildren(ParentRunner.java:236)
	at org.junit.runners.ParentRunner.access$000(ParentRunner.java:53)
	at org.junit.runners.ParentRunner$2.evaluate(ParentRunner.java:229)
	at org.junit.runners.ParentRunner.run(ParentRunner.java:309)
	at org.junit.runners.Suite.runChild(Suite.java:127)
	at org.junit.runners.Suite.runChild(Suite.java:26)
	at org.junit.runners.ParentRunner$3.run(ParentRunner.java:238)
	at org.apache.maven.surefire.junitcore.pc.Scheduler$1.run(Scheduler.java:318)
	at org.apache.maven.surefire.junitcore.pc.InvokerStrategy.schedule(InvokerStrategy.java:41)
	at org.apache.maven.surefire.junitcore.pc.Scheduler.schedule(Scheduler.java:274)
	at org.junit.runners.ParentRunner.runChildren(ParentRunner.java:236)
	at org.junit.runners.ParentRunner.access$000(ParentRunner.java:53)
	at org.junit.runners.ParentRunner$2.evaluate(ParentRunner.java:229)
	at org.junit.runners.ParentRunner.run(ParentRunner.java:309)
	at org.apache.maven.surefire.junitcore.pc.ParallelComputerBuilder$PC$2.run(ParallelComputerBuilder.java:491)
	at org.junit.runner.JUnitCore.run(JUnitCore.java:160)
	at org.junit.runner.JUnitCore.run(JUnitCore.java:138)
	at org.apache.maven.surefire.junitcore.JUnitCoreWrapper.createRequestAndRun(JUnitCoreWrapper.java:113)
	at org.apache.maven.surefire.junitcore.JUnitCoreWrapper.executeEager(JUnitCoreWrapper.java:85)
	at org.apache.maven.surefire.junitcore.JUnitCoreWrapper.execute(JUnitCoreWrapper.java:54)
	at org.apache.maven.surefire.junitcore.JUnitCoreProvider.invoke(JUnitCoreProvider.java:134)
	at org.apache.maven.surefire.booter.ForkedBooter.invokeProviderInSameClassLoader(ForkedBooter.java:200)
	at org.apache.maven.surefire.booter.ForkedBooter.runSuitesInProcess(ForkedBooter.java:153)
	at org.apache.maven.surefire.booter.ForkedBooter.main(ForkedBooter.java:103)

Running org.apache.sysml.test.integration.functions.indexing.LeftIndexingScalarTest
Tests run: 3, Failures: 0, Errors: 0, Skipped: 0, Time elapsed: 235.173 sec - in org.apache.sysml.test.integration.functions.indexing.LeftIndexingScalarTest
Running org.apache.sysml.test.integration.functions.quaternary.WeightedSquaredLossTest
Tests run: 55, Failures: 0, Errors: 0, Skipped: 0, Time elapsed: 806.84 sec - in org.apache.sysml.test.integration.functions.quaternary.WeightedSquaredLossTest
16/05/05 03:39:46 INFO util.Utils: Shutdown hook called
16/05/05 03:39:46 INFO util.Utils: Deleting directory /tmp/spark-3f026e8a-2be7-4775-b6b2-b1b570167338
Running org.apache.sysml.test.integration.functions.updateinplace.UpdateInPlaceTest
Tests run: 15, Failures: 0, Errors: 0, Skipped: 0, Time elapsed: 9.696 sec - in org.apache.sysml.test.integration.functions.updateinplace.UpdateInPlaceTest
Running org.apache.sysml.test.integration.functions.append.StringAppendTest
Tests run: 9, Failures: 0, Errors: 0, Skipped: 0, Time elapsed: 42.39 sec - in org.apache.sysml.test.integration.functions.append.StringAppendTest
Running org.apache.sysml.test.integration.functions.indexing.LeftIndexingSparseDenseTest
Tests run: 15, Failures: 0, Errors: 0, Skipped: 0, Time elapsed: 288.89 sec - in org.apache.sysml.test.integration.functions.indexing.LeftIndexingSparseDenseTest
16/05/05 03:40:56 INFO util.Utils: Shutdown hook called
16/05/05 03:40:56 INFO util.Utils: Deleting directory /tmp/spark-15e0873f-8ba8-40dc-befc-d2829b8d6108
Running org.apache.sysml.test.integration.applications.parfor.ParForBivariateStatsTest
Tests run: 5, Failures: 0, Errors: 0, Skipped: 0, Time elapsed: 65.13 sec - in org.apache.sysml.test.integration.applications.parfor.ParForBivariateStatsTest
Running org.apache.sysml.test.integration.applications.descriptivestats.BivariateCategoricalCategoricallTest
Tests run: 3, Failures: 0, Errors: 0, Skipped: 0, Time elapsed: 19.498 sec - in org.apache.sysml.test.integration.applications.descriptivestats.BivariateCategoricalCategoricallTest
Running org.apache.sysml.test.integration.functions.append.RBindCBindMatrixTest
Running org.apache.sysml.test.integration.applications.descriptivestats.BivariateOrdinalOrdinalTest
Tests run: 2, Failures: 0, Errors: 0, Skipped: 0, Time elapsed: 9.292 sec - in org.apache.sysml.test.integration.applications.descriptivestats.BivariateOrdinalOrdinalTest
Tests run: 12, Failures: 0, Errors: 0, Skipped: 0, Time elapsed: 144.634 sec - in org.apache.sysml.test.integration.functions.append.RBindCBindMatrixTest
Running org.apache.sysml.test.integration.scalability.LinearRegressionTest
Tests run: 1, Failures: 0, Errors: 0, Skipped: 0, Time elapsed: 1.488 sec - in org.apache.sysml.test.integration.scalability.LinearRegressionTest
Running org.apache.sysml.test.integration.scalability.PageRankTest
Tests run: 1, Failures: 0, Errors: 0, Skipped: 0, Time elapsed: 1.293 sec - in org.apache.sysml.test.integration.scalability.PageRankTest
Running org.apache.sysml.test.integration.applications.descriptivestats.BivariateScaleCategoricalTest
Tests run: 2, Failures: 0, Errors: 0, Skipped: 0, Time elapsed: 8.501 sec - in org.apache.sysml.test.integration.applications.descriptivestats.BivariateScaleCategoricalTest
Running org.apache.sysml.test.integration.applications.parfor.ParForCVMulticlassSVMTest
Tests run: 6, Failures: 0, Errors: 0, Skipped: 0, Time elapsed: 36.75 sec - in org.apache.sysml.test.integration.applications.parfor.ParForCVMulticlassSVMTest
Running org.apache.sysml.test.integration.applications.descriptivestats.BivariateScaleScaleTest
Tests run: 2, Failures: 0, Errors: 0, Skipped: 0, Time elapsed: 11.503 sec - in org.apache.sysml.test.integration.applications.descriptivestats.BivariateScaleScaleTest
Running org.apache.sysml.test.integration.applications.descriptivestats.OrderStatisticsTest
Tests run: 1, Failures: 0, Errors: 0, Skipped: 0, Time elapsed: 0.755 sec - in org.apache.sysml.test.integration.applications.descriptivestats.OrderStatisticsTest
Running org.apache.sysml.test.integration.applications.dml.ArimaDMLTest
Tests run: 1, Failures: 0, Errors: 0, Skipped: 0, Time elapsed: 76.889 sec - in org.apache.sysml.test.integration.applications.dml.ArimaDMLTest
Running org.apache.sysml.test.integration.applications.descriptivestats.UnivariateCategoricalTest
Tests run: 2, Failures: 0, Errors: 0, Skipped: 0, Time elapsed: 6.647 sec - in org.apache.sysml.test.integration.applications.descriptivestats.UnivariateCategoricalTest
Running org.apache.sysml.test.integration.applications.parfor.ParForUnivariateStatsTest
Tests run: 3, Failures: 0, Errors: 0, Skipped: 0, Time elapsed: 14.527 sec - in org.apache.sysml.test.integration.applications.parfor.ParForUnivariateStatsTest
Running org.apache.sysml.test.integration.functions.indexing.Jdk7IssueRightIndexingTest
Tests run: 8, Failures: 0, Errors: 0, Skipped: 0, Time elapsed: 493.399 sec - in org.apache.sysml.test.integration.functions.indexing.Jdk7IssueRightIndexingTest
Running org.apache.sysml.test.integration.functions.append.AppendVectorTest
Tests run: 6, Failures: 0, Errors: 0, Skipped: 0, Time elapsed: 429.576 sec - in org.apache.sysml.test.integration.functions.append.AppendVectorTest
Running org.apache.sysml.test.integration.functions.quaternary.WeightedDivMatrixMultTest
Tests run: 90, Failures: 0, Errors: 0, Skipped: 0, Time elapsed: 1,136.957 sec - in org.apache.sysml.test.integration.functions.quaternary.WeightedDivMatrixMultTest
16/05/05 03:45:26 INFO util.Utils: Shutdown hook called
16/05/05 03:45:26 INFO util.Utils: Deleting directory /tmp/spark-204b0b9c-4975-495b-90d3-b8f04f03a282
Running org.apache.sysml.test.integration.functions.quaternary.WeightedSigmoidTest
Tests run: 56, Failures: 0, Errors: 0, Skipped: 0, Time elapsed: 991.428 sec - in org.apache.sysml.test.integration.functions.quaternary.WeightedSigmoidTest
16/05/05 03:45:31 INFO util.Utils: Shutdown hook called
16/05/05 03:45:31 INFO util.Utils: Deleting directory /tmp/spark-c7081adc-7720-4fea-903c-046a09d29f79
Running org.apache.sysml.test.integration.functions.indexing.LeftIndexingTest
Tests run: 3, Failures: 0, Errors: 0, Skipped: 0, Time elapsed: 652.968 sec - in org.apache.sysml.test.integration.functions.indexing.LeftIndexingTest
Running org.apache.sysml.test.integration.applications.parfor.ParForCorrelationTest
Tests run: 12, Failures: 0, Errors: 0, Skipped: 0, Time elapsed: 272.428 sec - in org.apache.sysml.test.integration.applications.parfor.ParForCorrelationTest
Running org.apache.sysml.test.integration.applications.parfor.ParForCorrelationTestLarge
Tests run: 2, Failures: 0, Errors: 0, Skipped: 0, Time elapsed: 42.599 sec - in org.apache.sysml.test.integration.applications.parfor.ParForCorrelationTestLarge
Running org.apache.sysml.test.integration.applications.descriptivestats.UnivariateUnweightedScaleDenseTest
Tests run: 24, Failures: 0, Errors: 0, Skipped: 0, Time elapsed: 324.341 sec - in org.apache.sysml.test.integration.applications.descriptivestats.UnivariateUnweightedScaleDenseTest
Running org.apache.sysml.test.integration.functions.reorg.FullOrderTest
Tests run: 132, Failures: 0, Errors: 0, Skipped: 0, Time elapsed: 1,348.492 sec - in org.apache.sysml.test.integration.functions.reorg.FullOrderTest
Running org.apache.sysml.test.integration.applications.descriptivestats.UnivariateWeightedScaleDenseTest
Tests run: 24, Failures: 0, Errors: 0, Skipped: 0, Time elapsed: 334.831 sec - in org.apache.sysml.test.integration.applications.descriptivestats.UnivariateWeightedScaleDenseTest
Running org.apache.sysml.test.integration.functions.append.AppendChainTest
Tests run: 12, Failures: 0, Errors: 0, Skipped: 0, Time elapsed: 1,076.979 sec - in org.apache.sysml.test.integration.functions.append.AppendChainTest
Running org.apache.sysml.test.integration.applications.parfor.ParForNaiveBayesTest
Tests run: 10, Failures: 0, Errors: 0, Skipped: 0, Time elapsed: 500.106 sec - in org.apache.sysml.test.integration.applications.parfor.ParForNaiveBayesTest
Running org.apache.sysml.test.integration.applications.descriptivestats.UnivariateUnweightedScaleSparseTest
Tests run: 24, Failures: 0, Errors: 0, Skipped: 0, Time elapsed: 289.137 sec - in org.apache.sysml.test.integration.applications.descriptivestats.UnivariateUnweightedScaleSparseTest
Running org.apache.sysml.test.integration.applications.dml.HITSDMLTest
Tests run: 1, Failures: 0, Errors: 0, Skipped: 0, Time elapsed: 80.037 sec - in org.apache.sysml.test.integration.applications.dml.HITSDMLTest
Running org.apache.sysml.test.integration.functions.append.AppendMatrixTest
Tests run: 22, Failures: 0, Errors: 0, Skipped: 0, Time elapsed: 1,459.334 sec - in org.apache.sysml.test.integration.functions.append.AppendMatrixTest
Running org.apache.sysml.test.integration.applications.descriptivestats.UnivariateWeightedScaleSparseTest
Tests run: 24, Failures: 0, Errors: 0, Skipped: 0, Time elapsed: 342.021 sec - in org.apache.sysml.test.integration.applications.descriptivestats.UnivariateWeightedScaleSparseTest
Running org.apache.sysml.test.integration.applications.pydml.ArimaPyDMLTest
Tests run: 1, Failures: 0, Errors: 0, Skipped: 0, Time elapsed: 50.244 sec - in org.apache.sysml.test.integration.applications.pydml.ArimaPyDMLTest
Running org.apache.sysml.test.integration.applications.pydml.HITSPyDMLTest
Tests run: 1, Failures: 0, Errors: 0, Skipped: 0, Time elapsed: 78.063 sec - in org.apache.sysml.test.integration.applications.pydml.HITSPyDMLTest
Running org.apache.sysml.test.integration.applications.dml.LinearRegressionDMLTest
Tests run: 7, Failures: 0, Errors: 0, Skipped: 0, Time elapsed: 51.565 sec - in org.apache.sysml.test.integration.applications.dml.LinearRegressionDMLTest
Running org.apache.sysml.test.integration.applications.pydml.CsplineDSPyDMLTest
Tests run: 3, Failures: 0, Errors: 0, Skipped: 0, Time elapsed: 6.967 sec - in org.apache.sysml.test.integration.applications.pydml.CsplineDSPyDMLTest
Running org.apache.sysml.test.integration.applications.pydml.LinearLogRegPyDMLTest
Tests run: 7, Failures: 0, Errors: 0, Skipped: 0, Time elapsed: 86.098 sec - in org.apache.sysml.test.integration.applications.pydml.LinearLogRegPyDMLTest
Running org.apache.sysml.test.integration.applications.pydml.NaiveBayesPyDMLTest
Tests run: 6, Failures: 0, Errors: 0, Skipped: 0, Time elapsed: 81.677 sec - in org.apache.sysml.test.integration.applications.pydml.NaiveBayesPyDMLTest
Running org.apache.sysml.test.integration.applications.dml.CsplineCGDMLTest
Tests run: 3, Failures: 0, Errors: 0, Skipped: 0, Time elapsed: 13.822 sec - in org.apache.sysml.test.integration.applications.dml.CsplineCGDMLTest
Running org.apache.sysml.test.integration.applications.dml.L2SVMDMLTest
Tests run: 9, Failures: 0, Errors: 0, Skipped: 0, Time elapsed: 64.65 sec - in org.apache.sysml.test.integration.applications.dml.L2SVMDMLTest
Running org.apache.sysml.test.integration.applications.pydml.MDABivariateStatsPyDMLTest
Tests run: 4, Failures: 0, Errors: 0, Skipped: 0, Time elapsed: 293.984 sec - in org.apache.sysml.test.integration.applications.pydml.MDABivariateStatsPyDMLTest
Running org.apache.sysml.test.integration.applications.pydml.PageRankPyDMLTest
Tests run: 3, Failures: 0, Errors: 0, Skipped: 0, Time elapsed: 6.463 sec - in org.apache.sysml.test.integration.applications.pydml.PageRankPyDMLTest
Running org.apache.sysml.test.integration.applications.pydml.NaiveBayesParforPyDMLTest
Tests run: 6, Failures: 0, Errors: 0, Skipped: 0, Time elapsed: 81.284 sec - in org.apache.sysml.test.integration.applications.pydml.NaiveBayesParforPyDMLTest
Running org.apache.sysml.test.integration.applications.dml.NaiveBayesDMLTest
Tests run: 6, Failures: 0, Errors: 0, Skipped: 0, Time elapsed: 81.632 sec - in org.apache.sysml.test.integration.applications.dml.NaiveBayesDMLTest
Running org.apache.sysml.test.integration.applications.dml.MDABivariateStatsDMLTest
Tests run: 4, Failures: 0, Errors: 0, Skipped: 0, Time elapsed: 295.277 sec - in org.apache.sysml.test.integration.applications.dml.MDABivariateStatsDMLTest
Running org.apache.sysml.test.integration.applications.dml.PageRankDMLTest
Tests run: 3, Failures: 0, Errors: 0, Skipped: 0, Time elapsed: 6.419 sec - in org.apache.sysml.test.integration.applications.dml.PageRankDMLTest
Running org.apache.sysml.test.integration.applications.pydml.GLMPyDMLTest
Tests run: 30, Failures: 0, Errors: 0, Skipped: 0, Time elapsed: 584.741 sec - in org.apache.sysml.test.integration.applications.pydml.GLMPyDMLTest
Running org.apache.sysml.test.integration.applications.pydml.MultiClassSVMPyDMLTest
Tests run: 9, Failures: 0, Errors: 0, Skipped: 0, Time elapsed: 89.889 sec - in org.apache.sysml.test.integration.applications.pydml.MultiClassSVMPyDMLTest
Running org.apache.sysml.test.integration.applications.dml.ID3DMLTest
Tests run: 2, Failures: 0, Errors: 0, Skipped: 0, Time elapsed: 371.255 sec - in org.apache.sysml.test.integration.applications.dml.ID3DMLTest
Running org.apache.sysml.test.integration.applications.dml.GLMDMLTest
Tests run: 30, Failures: 0, Errors: 0, Skipped: 0, Time elapsed: 829.248 sec - in org.apache.sysml.test.integration.applications.dml.GLMDMLTest
Running org.apache.sysml.test.integration.applications.pydml.CsplineCGPyDMLTest
Tests run: 3, Failures: 0, Errors: 0, Skipped: 0, Time elapsed: 6.175 sec - in org.apache.sysml.test.integration.applications.pydml.CsplineCGPyDMLTest
Running org.apache.sysml.test.integration.applications.pydml.WelchTPyDMLTest
Tests run: 3, Failures: 0, Errors: 0, Skipped: 0, Time elapsed: 6.687 sec - in org.apache.sysml.test.integration.applications.pydml.WelchTPyDMLTest
Running org.apache.sysml.test.integration.applications.dml.MultiClassSVMDMLTest
Tests run: 9, Failures: 0, Errors: 0, Skipped: 0, Time elapsed: 87.463 sec - in org.apache.sysml.test.integration.applications.dml.MultiClassSVMDMLTest
Running org.apache.sysml.test.integration.applications.dml.CsplineDSDMLTest
Tests run: 3, Failures: 0, Errors: 0, Skipped: 0, Time elapsed: 15.525 sec - in org.apache.sysml.test.integration.applications.dml.CsplineDSDMLTest
Running org.apache.sysml.test.integration.applications.pydml.ApplyTransformPyDMLTest
Tests run: 7, Failures: 0, Errors: 0, Skipped: 0, Time elapsed: 1.175 sec - in org.apache.sysml.test.integration.applications.pydml.ApplyTransformPyDMLTest
Running org.apache.sysml.test.integration.applications.dml.NaiveBayesParforDMLTest
Tests run: 6, Failures: 0, Errors: 0, Skipped: 0, Time elapsed: 81.249 sec - in org.apache.sysml.test.integration.applications.dml.NaiveBayesParforDMLTest
Running org.apache.sysml.test.integration.applications.pydml.L2SVMPyDMLTest
Tests run: 9, Failures: 0, Errors: 0, Skipped: 0, Time elapsed: 65.103 sec - in org.apache.sysml.test.integration.applications.pydml.L2SVMPyDMLTest
Running org.apache.sysml.test.integration.applications.pydml.LinearRegressionPyDMLTest
Tests run: 7, Failures: 0, Errors: 0, Skipped: 0, Time elapsed: 51.502 sec - in org.apache.sysml.test.integration.applications.pydml.LinearRegressionPyDMLTest
Running org.apache.sysml.test.integration.applications.dml.LinearLogRegDMLTest
Tests run: 7, Failures: 0, Errors: 0, Skipped: 0, Time elapsed: 61.338 sec - in org.apache.sysml.test.integration.applications.dml.LinearLogRegDMLTest
Running org.apache.sysml.test.integration.applications.dml.GNMFDMLTest
Tests run: 3, Failures: 0, Errors: 0, Skipped: 0, Time elapsed: 67.066 sec - in org.apache.sysml.test.integration.applications.dml.GNMFDMLTest
Running org.apache.sysml.test.integration.applications.dml.WelchTDMLTest
Tests run: 3, Failures: 0, Errors: 0, Skipped: 0, Time elapsed: 6.57 sec - in org.apache.sysml.test.integration.applications.dml.WelchTDMLTest
Running org.apache.sysml.test.integration.applications.dml.ApplyTransformDMLTest
Tests run: 7, Failures: 0, Errors: 0, Skipped: 0, Time elapsed: 16.027 sec - in org.apache.sysml.test.integration.applications.dml.ApplyTransformDMLTest
Running org.apache.sysml.test.integration.applications.pydml.ID3PyDMLTest
Tests run: 2, Failures: 0, Errors: 0, Skipped: 0, Time elapsed: 323.479 sec - in org.apache.sysml.test.integration.applications.pydml.ID3PyDMLTest
Running org.apache.sysml.test.integration.applications.pydml.GNMFPyDMLTest
Tests run: 3, Failures: 0, Errors: 0, Skipped: 0, Time elapsed: 57.552 sec - in org.apache.sysml.test.integration.applications.pydml.GNMFPyDMLTest

Results :

Failed tests: 
  RightIndexingMatrixTest>AutomatedTestBase.tearDown:1408 Detailed matrices characteristics:
!  B-DML<->B-R # stored values in B-R: 189
!  B-DML<->B-R # stored values in B-DML: 189
!  B-DML<->B-R identical values(z=0): 0
!  B-DML<->B-R wrong values(z=1.0E-10): 189
!  B-DML<->B-R min error: 0.30359582096607385
!  B-DML<->B-R max error: 99.59996041116503
    C-DML<->C-R # stored values in C-R: 967719
    C-DML<->C-R # stored values in C-DML: 967719
    C-DML<->C-R identical values(z=0): 967629
    C-DML<->C-R wrong values(z=1.0E-10): 0
    C-DML<->C-R min error: 0.0
    C-DML<->C-R max error: 1.4210854715202004E-14
    D-DML<->D-R # stored values in D-R: 470374
    D-DML<->D-R # stored values in D-DML: 470374
    D-DML<->D-R identical values(z=0): 470327
    D-DML<->D-R wrong values(z=1.0E-10): 0
    D-DML<->D-R min error: 0.0
    D-DML<->D-R max error: 1.4210854715202004E-14


Tests run: 4953, Failures: 1, Errors: 0, Skipped: 0

[INFO] 
[INFO] --- maven-failsafe-plugin:2.17:verify (default) @ systemml ---
[INFO] Failsafe report directory: <https://sparktc.ibmcloud.com/jenkins/job/SystemML-DailyTest/ws/target/failsafe-reports>
[INFO] ------------------------------------------------------------------------
[INFO] BUILD FAILURE
[INFO] ------------------------------------------------------------------------
[INFO] Total time: 02:16 h
[INFO] Finished at: 2016-05-05T04:48:17-05:00
[INFO] Final Memory: 64M/2438M
[INFO] ------------------------------------------------------------------------
[ERROR] Failed to execute goal org.apache.maven.plugins:maven-failsafe-plugin:2.17:verify
(default) on project systemml: There are test failures.
[ERROR] 
[ERROR] Please refer to <https://sparktc.ibmcloud.com/jenkins/job/SystemML-DailyTest/ws/target/failsafe-reports>
for the individual test results.
[ERROR] -> [Help 1]
[ERROR] 
[ERROR] To see the full stack trace of the errors, re-run Maven with the -e switch.
[ERROR] Re-run Maven using the -X switch to enable full debug logging.
[ERROR] 
[ERROR] For more information about the errors and possible solutions, please read the following
articles:
[ERROR] [Help 1] http://cwiki.apache.org/confluence/display/MAVEN/MojoFailureException
Build step 'Execute shell' marked build as failure
Run condition [Always] enabling perform for step [[]]

Mime
View raw message