systemml-dev mailing list archives

Site index · List index
Message view « Date » · « Thread »
Top « Date » · « Thread »
From jenk...@spark.tc
Subject Build failed in Jenkins: SystemML-DailyTest #434
Date Wed, 10 Aug 2016 09:52:44 GMT
See <https://sparktc.ibmcloud.com/jenkins/job/SystemML-DailyTest/434/changes>

Changes:

[npansar] [SYSTEMML-234] [SYSTEMML-208] Added mllearn library to support

[mwdusenb] [SYSTEMML-856] Adding Gemfile back to the documentation.

------------------------------------------
[...truncated 5328 lines...]
16/08/10 03:45:11 INFO executor.Executor: Running task 0.0 in stage 125.0 (TID 131)
16/08/10 03:45:11 INFO executor.Executor: Finished task 0.0 in stage 125.0 (TID 131). 640
bytes result sent to driver
16/08/10 03:45:11 INFO scheduler.TaskSetManager: Finished task 0.0 in stage 125.0 (TID 131)
in 8 ms on localhost (1/1)
16/08/10 03:45:11 INFO scheduler.TaskSchedulerImpl: Removed TaskSet 125.0, whose tasks have
all completed, from pool 
16/08/10 03:45:11 INFO scheduler.DAGScheduler: ResultStage 125 (next at MLContextTest.java:977)
finished in 0.009 s
16/08/10 03:45:11 INFO storage.BlockManagerInfo: Removed broadcast_127_piece0 on localhost:42322
in memory (size: 882.0 B, free: 1092.4 MB)
16/08/10 03:45:11 INFO scheduler.DAGScheduler: Registering RDD 368 (flatMapToPair at RDDConverterUtilsExt.java:436)
16/08/10 03:45:11 INFO scheduler.DAGScheduler: Got job 91 (collectAsList at MLContextTest.java:1002)
with 1 output partitions (allowLocal=false)
16/08/10 03:45:11 INFO scheduler.DAGScheduler: Final stage: ResultStage 127(collectAsList
at MLContextTest.java:1002)
16/08/10 03:45:11 INFO scheduler.DAGScheduler: Parents of final stage: List(ShuffleMapStage
126)
16/08/10 03:45:11 INFO scheduler.DAGScheduler: Missing parents: List(ShuffleMapStage 126)
16/08/10 03:45:11 INFO scheduler.DAGScheduler: Submitting ShuffleMapStage 126 (MapPartitionsRDD[368]
at flatMapToPair at RDDConverterUtilsExt.java:436), which has no missing parents
16/08/10 03:45:11 INFO storage.MemoryStore: ensureFreeSpace(3520) called with curMem=712468,
maxMem=1145485393
16/08/10 03:45:11 INFO storage.MemoryStore: Block broadcast_128 stored as values in memory
(estimated size 3.4 KB, free 1091.7 MB)
16/08/10 03:45:11 INFO storage.MemoryStore: ensureFreeSpace(1974) called with curMem=715988,
maxMem=1145485393
16/08/10 03:45:11 INFO storage.MemoryStore: Block broadcast_128_piece0 stored as bytes in
memory (estimated size 1974.0 B, free 1091.7 MB)
16/08/10 03:45:11 INFO storage.BlockManagerInfo: Added broadcast_128_piece0 in memory on localhost:42322
(size: 1974.0 B, free: 1092.4 MB)
16/08/10 03:45:11 INFO spark.SparkContext: Created broadcast 128 from broadcast at DAGScheduler.scala:874
16/08/10 03:45:11 INFO scheduler.DAGScheduler: Submitting 1 missing tasks from ShuffleMapStage
126 (MapPartitionsRDD[368] at flatMapToPair at RDDConverterUtilsExt.java:436)
16/08/10 03:45:11 INFO scheduler.TaskSchedulerImpl: Adding task set 126.0 with 1 tasks
16/08/10 03:45:11 INFO scheduler.TaskSetManager: Starting task 0.0 in stage 126.0 (TID 132,
localhost, PROCESS_LOCAL, 1616 bytes)
16/08/10 03:45:11 INFO executor.Executor: Running task 0.0 in stage 126.0 (TID 132)
16/08/10 03:45:11 INFO executor.Executor: Finished task 0.0 in stage 126.0 (TID 132). 879
bytes result sent to driver
16/08/10 03:45:11 INFO scheduler.TaskSetManager: Finished task 0.0 in stage 126.0 (TID 132)
in 6 ms on localhost (1/1)
16/08/10 03:45:11 INFO scheduler.TaskSchedulerImpl: Removed TaskSet 126.0, whose tasks have
all completed, from pool 
16/08/10 03:45:11 INFO scheduler.DAGScheduler: ShuffleMapStage 126 (flatMapToPair at RDDConverterUtilsExt.java:436)
finished in 0.007 s
16/08/10 03:45:11 INFO scheduler.DAGScheduler: looking for newly runnable stages
16/08/10 03:45:11 INFO scheduler.DAGScheduler: running: Set()
16/08/10 03:45:11 INFO scheduler.DAGScheduler: waiting: Set(ResultStage 127)
16/08/10 03:45:11 INFO scheduler.DAGScheduler: failed: Set()
16/08/10 03:45:11 INFO scheduler.DAGScheduler: Missing parents for ResultStage 127: List()
16/08/10 03:45:11 INFO scheduler.DAGScheduler: Submitting ResultStage 127 (MapPartitionsRDD[373]
at collectAsList at MLContextTest.java:1002), which is now runnable
16/08/10 03:45:11 INFO storage.MemoryStore: ensureFreeSpace(6208) called with curMem=717962,
maxMem=1145485393
16/08/10 03:45:11 INFO storage.MemoryStore: Block broadcast_129 stored as values in memory
(estimated size 6.1 KB, free 1091.7 MB)
16/08/10 03:45:11 INFO storage.MemoryStore: ensureFreeSpace(3111) called with curMem=724170,
maxMem=1145485393
16/08/10 03:45:11 INFO storage.MemoryStore: Block broadcast_129_piece0 stored as bytes in
memory (estimated size 3.0 KB, free 1091.7 MB)
16/08/10 03:45:11 INFO storage.BlockManagerInfo: Added broadcast_129_piece0 in memory on localhost:42322
(size: 3.0 KB, free: 1092.3 MB)
16/08/10 03:45:11 INFO spark.SparkContext: Created broadcast 129 from broadcast at DAGScheduler.scala:874
16/08/10 03:45:11 INFO scheduler.DAGScheduler: Submitting 1 missing tasks from ResultStage
127 (MapPartitionsRDD[373] at collectAsList at MLContextTest.java:1002)
16/08/10 03:45:11 INFO scheduler.TaskSchedulerImpl: Adding task set 127.0 with 1 tasks
16/08/10 03:45:11 INFO scheduler.TaskSetManager: Starting task 0.0 in stage 127.0 (TID 133,
localhost, PROCESS_LOCAL, 1165 bytes)
16/08/10 03:45:11 INFO executor.Executor: Running task 0.0 in stage 127.0 (TID 133)
16/08/10 03:45:11 INFO storage.ShuffleBlockFetcherIterator: Getting 1 non-empty blocks out
of 1 blocks
16/08/10 03:45:11 INFO storage.ShuffleBlockFetcherIterator: Started 0 remote fetches in 0
ms
16/08/10 03:45:11 INFO executor.Executor: Finished task 0.0 in stage 127.0 (TID 133). 2074
bytes result sent to driver
16/08/10 03:45:11 INFO scheduler.TaskSetManager: Finished task 0.0 in stage 127.0 (TID 133)
in 6 ms on localhost (1/1)
16/08/10 03:45:11 INFO scheduler.TaskSchedulerImpl: Removed TaskSet 127.0, whose tasks have
all completed, from pool 
16/08/10 03:45:11 INFO scheduler.DAGScheduler: ResultStage 127 (collectAsList at MLContextTest.java:1002)
finished in 0.009 s
16/08/10 03:45:11 INFO storage.BlockManagerInfo: Removed broadcast_128_piece0 on localhost:42322
in memory (size: 1974.0 B, free: 1092.4 MB)
16/08/10 03:45:11 INFO spark.ContextCleaner: Cleaned shuffle 35
16/08/10 03:45:11 INFO storage.BlockManagerInfo: Removed broadcast_129_piece0 on localhost:42322
in memory (size: 3.0 KB, free: 1092.4 MB)
16/08/10 03:45:11 INFO handler.ContextHandler: stopped o.s.j.s.ServletContextHandler{/metrics/json,null}
16/08/10 03:45:11 INFO handler.ContextHandler: stopped o.s.j.s.ServletContextHandler{/stages/stage/kill,null}
16/08/10 03:45:11 INFO handler.ContextHandler: stopped o.s.j.s.ServletContextHandler{/api,null}
16/08/10 03:45:11 INFO handler.ContextHandler: stopped o.s.j.s.ServletContextHandler{/,null}
16/08/10 03:45:11 INFO handler.ContextHandler: stopped o.s.j.s.ServletContextHandler{/static,null}
16/08/10 03:45:11 INFO handler.ContextHandler: stopped o.s.j.s.ServletContextHandler{/executors/threadDump/json,null}
16/08/10 03:45:11 INFO handler.ContextHandler: stopped o.s.j.s.ServletContextHandler{/executors/threadDump,null}
16/08/10 03:45:11 INFO handler.ContextHandler: stopped o.s.j.s.ServletContextHandler{/executors/json,null}
16/08/10 03:45:11 INFO handler.ContextHandler: stopped o.s.j.s.ServletContextHandler{/executors,null}
16/08/10 03:45:11 INFO handler.ContextHandler: stopped o.s.j.s.ServletContextHandler{/environment/json,null}
16/08/10 03:45:11 INFO handler.ContextHandler: stopped o.s.j.s.ServletContextHandler{/environment,null}
16/08/10 03:45:11 INFO handler.ContextHandler: stopped o.s.j.s.ServletContextHandler{/storage/rdd/json,null}
16/08/10 03:45:11 INFO handler.ContextHandler: stopped o.s.j.s.ServletContextHandler{/storage/rdd,null}
16/08/10 03:45:11 INFO handler.ContextHandler: stopped o.s.j.s.ServletContextHandler{/storage/json,null}
16/08/10 03:45:11 INFO handler.ContextHandler: stopped o.s.j.s.ServletContextHandler{/storage,null}
16/08/10 03:45:11 INFO handler.ContextHandler: stopped o.s.j.s.ServletContextHandler{/stages/pool/json,null}
16/08/10 03:45:11 INFO handler.ContextHandler: stopped o.s.j.s.ServletContextHandler{/stages/pool,null}
16/08/10 03:45:11 INFO handler.ContextHandler: stopped o.s.j.s.ServletContextHandler{/stages/stage/json,null}
16/08/10 03:45:11 INFO handler.ContextHandler: stopped o.s.j.s.ServletContextHandler{/stages/stage,null}
16/08/10 03:45:11 INFO handler.ContextHandler: stopped o.s.j.s.ServletContextHandler{/stages/json,null}
16/08/10 03:45:11 INFO handler.ContextHandler: stopped o.s.j.s.ServletContextHandler{/stages,null}
16/08/10 03:45:11 INFO handler.ContextHandler: stopped o.s.j.s.ServletContextHandler{/jobs/job/json,null}
16/08/10 03:45:11 INFO handler.ContextHandler: stopped o.s.j.s.ServletContextHandler{/jobs/job,null}
16/08/10 03:45:11 INFO handler.ContextHandler: stopped o.s.j.s.ServletContextHandler{/jobs/json,null}
16/08/10 03:45:11 INFO handler.ContextHandler: stopped o.s.j.s.ServletContextHandler{/jobs,null}
16/08/10 03:45:12 INFO ui.SparkUI: Stopped Spark web UI at http://169.54.146.43:4040
16/08/10 03:45:12 INFO scheduler.DAGScheduler: Stopping DAGScheduler
16/08/10 03:45:12 INFO spark.MapOutputTrackerMasterEndpoint: MapOutputTrackerMasterEndpoint
stopped!
16/08/10 03:45:12 INFO util.Utils: path = /tmp/spark-5c43e20b-fdcd-497c-9130-9e366aebec9d/blockmgr-8640c0f1-dca1-4858-8f6e-3aa9864d4945,
already present as root for deletion.
16/08/10 03:45:12 INFO storage.MemoryStore: MemoryStore cleared
16/08/10 03:45:12 INFO storage.BlockManager: BlockManager stopped
16/08/10 03:45:12 INFO storage.BlockManagerMaster: BlockManagerMaster stopped
16/08/10 03:45:12 INFO scheduler.OutputCommitCoordinator$OutputCommitCoordinatorEndpoint:
OutputCommitCoordinator stopped!
16/08/10 03:45:12 INFO spark.SparkContext: Successfully stopped SparkContext
Running org.apache.sysml.test.integration.mlcontext.MLContextTest
16/08/10 03:45:12 INFO remote.RemoteActorRefProvider$RemotingTerminator: Shutting down remote
daemon.
16/08/10 03:45:12 INFO remote.RemoteActorRefProvider$RemotingTerminator: Remote daemon shut
down; proceeding with flushing remote transports.
Tests run: 104, Failures: 2, Errors: 0, Skipped: 0, Time elapsed: 39.519 sec <<<
FAILURE! - in org.apache.sysml.test.integration.mlcontext.MLContextTest
testOutputDataFramePYDML(org.apache.sysml.test.integration.mlcontext.MLContextTest)  Time
elapsed: 0.385 sec  <<< FAILURE!
java.lang.AssertionError: expected:<0.0> but was:<1.0>
	at org.junit.Assert.fail(Assert.java:88)
	at org.junit.Assert.failNotEquals(Assert.java:743)
	at org.junit.Assert.assertEquals(Assert.java:494)
	at org.junit.Assert.assertEquals(Assert.java:592)
	at org.apache.sysml.test.integration.mlcontext.MLContextTest.testOutputDataFramePYDML(MLContextTest.java:1024)

testOutputDataFrameDML(org.apache.sysml.test.integration.mlcontext.MLContextTest)  Time elapsed:
0.242 sec  <<< FAILURE!
java.lang.AssertionError: expected:<0.0> but was:<1.0>
	at org.junit.Assert.fail(Assert.java:88)
	at org.junit.Assert.failNotEquals(Assert.java:743)
	at org.junit.Assert.assertEquals(Assert.java:494)
	at org.junit.Assert.assertEquals(Assert.java:592)
	at org.apache.sysml.test.integration.mlcontext.MLContextTest.testOutputDataFrameDML(MLContextTest.java:1004)

16/08/10 03:45:12 INFO util.Utils: Shutdown hook called
16/08/10 03:45:12 INFO util.Utils: Deleting directory /tmp/spark-5c43e20b-fdcd-497c-9130-9e366aebec9d
16/08/10 03:45:12 INFO remote.RemoteActorRefProvider$RemotingTerminator: Remoting shut down.
Running org.apache.sysml.test.integration.scalability.LinearRegressionTest
Tests run: 1, Failures: 0, Errors: 0, Skipped: 0, Time elapsed: 2.039 sec - in org.apache.sysml.test.integration.scalability.LinearRegressionTest
Running org.apache.sysml.test.integration.scalability.PageRankTest
Tests run: 1, Failures: 0, Errors: 0, Skipped: 0, Time elapsed: 2.375 sec - in org.apache.sysml.test.integration.scalability.PageRankTest
Running org.apache.sysml.test.integration.applications.dml.ArimaDMLTest
Tests run: 1, Failures: 0, Errors: 0, Skipped: 0, Time elapsed: 79.785 sec - in org.apache.sysml.test.integration.applications.dml.ArimaDMLTest
Running org.apache.sysml.test.integration.applications.parfor.ParForCVMulticlassSVMTest
Tests run: 6, Failures: 0, Errors: 0, Skipped: 0, Time elapsed: 44.358 sec - in org.apache.sysml.test.integration.applications.parfor.ParForCVMulticlassSVMTest
Running org.apache.sysml.test.integration.applications.parfor.ParForUnivariateStatsTest
Tests run: 3, Failures: 0, Errors: 0, Skipped: 0, Time elapsed: 17.049 sec - in org.apache.sysml.test.integration.applications.parfor.ParForUnivariateStatsTest
Running org.apache.sysml.test.integration.functions.append.AppendVectorTest
Tests run: 6, Failures: 0, Errors: 0, Skipped: 0, Time elapsed: 429.195 sec - in org.apache.sysml.test.integration.functions.append.AppendVectorTest
Running org.apache.sysml.test.integration.functions.quaternary.WeightedSigmoidTest
Tests run: 56, Failures: 0, Errors: 0, Skipped: 0, Time elapsed: 1,011.398 sec - in org.apache.sysml.test.integration.functions.quaternary.WeightedSigmoidTest
16/08/10 03:48:58 INFO util.Utils: Shutdown hook called
16/08/10 03:48:58 INFO util.Utils: Deleting directory /tmp/spark-c22455d5-5ef9-42eb-a5f1-8e8cbd8af963
Running org.apache.sysml.test.integration.functions.indexing.LeftIndexingTest
Tests run: 3, Failures: 0, Errors: 0, Skipped: 0, Time elapsed: 682.434 sec - in org.apache.sysml.test.integration.functions.indexing.LeftIndexingTest
Running org.apache.sysml.test.integration.functions.indexing.Jdk7IssueRightIndexingTest
Tests run: 8, Failures: 0, Errors: 0, Skipped: 0, Time elapsed: 777.595 sec - in org.apache.sysml.test.integration.functions.indexing.Jdk7IssueRightIndexingTest
Running org.apache.sysml.test.integration.applications.parfor.ParForCorrelationTest
Tests run: 12, Failures: 0, Errors: 0, Skipped: 0, Time elapsed: 277.292 sec - in org.apache.sysml.test.integration.applications.parfor.ParForCorrelationTest
Running org.apache.sysml.test.integration.applications.descriptivestats.UnivariateUnweightedScaleDenseTest
Tests run: 24, Failures: 0, Errors: 0, Skipped: 0, Time elapsed: 340.519 sec - in org.apache.sysml.test.integration.applications.descriptivestats.UnivariateUnweightedScaleDenseTest
Running org.apache.sysml.test.integration.applications.parfor.ParForCorrelationTestLarge
Tests run: 2, Failures: 0, Errors: 0, Skipped: 0, Time elapsed: 47.155 sec - in org.apache.sysml.test.integration.applications.parfor.ParForCorrelationTestLarge
Running org.apache.sysml.test.integration.functions.reorg.FullOrderTest
Tests run: 132, Failures: 0, Errors: 0, Skipped: 0, Time elapsed: 1,377.593 sec - in org.apache.sysml.test.integration.functions.reorg.FullOrderTest
Running org.apache.sysml.test.integration.functions.quaternary.WeightedDivMatrixMultTest
Tests run: 90, Failures: 0, Errors: 0, Skipped: 0, Time elapsed: 1,495.296 sec - in org.apache.sysml.test.integration.functions.quaternary.WeightedDivMatrixMultTest
16/08/10 03:56:16 INFO util.Utils: Shutdown hook called
16/08/10 03:56:16 INFO util.Utils: Deleting directory /tmp/spark-2f689893-f850-42c8-9ebd-15bef8d261d1
Running org.apache.sysml.test.integration.applications.descriptivestats.UnivariateWeightedScaleDenseTest
Tests run: 24, Failures: 0, Errors: 0, Skipped: 0, Time elapsed: 366.345 sec - in org.apache.sysml.test.integration.applications.descriptivestats.UnivariateWeightedScaleDenseTest
Running org.apache.sysml.test.integration.functions.append.AppendChainTest
Tests run: 12, Failures: 0, Errors: 0, Skipped: 0, Time elapsed: 1,116.081 sec - in org.apache.sysml.test.integration.functions.append.AppendChainTest
Running org.apache.sysml.test.integration.applications.parfor.ParForNaiveBayesTest
Tests run: 10, Failures: 0, Errors: 0, Skipped: 0, Time elapsed: 528.483 sec - in org.apache.sysml.test.integration.applications.parfor.ParForNaiveBayesTest
Running org.apache.sysml.test.integration.applications.descriptivestats.UnivariateUnweightedScaleSparseTest
Tests run: 24, Failures: 0, Errors: 0, Skipped: 0, Time elapsed: 268.496 sec - in org.apache.sysml.test.integration.applications.descriptivestats.UnivariateUnweightedScaleSparseTest
Running org.apache.sysml.test.integration.applications.dml.HITSDMLTest
Tests run: 1, Failures: 0, Errors: 0, Skipped: 0, Time elapsed: 89.044 sec - in org.apache.sysml.test.integration.applications.dml.HITSDMLTest
Running org.apache.sysml.test.integration.functions.append.AppendMatrixTest
Tests run: 22, Failures: 0, Errors: 0, Skipped: 0, Time elapsed: 1,513.894 sec - in org.apache.sysml.test.integration.functions.append.AppendMatrixTest
Running org.apache.sysml.test.integration.applications.descriptivestats.UnivariateWeightedScaleSparseTest
Tests run: 24, Failures: 0, Errors: 0, Skipped: 0, Time elapsed: 330.388 sec - in org.apache.sysml.test.integration.applications.descriptivestats.UnivariateWeightedScaleSparseTest
Running org.apache.sysml.test.integration.applications.pydml.ArimaPyDMLTest
Tests run: 1, Failures: 0, Errors: 0, Skipped: 0, Time elapsed: 49.589 sec - in org.apache.sysml.test.integration.applications.pydml.ArimaPyDMLTest
Running org.apache.sysml.test.integration.applications.pydml.HITSPyDMLTest
Tests run: 1, Failures: 0, Errors: 0, Skipped: 0, Time elapsed: 77.461 sec - in org.apache.sysml.test.integration.applications.pydml.HITSPyDMLTest
Running org.apache.sysml.test.integration.applications.dml.LinearRegressionDMLTest
Tests run: 7, Failures: 0, Errors: 0, Skipped: 0, Time elapsed: 51.117 sec - in org.apache.sysml.test.integration.applications.dml.LinearRegressionDMLTest
Running org.apache.sysml.test.integration.applications.pydml.CsplineDSPyDMLTest
Tests run: 3, Failures: 0, Errors: 0, Skipped: 0, Time elapsed: 6.86 sec - in org.apache.sysml.test.integration.applications.pydml.CsplineDSPyDMLTest
Running org.apache.sysml.test.integration.applications.pydml.LinearLogRegPyDMLTest
Tests run: 7, Failures: 0, Errors: 0, Skipped: 0, Time elapsed: 86.189 sec - in org.apache.sysml.test.integration.applications.pydml.LinearLogRegPyDMLTest
Running org.apache.sysml.test.integration.applications.pydml.NaiveBayesPyDMLTest
Tests run: 6, Failures: 0, Errors: 0, Skipped: 0, Time elapsed: 81.193 sec - in org.apache.sysml.test.integration.applications.pydml.NaiveBayesPyDMLTest
Running org.apache.sysml.test.integration.applications.dml.CsplineCGDMLTest
Tests run: 3, Failures: 0, Errors: 0, Skipped: 0, Time elapsed: 14.223 sec - in org.apache.sysml.test.integration.applications.dml.CsplineCGDMLTest
Running org.apache.sysml.test.integration.applications.dml.L2SVMDMLTest
Tests run: 9, Failures: 0, Errors: 0, Skipped: 0, Time elapsed: 64.061 sec - in org.apache.sysml.test.integration.applications.dml.L2SVMDMLTest
Running org.apache.sysml.test.integration.applications.pydml.MDABivariateStatsPyDMLTest
Tests run: 4, Failures: 0, Errors: 0, Skipped: 0, Time elapsed: 293.953 sec - in org.apache.sysml.test.integration.applications.pydml.MDABivariateStatsPyDMLTest
Running org.apache.sysml.test.integration.applications.pydml.PageRankPyDMLTest
Tests run: 3, Failures: 0, Errors: 0, Skipped: 0, Time elapsed: 6.205 sec - in org.apache.sysml.test.integration.applications.pydml.PageRankPyDMLTest
Running org.apache.sysml.test.integration.applications.pydml.NaiveBayesParforPyDMLTest
Tests run: 6, Failures: 0, Errors: 0, Skipped: 0, Time elapsed: 80.96 sec - in org.apache.sysml.test.integration.applications.pydml.NaiveBayesParforPyDMLTest
Running org.apache.sysml.test.integration.applications.dml.NaiveBayesDMLTest
Tests run: 6, Failures: 0, Errors: 0, Skipped: 0, Time elapsed: 81.386 sec - in org.apache.sysml.test.integration.applications.dml.NaiveBayesDMLTest
Running org.apache.sysml.test.integration.applications.dml.MDABivariateStatsDMLTest
Tests run: 4, Failures: 0, Errors: 0, Skipped: 0, Time elapsed: 296.869 sec - in org.apache.sysml.test.integration.applications.dml.MDABivariateStatsDMLTest
Running org.apache.sysml.test.integration.applications.dml.PageRankDMLTest
Tests run: 3, Failures: 0, Errors: 0, Skipped: 0, Time elapsed: 6.239 sec - in org.apache.sysml.test.integration.applications.dml.PageRankDMLTest
Running org.apache.sysml.test.integration.applications.pydml.GLMPyDMLTest
Tests run: 30, Failures: 0, Errors: 0, Skipped: 0, Time elapsed: 586.367 sec - in org.apache.sysml.test.integration.applications.pydml.GLMPyDMLTest
Running org.apache.sysml.test.integration.applications.pydml.MultiClassSVMPyDMLTest
Tests run: 9, Failures: 0, Errors: 0, Skipped: 0, Time elapsed: 89.494 sec - in org.apache.sysml.test.integration.applications.pydml.MultiClassSVMPyDMLTest
Running org.apache.sysml.test.integration.applications.dml.ID3DMLTest
Tests run: 2, Failures: 0, Errors: 0, Skipped: 0, Time elapsed: 363.517 sec - in org.apache.sysml.test.integration.applications.dml.ID3DMLTest
Running org.apache.sysml.test.integration.applications.dml.GLMDMLTest
Tests run: 30, Failures: 0, Errors: 0, Skipped: 0, Time elapsed: 881.39 sec - in org.apache.sysml.test.integration.applications.dml.GLMDMLTest
Running org.apache.sysml.test.integration.applications.pydml.CsplineCGPyDMLTest
Tests run: 3, Failures: 0, Errors: 0, Skipped: 0, Time elapsed: 6.26 sec - in org.apache.sysml.test.integration.applications.pydml.CsplineCGPyDMLTest
Running org.apache.sysml.test.integration.applications.pydml.WelchTPyDMLTest
Tests run: 3, Failures: 0, Errors: 0, Skipped: 0, Time elapsed: 6.639 sec - in org.apache.sysml.test.integration.applications.pydml.WelchTPyDMLTest
Running org.apache.sysml.test.integration.applications.dml.MultiClassSVMDMLTest
Tests run: 9, Failures: 0, Errors: 0, Skipped: 0, Time elapsed: 89.223 sec - in org.apache.sysml.test.integration.applications.dml.MultiClassSVMDMLTest
Running org.apache.sysml.test.integration.applications.dml.CsplineDSDMLTest
Tests run: 3, Failures: 0, Errors: 0, Skipped: 0, Time elapsed: 16.506 sec - in org.apache.sysml.test.integration.applications.dml.CsplineDSDMLTest
Running org.apache.sysml.test.integration.applications.pydml.ApplyTransformPyDMLTest
Tests run: 7, Failures: 0, Errors: 0, Skipped: 0, Time elapsed: 1.333 sec - in org.apache.sysml.test.integration.applications.pydml.ApplyTransformPyDMLTest
Running org.apache.sysml.test.integration.applications.dml.NaiveBayesParforDMLTest
Tests run: 6, Failures: 0, Errors: 0, Skipped: 0, Time elapsed: 81.76 sec - in org.apache.sysml.test.integration.applications.dml.NaiveBayesParforDMLTest
Running org.apache.sysml.test.integration.applications.pydml.L2SVMPyDMLTest
Tests run: 9, Failures: 0, Errors: 0, Skipped: 0, Time elapsed: 64.19 sec - in org.apache.sysml.test.integration.applications.pydml.L2SVMPyDMLTest
Running org.apache.sysml.test.integration.applications.pydml.LinearRegressionPyDMLTest
Tests run: 7, Failures: 0, Errors: 0, Skipped: 0, Time elapsed: 51.503 sec - in org.apache.sysml.test.integration.applications.pydml.LinearRegressionPyDMLTest
Running org.apache.sysml.test.integration.applications.dml.LinearLogRegDMLTest
Tests run: 7, Failures: 0, Errors: 0, Skipped: 0, Time elapsed: 61.184 sec - in org.apache.sysml.test.integration.applications.dml.LinearLogRegDMLTest
Running org.apache.sysml.test.integration.applications.dml.GNMFDMLTest
Tests run: 3, Failures: 0, Errors: 0, Skipped: 0, Time elapsed: 58.747 sec - in org.apache.sysml.test.integration.applications.dml.GNMFDMLTest
Running org.apache.sysml.test.integration.applications.dml.WelchTDMLTest
Tests run: 3, Failures: 0, Errors: 0, Skipped: 0, Time elapsed: 6.624 sec - in org.apache.sysml.test.integration.applications.dml.WelchTDMLTest
Running org.apache.sysml.test.integration.applications.dml.ApplyTransformDMLTest
Tests run: 7, Failures: 0, Errors: 0, Skipped: 0, Time elapsed: 15.142 sec - in org.apache.sysml.test.integration.applications.dml.ApplyTransformDMLTest
Running org.apache.sysml.test.integration.applications.pydml.ID3PyDMLTest
Tests run: 2, Failures: 0, Errors: 0, Skipped: 0, Time elapsed: 332.061 sec - in org.apache.sysml.test.integration.applications.pydml.ID3PyDMLTest
Running org.apache.sysml.test.integration.applications.pydml.GNMFPyDMLTest
Tests run: 3, Failures: 0, Errors: 0, Skipped: 0, Time elapsed: 57.8 sec - in org.apache.sysml.test.integration.applications.pydml.GNMFPyDMLTest

Results :

Failed tests: 
  MLContextTest.testOutputDataFramePYDML:1024 expected:<0.0> but was:<1.0>
  MLContextTest.testOutputDataFrameDML:1004 expected:<0.0> but was:<1.0>

Tests run: 5795, Failures: 2, Errors: 0, Skipped: 0

[INFO] 
[INFO] --- maven-failsafe-plugin:2.17:verify (default) @ systemml ---
[INFO] Failsafe report directory: <https://sparktc.ibmcloud.com/jenkins/job/SystemML-DailyTest/ws/target/failsafe-reports>
[INFO] ------------------------------------------------------------------------
[INFO] BUILD FAILURE
[INFO] ------------------------------------------------------------------------
[INFO] Total time: 02:20 h
[INFO] Finished at: 2016-08-10T04:52:44-05:00
[INFO] Final Memory: 58M/2156M
[INFO] ------------------------------------------------------------------------
[ERROR] Failed to execute goal org.apache.maven.plugins:maven-failsafe-plugin:2.17:verify
(default) on project systemml: There are test failures.
[ERROR] 
[ERROR] Please refer to <https://sparktc.ibmcloud.com/jenkins/job/SystemML-DailyTest/ws/target/failsafe-reports>
for the individual test results.
[ERROR] -> [Help 1]
[ERROR] 
[ERROR] To see the full stack trace of the errors, re-run Maven with the -e switch.
[ERROR] Re-run Maven using the -X switch to enable full debug logging.
[ERROR] 
[ERROR] For more information about the errors and possible solutions, please read the following
articles:
[ERROR] [Help 1] http://cwiki.apache.org/confluence/display/MAVEN/MojoFailureException
Build step 'Execute shell' marked build as failure
Run condition [Always] enabling perform for step [[]]

Mime
View raw message