systemml-dev mailing list archives

Site index · List index
Message view « Date » · « Thread »
Top « Date » · « Thread »
From jenk...@spark.tc
Subject Build failed in Jenkins: SystemML-DailyTest #988
Date Sun, 14 May 2017 09:58:25 GMT
See <https://sparktc.ibmcloud.com/jenkins/job/SystemML-DailyTest/988/>

------------------------------------------
[...truncated 30142 lines...]
17/05/14 03:57:16 INFO executor.Executor: Finished task 0.0 in stage 3.0 (TID 3). 1253 bytes
result sent to driver
17/05/14 03:57:16 INFO scheduler.TaskSetManager: Starting task 0.0 in stage 4.0 (TID 4, localhost,
executor driver, partition 0, PROCESS_LOCAL, 6445 bytes)
17/05/14 03:57:16 INFO executor.Executor: Running task 0.0 in stage 4.0 (TID 4)
17/05/14 03:57:16 INFO scheduler.TaskSetManager: Finished task 0.0 in stage 3.0 (TID 3) in
12 ms on localhost (executor driver) (1/1)
17/05/14 03:57:16 INFO scheduler.TaskSchedulerImpl: Removed TaskSet 3.0, whose tasks have
all completed, from pool default
17/05/14 03:57:16 INFO scheduler.DAGScheduler: ShuffleMapStage 3 (parallelizePairs at SparkExecutionContext.java:706)
finished in 0.014 s
17/05/14 03:57:16 INFO scheduler.DAGScheduler: looking for newly runnable stages
17/05/14 03:57:16 INFO scheduler.DAGScheduler: running: Set(ShuffleMapStage 4)
17/05/14 03:57:16 INFO scheduler.DAGScheduler: waiting: Set(ResultStage 5)
17/05/14 03:57:16 INFO scheduler.DAGScheduler: failed: Set()
17/05/14 03:57:16 INFO executor.Executor: Finished task 0.0 in stage 4.0 (TID 4). 1253 bytes
result sent to driver
17/05/14 03:57:16 INFO scheduler.TaskSetManager: Finished task 0.0 in stage 4.0 (TID 4) in
9 ms on localhost (executor driver) (1/1)
17/05/14 03:57:16 INFO scheduler.TaskSchedulerImpl: Removed TaskSet 4.0, whose tasks have
all completed, from pool default
17/05/14 03:57:16 INFO scheduler.DAGScheduler: ShuffleMapStage 4 (parallelizePairs at SparkExecutionContext.java:706)
finished in 0.012 s
17/05/14 03:57:16 INFO scheduler.DAGScheduler: looking for newly runnable stages
17/05/14 03:57:16 INFO scheduler.DAGScheduler: running: Set()
17/05/14 03:57:16 INFO scheduler.DAGScheduler: waiting: Set(ResultStage 5)
17/05/14 03:57:16 INFO scheduler.DAGScheduler: failed: Set()
17/05/14 03:57:16 INFO scheduler.DAGScheduler: Submitting ResultStage 5 (MapPartitionsRDD[11]
at mapValues at BinarySPInstruction.java:117), which has no missing parents
17/05/14 03:57:16 INFO memory.MemoryStore: Block broadcast_5 stored as values in memory (estimated
size 4.2 KB, free 1033.8 MB)
17/05/14 03:57:16 INFO memory.MemoryStore: Block broadcast_5_piece0 stored as bytes in memory
(estimated size 2.3 KB, free 1033.8 MB)
17/05/14 03:57:16 INFO storage.BlockManagerInfo: Added broadcast_5_piece0 in memory on 169.54.146.43:50033
(size: 2.3 KB, free: 1033.8 MB)
17/05/14 03:57:16 INFO spark.SparkContext: Created broadcast 5 from broadcast at DAGScheduler.scala:996
17/05/14 03:57:16 INFO scheduler.DAGScheduler: Submitting 1 missing tasks from ResultStage
5 (MapPartitionsRDD[11] at mapValues at BinarySPInstruction.java:117)
17/05/14 03:57:16 INFO scheduler.TaskSchedulerImpl: Adding task set 5.0 with 1 tasks
17/05/14 03:57:16 INFO scheduler.FairSchedulableBuilder: Added task set TaskSet_5.0 tasks
to pool default
17/05/14 03:57:16 INFO scheduler.TaskSetManager: Starting task 0.0 in stage 5.0 (TID 5, localhost,
executor driver, partition 0, PROCESS_LOCAL, 5814 bytes)
17/05/14 03:57:16 INFO executor.Executor: Running task 0.0 in stage 5.0 (TID 5)
17/05/14 03:57:16 INFO storage.ShuffleBlockFetcherIterator: Getting 1 non-empty blocks out
of 1 blocks
17/05/14 03:57:16 INFO storage.ShuffleBlockFetcherIterator: Started 0 remote fetches in 0
ms
17/05/14 03:57:16 INFO storage.ShuffleBlockFetcherIterator: Getting 1 non-empty blocks out
of 1 blocks
17/05/14 03:57:16 INFO storage.ShuffleBlockFetcherIterator: Started 0 remote fetches in 0
ms
17/05/14 03:57:16 INFO executor.Executor: Finished task 0.0 in stage 5.0 (TID 5). 2240 bytes
result sent to driver
17/05/14 03:57:16 INFO scheduler.TaskSetManager: Finished task 0.0 in stage 5.0 (TID 5) in
14 ms on localhost (executor driver) (1/1)
17/05/14 03:57:16 INFO scheduler.TaskSchedulerImpl: Removed TaskSet 5.0, whose tasks have
all completed, from pool default
17/05/14 03:57:16 INFO scheduler.DAGScheduler: ResultStage 5 (collect at SparkExecutionContext.java:796)
finished in 0.015 s
17/05/14 03:57:16 INFO storage.BlockManagerInfo: Removed broadcast_5_piece0 on 169.54.146.43:50033
in memory (size: 2.3 KB, free: 1033.8 MB)
17/05/14 03:57:16 INFO storage.BlockManagerInfo: Removed broadcast_4_piece0 on 169.54.146.43:50033
in memory (size: 1305.0 B, free: 1033.8 MB)
17/05/14 03:57:16 INFO storage.BlockManagerInfo: Removed broadcast_3_piece0 on 169.54.146.43:50033
in memory (size: 1305.0 B, free: 1033.8 MB)
17/05/14 03:57:16 INFO spark.ContextCleaner: Cleaned shuffle 2
17/05/14 03:57:16 INFO spark.ContextCleaner: Cleaned shuffle 3
Running org.apache.sysml.test.integration.functions.quaternary.WeightedDivMatrixMultTest
Tests run: 90, Failures: 0, Errors: 0, Skipped: 0, Time elapsed: 1,509.32 sec - in org.apache.sysml.test.integration.functions.quaternary.WeightedDivMatrixMultTest
17/05/14 03:59:03 INFO util.ShutdownHookManager: Shutdown hook called
17/05/14 03:59:03 INFO util.ShutdownHookManager: Deleting directory /tmp/spark-dc85f75a-ca91-4139-8064-288cc87cbc05
17/05/14 03:59:09 INFO server.ServerConnector: Stopped ServerConnector@74e17d96{HTTP/1.1}{0.0.0.0:4040}
17/05/14 03:59:09 INFO handler.ContextHandler: Stopped o.s.j.s.ServletContextHandler@42be8c30{/stages/stage/kill,null,UNAVAILABLE}
17/05/14 03:59:09 INFO handler.ContextHandler: Stopped o.s.j.s.ServletContextHandler@44813133{/jobs/job/kill,null,UNAVAILABLE}
17/05/14 03:59:09 INFO handler.ContextHandler: Stopped o.s.j.s.ServletContextHandler@bd961b0{/api,null,UNAVAILABLE}
17/05/14 03:59:09 INFO handler.ContextHandler: Stopped o.s.j.s.ServletContextHandler@6eb86724{/,null,UNAVAILABLE}
17/05/14 03:59:09 INFO handler.ContextHandler: Stopped o.s.j.s.ServletContextHandler@6d9d648f{/static,null,UNAVAILABLE}
17/05/14 03:59:09 INFO handler.ContextHandler: Stopped o.s.j.s.ServletContextHandler@5e2226ae{/executors/threadDump/json,null,UNAVAILABLE}
17/05/14 03:59:09 INFO handler.ContextHandler: Stopped o.s.j.s.ServletContextHandler@12feff5c{/executors/threadDump,null,UNAVAILABLE}
17/05/14 03:59:09 INFO handler.ContextHandler: Stopped o.s.j.s.ServletContextHandler@1ae328b0{/executors/json,null,UNAVAILABLE}
17/05/14 03:59:09 INFO handler.ContextHandler: Stopped o.s.j.s.ServletContextHandler@1da5c520{/executors,null,UNAVAILABLE}
17/05/14 03:59:09 INFO handler.ContextHandler: Stopped o.s.j.s.ServletContextHandler@174b6b76{/environment/json,null,UNAVAILABLE}
17/05/14 03:59:09 INFO handler.ContextHandler: Stopped o.s.j.s.ServletContextHandler@7eded961{/environment,null,UNAVAILABLE}
17/05/14 03:59:09 INFO handler.ContextHandler: Stopped o.s.j.s.ServletContextHandler@4c79770b{/storage/rdd/json,null,UNAVAILABLE}
17/05/14 03:59:09 INFO handler.ContextHandler: Stopped o.s.j.s.ServletContextHandler@3567e067{/storage/rdd,null,UNAVAILABLE}
17/05/14 03:59:09 INFO handler.ContextHandler: Stopped o.s.j.s.ServletContextHandler@6c30b99d{/storage/json,null,UNAVAILABLE}
17/05/14 03:59:09 INFO handler.ContextHandler: Stopped o.s.j.s.ServletContextHandler@a470a57{/storage,null,UNAVAILABLE}
17/05/14 03:59:09 INFO handler.ContextHandler: Stopped o.s.j.s.ServletContextHandler@6b5256a6{/stages/pool/json,null,UNAVAILABLE}
17/05/14 03:59:09 INFO handler.ContextHandler: Stopped o.s.j.s.ServletContextHandler@26dffa36{/stages/pool,null,UNAVAILABLE}
17/05/14 03:59:09 INFO handler.ContextHandler: Stopped o.s.j.s.ServletContextHandler@27c83b31{/stages/stage/json,null,UNAVAILABLE}
17/05/14 03:59:09 INFO handler.ContextHandler: Stopped o.s.j.s.ServletContextHandler@b5d553e{/stages/stage,null,UNAVAILABLE}
17/05/14 03:59:09 INFO handler.ContextHandler: Stopped o.s.j.s.ServletContextHandler@664560b3{/stages/json,null,UNAVAILABLE}
17/05/14 03:59:09 INFO handler.ContextHandler: Stopped o.s.j.s.ServletContextHandler@584b3bad{/stages,null,UNAVAILABLE}
17/05/14 03:59:09 INFO handler.ContextHandler: Stopped o.s.j.s.ServletContextHandler@4e8c46b2{/jobs/job/json,null,UNAVAILABLE}
17/05/14 03:59:09 INFO handler.ContextHandler: Stopped o.s.j.s.ServletContextHandler@65511499{/jobs/job,null,UNAVAILABLE}
17/05/14 03:59:09 INFO handler.ContextHandler: Stopped o.s.j.s.ServletContextHandler@24734867{/jobs/json,null,UNAVAILABLE}
17/05/14 03:59:09 INFO handler.ContextHandler: Stopped o.s.j.s.ServletContextHandler@65be7deb{/jobs,null,UNAVAILABLE}
17/05/14 03:59:09 INFO ui.SparkUI: Stopped Spark web UI at http://169.54.146.43:4040
17/05/14 03:59:09 INFO spark.MapOutputTrackerMasterEndpoint: MapOutputTrackerMasterEndpoint
stopped!
17/05/14 03:59:09 INFO memory.MemoryStore: MemoryStore cleared
17/05/14 03:59:09 INFO storage.BlockManager: BlockManager stopped
17/05/14 03:59:09 INFO storage.BlockManagerMaster: BlockManagerMaster stopped
17/05/14 03:59:09 INFO scheduler.OutputCommitCoordinator$OutputCommitCoordinatorEndpoint:
OutputCommitCoordinator stopped!
17/05/14 03:59:09 INFO spark.SparkContext: Successfully stopped SparkContext
Running org.apache.sysml.test.integration.scripts.nn.NNTest
Tests run: 1, Failures: 0, Errors: 0, Skipped: 0, Time elapsed: 553.764 sec - in org.apache.sysml.test.integration.scripts.nn.NNTest
17/05/14 03:59:09 INFO util.ShutdownHookManager: Shutdown hook called
17/05/14 03:59:09 INFO util.ShutdownHookManager: Deleting directory /tmp/spark-b3e7b47f-e11f-40cd-a31d-406db5184128
Running org.apache.sysml.test.integration.applications.descriptivestats.UnivariateWeightedScaleDenseTest
Tests run: 24, Failures: 0, Errors: 0, Skipped: 0, Time elapsed: 342.249 sec - in org.apache.sysml.test.integration.applications.descriptivestats.UnivariateWeightedScaleDenseTest
Running org.apache.sysml.test.integration.applications.parfor.ParForNaiveBayesTest
Tests run: 10, Failures: 0, Errors: 0, Skipped: 0, Time elapsed: 525.919 sec - in org.apache.sysml.test.integration.applications.parfor.ParForNaiveBayesTest
Running org.apache.sysml.test.integration.functions.append.AppendChainTest
Tests run: 12, Failures: 0, Errors: 0, Skipped: 0, Time elapsed: 1,046.735 sec - in org.apache.sysml.test.integration.functions.append.AppendChainTest
Running org.apache.sysml.test.integration.applications.descriptivestats.UnivariateUnweightedScaleSparseTest
Tests run: 24, Failures: 0, Errors: 0, Skipped: 0, Time elapsed: 276.79 sec - in org.apache.sysml.test.integration.applications.descriptivestats.UnivariateUnweightedScaleSparseTest
Running org.apache.sysml.test.integration.applications.dml.HITSDMLTest
Tests run: 1, Failures: 0, Errors: 0, Skipped: 0, Time elapsed: 89.411 sec - in org.apache.sysml.test.integration.applications.dml.HITSDMLTest
Running org.apache.sysml.test.integration.functions.append.AppendMatrixTest
Tests run: 22, Failures: 0, Errors: 0, Skipped: 0, Time elapsed: 1,431.478 sec - in org.apache.sysml.test.integration.functions.append.AppendMatrixTest
Running org.apache.sysml.test.integration.applications.descriptivestats.UnivariateWeightedScaleSparseTest
Tests run: 24, Failures: 0, Errors: 0, Skipped: 0, Time elapsed: 368.72 sec - in org.apache.sysml.test.integration.applications.descriptivestats.UnivariateWeightedScaleSparseTest
Running org.apache.sysml.test.integration.applications.pydml.ArimaPyDMLTest
Tests run: 1, Failures: 0, Errors: 0, Skipped: 0, Time elapsed: 49.731 sec - in org.apache.sysml.test.integration.applications.pydml.ArimaPyDMLTest
Running org.apache.sysml.test.integration.applications.pydml.HITSPyDMLTest
Tests run: 1, Failures: 0, Errors: 0, Skipped: 0, Time elapsed: 77.599 sec - in org.apache.sysml.test.integration.applications.pydml.HITSPyDMLTest
Running org.apache.sysml.test.integration.applications.dml.LinearRegressionDMLTest
Tests run: 7, Failures: 0, Errors: 0, Skipped: 0, Time elapsed: 50.745 sec - in org.apache.sysml.test.integration.applications.dml.LinearRegressionDMLTest
Running org.apache.sysml.test.integration.applications.pydml.CsplineDSPyDMLTest
Tests run: 3, Failures: 0, Errors: 0, Skipped: 0, Time elapsed: 6.731 sec - in org.apache.sysml.test.integration.applications.pydml.CsplineDSPyDMLTest
Running org.apache.sysml.test.integration.applications.pydml.LinearLogRegPyDMLTest
Tests run: 7, Failures: 0, Errors: 0, Skipped: 0, Time elapsed: 85.414 sec - in org.apache.sysml.test.integration.applications.pydml.LinearLogRegPyDMLTest
Running org.apache.sysml.test.integration.applications.pydml.NaiveBayesPyDMLTest
Tests run: 6, Failures: 0, Errors: 0, Skipped: 0, Time elapsed: 80.757 sec - in org.apache.sysml.test.integration.applications.pydml.NaiveBayesPyDMLTest
Running org.apache.sysml.test.integration.applications.dml.CsplineCGDMLTest
Tests run: 3, Failures: 0, Errors: 0, Skipped: 0, Time elapsed: 17.38 sec - in org.apache.sysml.test.integration.applications.dml.CsplineCGDMLTest
Running org.apache.sysml.test.integration.applications.dml.L2SVMDMLTest
Tests run: 9, Failures: 0, Errors: 0, Skipped: 0, Time elapsed: 63.616 sec - in org.apache.sysml.test.integration.applications.dml.L2SVMDMLTest
Running org.apache.sysml.test.integration.applications.pydml.MDABivariateStatsPyDMLTest
Tests run: 4, Failures: 0, Errors: 0, Skipped: 0, Time elapsed: 293.118 sec - in org.apache.sysml.test.integration.applications.pydml.MDABivariateStatsPyDMLTest
Running org.apache.sysml.test.integration.applications.pydml.PageRankPyDMLTest
Tests run: 3, Failures: 0, Errors: 0, Skipped: 0, Time elapsed: 8.422 sec - in org.apache.sysml.test.integration.applications.pydml.PageRankPyDMLTest
Running org.apache.sysml.test.integration.applications.pydml.NaiveBayesParforPyDMLTest
Tests run: 6, Failures: 0, Errors: 0, Skipped: 0, Time elapsed: 80.963 sec - in org.apache.sysml.test.integration.applications.pydml.NaiveBayesParforPyDMLTest
Running org.apache.sysml.test.integration.applications.dml.NaiveBayesDMLTest
Tests run: 6, Failures: 0, Errors: 0, Skipped: 0, Time elapsed: 81.12 sec - in org.apache.sysml.test.integration.applications.dml.NaiveBayesDMLTest
Running org.apache.sysml.test.integration.applications.dml.MDABivariateStatsDMLTest
Tests run: 4, Failures: 0, Errors: 0, Skipped: 0, Time elapsed: 294.331 sec - in org.apache.sysml.test.integration.applications.dml.MDABivariateStatsDMLTest
Running org.apache.sysml.test.integration.applications.dml.PageRankDMLTest
Tests run: 3, Failures: 0, Errors: 0, Skipped: 0, Time elapsed: 8.422 sec - in org.apache.sysml.test.integration.applications.dml.PageRankDMLTest
Running org.apache.sysml.test.integration.applications.pydml.GLMPyDMLTest
Tests run: 30, Failures: 0, Errors: 0, Skipped: 0, Time elapsed: 588.367 sec - in org.apache.sysml.test.integration.applications.pydml.GLMPyDMLTest
Running org.apache.sysml.test.integration.applications.pydml.MultiClassSVMPyDMLTest
Tests run: 9, Failures: 0, Errors: 0, Skipped: 0, Time elapsed: 88.955 sec - in org.apache.sysml.test.integration.applications.pydml.MultiClassSVMPyDMLTest
Running org.apache.sysml.test.integration.applications.dml.ID3DMLTest
Tests run: 2, Failures: 0, Errors: 0, Skipped: 0, Time elapsed: 394.107 sec - in org.apache.sysml.test.integration.applications.dml.ID3DMLTest
Running org.apache.sysml.test.integration.applications.dml.GLMDMLTest
Tests run: 30, Failures: 0, Errors: 0, Skipped: 0, Time elapsed: 876.909 sec - in org.apache.sysml.test.integration.applications.dml.GLMDMLTest
Running org.apache.sysml.test.integration.applications.pydml.CsplineCGPyDMLTest
Tests run: 3, Failures: 0, Errors: 0, Skipped: 0, Time elapsed: 6.031 sec - in org.apache.sysml.test.integration.applications.pydml.CsplineCGPyDMLTest
Running org.apache.sysml.test.integration.applications.pydml.WelchTPyDMLTest
Tests run: 3, Failures: 0, Errors: 0, Skipped: 0, Time elapsed: 6.475 sec - in org.apache.sysml.test.integration.applications.pydml.WelchTPyDMLTest
Running org.apache.sysml.test.integration.applications.dml.MultiClassSVMDMLTest
Tests run: 9, Failures: 0, Errors: 0, Skipped: 0, Time elapsed: 90.557 sec - in org.apache.sysml.test.integration.applications.dml.MultiClassSVMDMLTest
Running org.apache.sysml.test.integration.applications.dml.CsplineDSDMLTest
Tests run: 3, Failures: 0, Errors: 0, Skipped: 0, Time elapsed: 16.32 sec - in org.apache.sysml.test.integration.applications.dml.CsplineDSDMLTest
Running org.apache.sysml.test.integration.applications.pydml.ApplyTransformPyDMLTest
Tests run: 7, Failures: 0, Errors: 0, Skipped: 0, Time elapsed: 1.1 sec - in org.apache.sysml.test.integration.applications.pydml.ApplyTransformPyDMLTest
Running org.apache.sysml.test.integration.applications.dml.NaiveBayesParforDMLTest
Tests run: 6, Failures: 0, Errors: 0, Skipped: 0, Time elapsed: 80.994 sec - in org.apache.sysml.test.integration.applications.dml.NaiveBayesParforDMLTest
Running org.apache.sysml.test.integration.applications.pydml.L2SVMPyDMLTest
Tests run: 9, Failures: 0, Errors: 0, Skipped: 0, Time elapsed: 63.762 sec - in org.apache.sysml.test.integration.applications.pydml.L2SVMPyDMLTest
Running org.apache.sysml.test.integration.applications.pydml.LinearRegressionPyDMLTest
Tests run: 7, Failures: 0, Errors: 0, Skipped: 0, Time elapsed: 50.787 sec - in org.apache.sysml.test.integration.applications.pydml.LinearRegressionPyDMLTest
Running org.apache.sysml.test.integration.applications.dml.LinearLogRegDMLTest
Tests run: 7, Failures: 0, Errors: 0, Skipped: 0, Time elapsed: 60.637 sec - in org.apache.sysml.test.integration.applications.dml.LinearLogRegDMLTest
Running org.apache.sysml.test.integration.applications.dml.GNMFDMLTest
Tests run: 3, Failures: 0, Errors: 0, Skipped: 0, Time elapsed: 59.402 sec - in org.apache.sysml.test.integration.applications.dml.GNMFDMLTest
Running org.apache.sysml.test.integration.applications.dml.WelchTDMLTest
Tests run: 3, Failures: 0, Errors: 0, Skipped: 0, Time elapsed: 6.39 sec - in org.apache.sysml.test.integration.applications.dml.WelchTDMLTest
Running org.apache.sysml.test.integration.applications.dml.ApplyTransformDMLTest
Tests run: 7, Failures: 0, Errors: 0, Skipped: 0, Time elapsed: 8.853 sec - in org.apache.sysml.test.integration.applications.dml.ApplyTransformDMLTest
Running org.apache.sysml.test.integration.applications.pydml.ID3PyDMLTest
Tests run: 2, Failures: 0, Errors: 0, Skipped: 0, Time elapsed: 379.837 sec - in org.apache.sysml.test.integration.applications.pydml.ID3PyDMLTest
Running org.apache.sysml.test.integration.applications.pydml.GNMFPyDMLTest
Tests run: 3, Failures: 0, Errors: 0, Skipped: 0, Time elapsed: 57.215 sec - in org.apache.sysml.test.integration.applications.pydml.GNMFPyDMLTest

Results :

Failed tests: 
  ParForDataPartitionLeftIndexingTest.testParForDataPartitionLeftindexingRowSparseMR:103->runParForDataPartitionLeftindexingTest:157->AutomatedTestBase.runTest:1264
failed to run script ./src/test/scripts/functions/parfor/parfor_rdatapartition_leftindexing.dml
exception: org.apache.sysml.api.DMLException: org.apache.sysml.runtime.DMLRuntimeException:
org.apache.sysml.runtime.DMLRuntimeException: PARFOR: Failed to execute loop in parallel.
message: org.apache.sysml.runtime.DMLRuntimeException: org.apache.sysml.runtime.DMLRuntimeException:
PARFOR: Failed to execute loop in parallel.
stack trace:
>org.apache.sysml.api.DMLScript.executeScript(DMLScript.java:533)
>org.apache.sysml.api.DMLScript.main(DMLScript.java:233)
>org.apache.sysml.test.integration.AutomatedTestBase.runTest(AutomatedTestBase.java:1244)
>org.apache.sysml.test.integration.functions.parfor.ParForDataPartitionLeftIndexingTest.runParForDataPartitionLeftindexingTest(ParForDataPartitionLeftIndexingTest.java:157)
>org.apache.sysml.test.integration.functions.parfor.ParForDataPartitionLeftIndexingTest.testParForDataPartitionLeftindexingRowSparseMR(ParForDataPartitionLeftIndexingTest.java:103)
>sun.reflect.NativeMethodAccessorImpl.invoke0(Native Method)
>sun.reflect.NativeMethodAccessorImpl.invoke(NativeMethodAccessorImpl.java:62)
>sun.reflect.DelegatingMethodAccessorImpl.invoke(DelegatingMethodAccessorImpl.java:43)
>java.lang.reflect.Method.invoke(Method.java:497)
>org.junit.runners.model.FrameworkMethod$1.runReflectiveCall(FrameworkMethod.java:47)
>org.junit.internal.runners.model.ReflectiveCallable.run(ReflectiveCallable.java:12)
>org.junit.runners.model.FrameworkMethod.invokeExplosively(FrameworkMethod.java:44)
>org.junit.internal.runners.statements.InvokeMethod.evaluate(InvokeMethod.java:17)
>org.junit.internal.runners.statements.RunBefores.evaluate(RunBefores.java:26)
>org.junit.internal.runners.statements.RunAfters.evaluate(RunAfters.java:27)
>org.junit.runners.ParentRunner.runLeaf(ParentRunner.java:271)
>org.junit.runners.BlockJUnit4ClassRunner.runChild(BlockJUnit4ClassRunner.java:70)
>org.junit.runners.BlockJUnit4ClassRunner.runChild(BlockJUnit4ClassRunner.java:50)
>org.junit.runners.ParentRunner$3.run(ParentRunner.java:238)
>org.apache.maven.surefire.junitcore.pc.Scheduler$1.run(Scheduler.java:318)
>org.apache.maven.surefire.junitcore.pc.InvokerStrategy.schedule(InvokerStrategy.java:41)
>org.apache.maven.surefire.junitcore.pc.Scheduler.schedule(Scheduler.java:274)
>org.junit.runners.ParentRunner.runChildren(ParentRunner.java:236)
>org.junit.runners.ParentRunner.access$000(ParentRunner.java:53)
>org.junit.runners.ParentRunner$2.evaluate(ParentRunner.java:229)
>org.junit.runners.ParentRunner.run(ParentRunner.java:309)
>org.junit.runners.Suite.runChild(Suite.java:127)
>org.junit.runners.Suite.runChild(Suite.java:26)
>org.junit.runners.ParentRunner$3.run(ParentRunner.java:238)
>org.apache.maven.surefire.junitcore.pc.Scheduler$1.run(Scheduler.java:318)
>org.apache.maven.surefire.junitcore.pc.InvokerStrategy.schedule(InvokerStrategy.java:41)
>org.apache.maven.surefire.junitcore.pc.Scheduler.schedule(Scheduler.java:274)
>org.junit.runners.ParentRunner.runChildren(ParentRunner.java:236)
>org.junit.runners.ParentRunner.access$000(ParentRunner.java:53)
>org.junit.runners.ParentRunner$2.evaluate(ParentRunner.java:229)
>org.junit.runners.ParentRunner.run(ParentRunner.java:309)
>org.junit.runners.Suite.runChild(Suite.java:127)
>org.junit.runners.Suite.runChild(Suite.java:26)
>org.junit.runners.ParentRunner$3.run(ParentRunner.java:238)
>org.apache.maven.surefire.junitcore.pc.Scheduler$1.run(Scheduler.java:318)
>org.apache.maven.surefire.junitcore.pc.InvokerStrategy.schedule(InvokerStrategy.java:41)
>org.apache.maven.surefire.junitcore.pc.Scheduler.schedule(Scheduler.java:274)
>org.junit.runners.ParentRunner.runChildren(ParentRunner.java:236)
>org.junit.runners.ParentRunner.access$000(ParentRunner.java:53)
>org.junit.runners.ParentRunner$2.evaluate(ParentRunner.java:229)
>org.junit.runners.ParentRunner.run(ParentRunner.java:309)
>org.apache.maven.surefire.junitcore.pc.ParallelComputerBuilder$PC$2.run(ParallelComputerBuilder.java:491)
>org.junit.runner.JUnitCore.run(JUnitCore.java:160)
>org.junit.runner.JUnitCore.run(JUnitCore.java:138)
>org.apache.maven.surefire.junitcore.JUnitCoreWrapper.createRequestAndRun(JUnitCoreWrapper.java:113)
>org.apache.maven.surefire.junitcore.JUnitCoreWrapper.executeEager(JUnitCoreWrapper.java:85)
>org.apache.maven.surefire.junitcore.JUnitCoreWrapper.execute(JUnitCoreWrapper.java:54)
>org.apache.maven.surefire.junitcore.JUnitCoreProvider.invoke(JUnitCoreProvider.java:134)
>org.apache.maven.surefire.booter.ForkedBooter.invokeProviderInSameClassLoader(ForkedBooter.java:200)
>org.apache.maven.surefire.booter.ForkedBooter.runSuitesInProcess(ForkedBooter.java:153)
>org.apache.maven.surefire.booter.ForkedBooter.main(ForkedBooter.java:103)

Tests run: 6951, Failures: 1, Errors: 0, Skipped: 0

[INFO] 
[INFO] --- maven-failsafe-plugin:2.17:verify (default) @ systemml ---
[INFO] Failsafe report directory: <https://sparktc.ibmcloud.com/jenkins/job/SystemML-DailyTest/ws/target/failsafe-reports>
[INFO] ------------------------------------------------------------------------
[INFO] BUILD FAILURE
[INFO] ------------------------------------------------------------------------
[INFO] Total time: 02:25 h
[INFO] Finished at: 2017-05-14T04:58:25-05:00
[INFO] Final Memory: 62M/2472M
[INFO] ------------------------------------------------------------------------
[ERROR] Failed to execute goal org.apache.maven.plugins:maven-failsafe-plugin:2.17:verify
(default) on project systemml: There are test failures.
[ERROR] 
[ERROR] Please refer to <https://sparktc.ibmcloud.com/jenkins/job/SystemML-DailyTest/ws/target/failsafe-reports>
for the individual test results.
[ERROR] -> [Help 1]
[ERROR] 
[ERROR] To see the full stack trace of the errors, re-run Maven with the -e switch.
[ERROR] Re-run Maven using the -X switch to enable full debug logging.
[ERROR] 
[ERROR] For more information about the errors and possible solutions, please read the following
articles:
[ERROR] [Help 1] http://cwiki.apache.org/confluence/display/MAVEN/MojoFailureException
Build step 'Execute shell' marked build as failure
Run condition [Always] enabling perform for step [[]]

Mime
View raw message