systemml-dev mailing list archives

Site index · List index
Message view « Date » · « Thread »
Top « Date » · « Thread »
From jenk...@spark.tc
Subject Build failed in Jenkins: SystemML-DailyTest #1115
Date Sun, 16 Jul 2017 22:26:01 GMT
See <https://sparktc.ibmcloud.com/jenkins/job/SystemML-DailyTest/1115/>

------------------------------------------
[...truncated 28761 lines...]
17/07/16 16:24:55 INFO storage.ShuffleBlockFetcherIterator: Started 0 remote fetches in 7
ms
17/07/16 16:24:55 INFO storage.ShuffleBlockFetcherIterator: Getting 1 non-empty blocks out
of 1 blocks
17/07/16 16:24:55 INFO storage.ShuffleBlockFetcherIterator: Started 0 remote fetches in 1
ms
17/07/16 16:24:55 INFO executor.Executor: Finished task 0.0 in stage 2.0 (TID 2). 2164 bytes
result sent to driver
17/07/16 16:24:55 INFO scheduler.TaskSetManager: Finished task 0.0 in stage 2.0 (TID 2) in
80 ms on localhost (executor driver) (1/1)
17/07/16 16:24:55 INFO scheduler.TaskSchedulerImpl: Removed TaskSet 2.0, whose tasks have
all completed, from pool default
17/07/16 16:24:55 INFO scheduler.DAGScheduler: ResultStage 2 (collect at SparkExecutionContext.java:789)
finished in 0.082 s
17/07/16 16:24:55 INFO spark.ContextCleaner: Cleaned shuffle 0
17/07/16 16:24:55 INFO spark.ContextCleaner: Cleaned shuffle 1
17/07/16 16:24:55 INFO storage.BlockManagerInfo: Removed broadcast_0_piece0 on 169.54.146.43:56227
in memory (size: 1305.0 B, free: 1033.8 MB)
17/07/16 16:24:55 INFO storage.BlockManagerInfo: Removed broadcast_1_piece0 on 169.54.146.43:56227
in memory (size: 1302.0 B, free: 1033.8 MB)
17/07/16 16:24:55 INFO storage.BlockManagerInfo: Removed broadcast_2_piece0 on 169.54.146.43:56227
in memory (size: 2.3 KB, free: 1033.8 MB)
17/07/16 16:24:56 INFO scheduler.DAGScheduler: Registering RDD 6 (parallelizePairs at SparkExecutionContext.java:699)
17/07/16 16:24:56 INFO scheduler.DAGScheduler: Registering RDD 7 (parallelizePairs at SparkExecutionContext.java:699)
17/07/16 16:24:56 INFO scheduler.DAGScheduler: Got job 1 (collect at SparkExecutionContext.java:789)
with 1 output partitions
17/07/16 16:24:56 INFO scheduler.DAGScheduler: Final stage: ResultStage 5 (collect at SparkExecutionContext.java:789)
17/07/16 16:24:56 INFO scheduler.DAGScheduler: Parents of final stage: List(ShuffleMapStage
3, ShuffleMapStage 4)
17/07/16 16:24:56 INFO scheduler.DAGScheduler: Missing parents: List(ShuffleMapStage 3, ShuffleMapStage
4)
17/07/16 16:24:56 INFO scheduler.DAGScheduler: Submitting ShuffleMapStage 3 (ParallelCollectionRDD[6]
at parallelizePairs at SparkExecutionContext.java:699), which has no missing parents
17/07/16 16:24:56 INFO memory.MemoryStore: Block broadcast_3 stored as values in memory (estimated
size 2032.0 B, free 1033.8 MB)
17/07/16 16:24:56 INFO memory.MemoryStore: Block broadcast_3_piece0 stored as bytes in memory
(estimated size 1305.0 B, free 1033.8 MB)
17/07/16 16:24:56 INFO storage.BlockManagerInfo: Added broadcast_3_piece0 in memory on 169.54.146.43:56227
(size: 1305.0 B, free: 1033.8 MB)
17/07/16 16:24:56 INFO spark.SparkContext: Created broadcast 3 from broadcast at DAGScheduler.scala:996
17/07/16 16:24:56 INFO scheduler.DAGScheduler: Submitting 1 missing tasks from ShuffleMapStage
3 (ParallelCollectionRDD[6] at parallelizePairs at SparkExecutionContext.java:699)
17/07/16 16:24:56 INFO scheduler.TaskSchedulerImpl: Adding task set 3.0 with 1 tasks
17/07/16 16:24:56 INFO scheduler.FairSchedulableBuilder: Added task set TaskSet_3.0 tasks
to pool default
17/07/16 16:24:56 INFO scheduler.DAGScheduler: Submitting ShuffleMapStage 4 (ParallelCollectionRDD[7]
at parallelizePairs at SparkExecutionContext.java:699), which has no missing parents
17/07/16 16:24:56 INFO scheduler.TaskSetManager: Starting task 0.0 in stage 3.0 (TID 3, localhost,
executor driver, partition 0, PROCESS_LOCAL, 6445 bytes)
17/07/16 16:24:56 INFO executor.Executor: Running task 0.0 in stage 3.0 (TID 3)
17/07/16 16:24:56 INFO memory.MemoryStore: Block broadcast_4 stored as values in memory (estimated
size 2032.0 B, free 1033.8 MB)
17/07/16 16:24:56 INFO memory.MemoryStore: Block broadcast_4_piece0 stored as bytes in memory
(estimated size 1305.0 B, free 1033.8 MB)
17/07/16 16:24:56 INFO storage.BlockManagerInfo: Added broadcast_4_piece0 in memory on 169.54.146.43:56227
(size: 1305.0 B, free: 1033.8 MB)
17/07/16 16:24:56 INFO spark.SparkContext: Created broadcast 4 from broadcast at DAGScheduler.scala:996
17/07/16 16:24:56 INFO scheduler.DAGScheduler: Submitting 1 missing tasks from ShuffleMapStage
4 (ParallelCollectionRDD[7] at parallelizePairs at SparkExecutionContext.java:699)
17/07/16 16:24:56 INFO scheduler.TaskSchedulerImpl: Adding task set 4.0 with 1 tasks
17/07/16 16:24:56 INFO scheduler.FairSchedulableBuilder: Added task set TaskSet_4.0 tasks
to pool default
17/07/16 16:24:56 INFO executor.Executor: Finished task 0.0 in stage 3.0 (TID 3). 1253 bytes
result sent to driver
17/07/16 16:24:56 INFO scheduler.TaskSetManager: Starting task 0.0 in stage 4.0 (TID 4, localhost,
executor driver, partition 0, PROCESS_LOCAL, 6445 bytes)
17/07/16 16:24:56 INFO executor.Executor: Running task 0.0 in stage 4.0 (TID 4)
17/07/16 16:24:56 INFO scheduler.TaskSetManager: Finished task 0.0 in stage 3.0 (TID 3) in
13 ms on localhost (executor driver) (1/1)
17/07/16 16:24:56 INFO scheduler.TaskSchedulerImpl: Removed TaskSet 3.0, whose tasks have
all completed, from pool default
17/07/16 16:24:56 INFO scheduler.DAGScheduler: ShuffleMapStage 3 (parallelizePairs at SparkExecutionContext.java:699)
finished in 0.014 s
17/07/16 16:24:56 INFO scheduler.DAGScheduler: looking for newly runnable stages
17/07/16 16:24:56 INFO scheduler.DAGScheduler: running: Set(ShuffleMapStage 4)
17/07/16 16:24:56 INFO scheduler.DAGScheduler: waiting: Set(ResultStage 5)
17/07/16 16:24:56 INFO scheduler.DAGScheduler: failed: Set()
17/07/16 16:24:56 INFO executor.Executor: Finished task 0.0 in stage 4.0 (TID 4). 1253 bytes
result sent to driver
17/07/16 16:24:56 INFO scheduler.TaskSetManager: Finished task 0.0 in stage 4.0 (TID 4) in
12 ms on localhost (executor driver) (1/1)
17/07/16 16:24:56 INFO scheduler.TaskSchedulerImpl: Removed TaskSet 4.0, whose tasks have
all completed, from pool default
17/07/16 16:24:56 INFO scheduler.DAGScheduler: ShuffleMapStage 4 (parallelizePairs at SparkExecutionContext.java:699)
finished in 0.014 s
17/07/16 16:24:56 INFO scheduler.DAGScheduler: looking for newly runnable stages
17/07/16 16:24:56 INFO scheduler.DAGScheduler: running: Set()
17/07/16 16:24:56 INFO scheduler.DAGScheduler: waiting: Set(ResultStage 5)
17/07/16 16:24:56 INFO scheduler.DAGScheduler: failed: Set()
17/07/16 16:24:56 INFO scheduler.DAGScheduler: Submitting ResultStage 5 (MapPartitionsRDD[11]
at mapValues at BinarySPInstruction.java:117), which has no missing parents
17/07/16 16:24:56 INFO memory.MemoryStore: Block broadcast_5 stored as values in memory (estimated
size 4.2 KB, free 1033.8 MB)
17/07/16 16:24:56 INFO memory.MemoryStore: Block broadcast_5_piece0 stored as bytes in memory
(estimated size 2.3 KB, free 1033.8 MB)
17/07/16 16:24:56 INFO storage.BlockManagerInfo: Added broadcast_5_piece0 in memory on 169.54.146.43:56227
(size: 2.3 KB, free: 1033.8 MB)
17/07/16 16:24:56 INFO spark.SparkContext: Created broadcast 5 from broadcast at DAGScheduler.scala:996
17/07/16 16:24:56 INFO scheduler.DAGScheduler: Submitting 1 missing tasks from ResultStage
5 (MapPartitionsRDD[11] at mapValues at BinarySPInstruction.java:117)
17/07/16 16:24:56 INFO scheduler.TaskSchedulerImpl: Adding task set 5.0 with 1 tasks
17/07/16 16:24:56 INFO scheduler.FairSchedulableBuilder: Added task set TaskSet_5.0 tasks
to pool default
17/07/16 16:24:56 INFO scheduler.TaskSetManager: Starting task 0.0 in stage 5.0 (TID 5, localhost,
executor driver, partition 0, PROCESS_LOCAL, 5814 bytes)
17/07/16 16:24:56 INFO executor.Executor: Running task 0.0 in stage 5.0 (TID 5)
17/07/16 16:24:56 INFO storage.ShuffleBlockFetcherIterator: Getting 1 non-empty blocks out
of 1 blocks
17/07/16 16:24:56 INFO storage.ShuffleBlockFetcherIterator: Started 0 remote fetches in 1
ms
17/07/16 16:24:56 INFO storage.ShuffleBlockFetcherIterator: Getting 1 non-empty blocks out
of 1 blocks
17/07/16 16:24:56 INFO storage.ShuffleBlockFetcherIterator: Started 0 remote fetches in 0
ms
17/07/16 16:24:56 INFO executor.Executor: Finished task 0.0 in stage 5.0 (TID 5). 2240 bytes
result sent to driver
17/07/16 16:24:56 INFO scheduler.TaskSetManager: Finished task 0.0 in stage 5.0 (TID 5) in
14 ms on localhost (executor driver) (1/1)
17/07/16 16:24:56 INFO scheduler.TaskSchedulerImpl: Removed TaskSet 5.0, whose tasks have
all completed, from pool default
17/07/16 16:24:56 INFO scheduler.DAGScheduler: ResultStage 5 (collect at SparkExecutionContext.java:789)
finished in 0.015 s
17/07/16 16:24:56 INFO storage.BlockManagerInfo: Removed broadcast_5_piece0 on 169.54.146.43:56227
in memory (size: 2.3 KB, free: 1033.8 MB)
17/07/16 16:24:56 INFO storage.BlockManagerInfo: Removed broadcast_4_piece0 on 169.54.146.43:56227
in memory (size: 1305.0 B, free: 1033.8 MB)
17/07/16 16:24:56 INFO storage.BlockManagerInfo: Removed broadcast_3_piece0 on 169.54.146.43:56227
in memory (size: 1305.0 B, free: 1033.8 MB)
17/07/16 16:24:56 INFO spark.ContextCleaner: Cleaned shuffle 2
17/07/16 16:24:56 INFO spark.ContextCleaner: Cleaned shuffle 3
Running org.apache.sysml.test.integration.functions.quaternary.WeightedDivMatrixMultTest
Tests run: 90, Failures: 0, Errors: 0, Skipped: 0, Time elapsed: 1,512.642 sec - in org.apache.sysml.test.integration.functions.quaternary.WeightedDivMatrixMultTest
17/07/16 16:27:21 INFO util.ShutdownHookManager: Shutdown hook called
17/07/16 16:27:21 INFO util.ShutdownHookManager: Deleting directory /tmp/spark-0d7bfeaa-b604-4a9d-b1be-192a333db18f
17/07/16 16:27:24 INFO server.ServerConnector: Stopped ServerConnector@21da56d7{HTTP/1.1}{0.0.0.0:4040}
17/07/16 16:27:24 INFO handler.ContextHandler: Stopped o.s.j.s.ServletContextHandler@3069f475{/stages/stage/kill,null,UNAVAILABLE}
17/07/16 16:27:24 INFO handler.ContextHandler: Stopped o.s.j.s.ServletContextHandler@27743a1b{/jobs/job/kill,null,UNAVAILABLE}
17/07/16 16:27:24 INFO handler.ContextHandler: Stopped o.s.j.s.ServletContextHandler@5c367b38{/api,null,UNAVAILABLE}
17/07/16 16:27:24 INFO handler.ContextHandler: Stopped o.s.j.s.ServletContextHandler@692d85b9{/,null,UNAVAILABLE}
17/07/16 16:27:24 INFO handler.ContextHandler: Stopped o.s.j.s.ServletContextHandler@55885050{/static,null,UNAVAILABLE}
17/07/16 16:27:24 INFO handler.ContextHandler: Stopped o.s.j.s.ServletContextHandler@41a753c6{/executors/threadDump/json,null,UNAVAILABLE}
17/07/16 16:27:24 INFO handler.ContextHandler: Stopped o.s.j.s.ServletContextHandler@390195f9{/executors/threadDump,null,UNAVAILABLE}
17/07/16 16:27:24 INFO handler.ContextHandler: Stopped o.s.j.s.ServletContextHandler@7129b61e{/executors/json,null,UNAVAILABLE}
17/07/16 16:27:24 INFO handler.ContextHandler: Stopped o.s.j.s.ServletContextHandler@693fa092{/executors,null,UNAVAILABLE}
17/07/16 16:27:24 INFO handler.ContextHandler: Stopped o.s.j.s.ServletContextHandler@68220f90{/environment/json,null,UNAVAILABLE}
17/07/16 16:27:24 INFO handler.ContextHandler: Stopped o.s.j.s.ServletContextHandler@d48b50f{/environment,null,UNAVAILABLE}
17/07/16 16:27:24 INFO handler.ContextHandler: Stopped o.s.j.s.ServletContextHandler@2727f52e{/storage/rdd/json,null,UNAVAILABLE}
17/07/16 16:27:24 INFO handler.ContextHandler: Stopped o.s.j.s.ServletContextHandler@4e69eea8{/storage/rdd,null,UNAVAILABLE}
17/07/16 16:27:24 INFO handler.ContextHandler: Stopped o.s.j.s.ServletContextHandler@3cab3492{/storage/json,null,UNAVAILABLE}
17/07/16 16:27:24 INFO handler.ContextHandler: Stopped o.s.j.s.ServletContextHandler@77cbb1d4{/storage,null,UNAVAILABLE}
17/07/16 16:27:24 INFO handler.ContextHandler: Stopped o.s.j.s.ServletContextHandler@2b8845fe{/stages/pool/json,null,UNAVAILABLE}
17/07/16 16:27:24 INFO handler.ContextHandler: Stopped o.s.j.s.ServletContextHandler@15e7dc2{/stages/pool,null,UNAVAILABLE}
17/07/16 16:27:24 INFO handler.ContextHandler: Stopped o.s.j.s.ServletContextHandler@11eb581f{/stages/stage/json,null,UNAVAILABLE}
17/07/16 16:27:24 INFO handler.ContextHandler: Stopped o.s.j.s.ServletContextHandler@2e2e5625{/stages/stage,null,UNAVAILABLE}
17/07/16 16:27:24 INFO handler.ContextHandler: Stopped o.s.j.s.ServletContextHandler@7c9accc3{/stages/json,null,UNAVAILABLE}
17/07/16 16:27:24 INFO handler.ContextHandler: Stopped o.s.j.s.ServletContextHandler@b212e2{/stages,null,UNAVAILABLE}
17/07/16 16:27:24 INFO handler.ContextHandler: Stopped o.s.j.s.ServletContextHandler@bf6919e{/jobs/job/json,null,UNAVAILABLE}
17/07/16 16:27:24 INFO handler.ContextHandler: Stopped o.s.j.s.ServletContextHandler@247ed316{/jobs/job,null,UNAVAILABLE}
17/07/16 16:27:24 INFO handler.ContextHandler: Stopped o.s.j.s.ServletContextHandler@53c5e23d{/jobs/json,null,UNAVAILABLE}
17/07/16 16:27:24 INFO handler.ContextHandler: Stopped o.s.j.s.ServletContextHandler@6e1b5cf{/jobs,null,UNAVAILABLE}
17/07/16 16:27:24 INFO ui.SparkUI: Stopped Spark web UI at http://169.54.146.43:4040
17/07/16 16:27:25 INFO spark.MapOutputTrackerMasterEndpoint: MapOutputTrackerMasterEndpoint
stopped!
17/07/16 16:27:25 INFO memory.MemoryStore: MemoryStore cleared
17/07/16 16:27:25 INFO storage.BlockManager: BlockManager stopped
17/07/16 16:27:25 INFO storage.BlockManagerMaster: BlockManagerMaster stopped
17/07/16 16:27:25 INFO scheduler.OutputCommitCoordinator$OutputCommitCoordinatorEndpoint:
OutputCommitCoordinator stopped!
17/07/16 16:27:25 INFO spark.SparkContext: Successfully stopped SparkContext
Running org.apache.sysml.test.integration.scripts.nn.NNTest
Tests run: 1, Failures: 0, Errors: 0, Skipped: 0, Time elapsed: 701.913 sec - in org.apache.sysml.test.integration.scripts.nn.NNTest
17/07/16 16:27:25 INFO util.ShutdownHookManager: Shutdown hook called
17/07/16 16:27:25 INFO util.ShutdownHookManager: Deleting directory /tmp/spark-74ecf613-0a66-4125-bf09-247cf07134e7
Running org.apache.sysml.test.integration.applications.descriptivestats.UnivariateWeightedScaleDenseTest
Tests run: 24, Failures: 0, Errors: 0, Skipped: 0, Time elapsed: 370.409 sec - in org.apache.sysml.test.integration.applications.descriptivestats.UnivariateWeightedScaleDenseTest
Running org.apache.sysml.test.integration.functions.append.AppendChainTest
Tests run: 12, Failures: 0, Errors: 0, Skipped: 0, Time elapsed: 1,105.056 sec - in org.apache.sysml.test.integration.functions.append.AppendChainTest
Running org.apache.sysml.test.integration.applications.parfor.ParForNaiveBayesTest
Tests run: 10, Failures: 0, Errors: 0, Skipped: 0, Time elapsed: 547.558 sec - in org.apache.sysml.test.integration.applications.parfor.ParForNaiveBayesTest
Running org.apache.sysml.test.integration.applications.descriptivestats.UnivariateUnweightedScaleSparseTest
Tests run: 24, Failures: 0, Errors: 0, Skipped: 0, Time elapsed: 277.668 sec - in org.apache.sysml.test.integration.applications.descriptivestats.UnivariateUnweightedScaleSparseTest
Running org.apache.sysml.test.integration.applications.parfor.ParForSampleTest
Tests run: 6, Failures: 0, Errors: 0, Skipped: 0, Time elapsed: 111.201 sec - in org.apache.sysml.test.integration.applications.parfor.ParForSampleTest
Running org.apache.sysml.test.integration.applications.parfor.ParForUnivariateStatsTest
Tests run: 3, Failures: 0, Errors: 0, Skipped: 0, Time elapsed: 7.872 sec - in org.apache.sysml.test.integration.applications.parfor.ParForUnivariateStatsTest
Running org.apache.sysml.test.integration.applications.dml.HITSDMLTest
Tests run: 1, Failures: 0, Errors: 0, Skipped: 0, Time elapsed: 93.495 sec - in org.apache.sysml.test.integration.applications.dml.HITSDMLTest
Running org.apache.sysml.test.integration.functions.append.AppendMatrixTest
Tests run: 22, Failures: 0, Errors: 0, Skipped: 0, Time elapsed: 1,338.086 sec - in org.apache.sysml.test.integration.functions.append.AppendMatrixTest
Running org.apache.sysml.test.integration.applications.descriptivestats.UnivariateWeightedScaleSparseTest
Tests run: 24, Failures: 0, Errors: 0, Skipped: 0, Time elapsed: 336.231 sec - in org.apache.sysml.test.integration.applications.descriptivestats.UnivariateWeightedScaleSparseTest
Running org.apache.sysml.test.integration.applications.pydml.ArimaPyDMLTest
Tests run: 1, Failures: 0, Errors: 0, Skipped: 0, Time elapsed: 47.332 sec - in org.apache.sysml.test.integration.applications.pydml.ArimaPyDMLTest
Running org.apache.sysml.test.integration.applications.pydml.HITSPyDMLTest
Tests run: 1, Failures: 0, Errors: 0, Skipped: 0, Time elapsed: 78.668 sec - in org.apache.sysml.test.integration.applications.pydml.HITSPyDMLTest
Running org.apache.sysml.test.integration.applications.dml.LinearRegressionDMLTest
Tests run: 7, Failures: 0, Errors: 0, Skipped: 0, Time elapsed: 50.573 sec - in org.apache.sysml.test.integration.applications.dml.LinearRegressionDMLTest
Running org.apache.sysml.test.integration.applications.pydml.CsplineDSPyDMLTest
Tests run: 3, Failures: 0, Errors: 0, Skipped: 0, Time elapsed: 6.534 sec - in org.apache.sysml.test.integration.applications.pydml.CsplineDSPyDMLTest
Running org.apache.sysml.test.integration.applications.pydml.LinearLogRegPyDMLTest
Tests run: 7, Failures: 0, Errors: 0, Skipped: 0, Time elapsed: 92.794 sec - in org.apache.sysml.test.integration.applications.pydml.LinearLogRegPyDMLTest
Running org.apache.sysml.test.integration.applications.pydml.NaiveBayesPyDMLTest
Tests run: 6, Failures: 0, Errors: 0, Skipped: 0, Time elapsed: 80.889 sec - in org.apache.sysml.test.integration.applications.pydml.NaiveBayesPyDMLTest
Running org.apache.sysml.test.integration.applications.dml.CsplineCGDMLTest
Tests run: 3, Failures: 0, Errors: 0, Skipped: 0, Time elapsed: 15.128 sec - in org.apache.sysml.test.integration.applications.dml.CsplineCGDMLTest
Running org.apache.sysml.test.integration.applications.dml.L2SVMDMLTest
Tests run: 9, Failures: 0, Errors: 0, Skipped: 0, Time elapsed: 64.241 sec - in org.apache.sysml.test.integration.applications.dml.L2SVMDMLTest
Running org.apache.sysml.test.integration.applications.pydml.MDABivariateStatsPyDMLTest
Tests run: 4, Failures: 0, Errors: 0, Skipped: 0, Time elapsed: 294.252 sec - in org.apache.sysml.test.integration.applications.pydml.MDABivariateStatsPyDMLTest
Running org.apache.sysml.test.integration.applications.pydml.PageRankPyDMLTest
Tests run: 3, Failures: 0, Errors: 0, Skipped: 0, Time elapsed: 6.172 sec - in org.apache.sysml.test.integration.applications.pydml.PageRankPyDMLTest
Running org.apache.sysml.test.integration.applications.pydml.NaiveBayesParforPyDMLTest
Tests run: 6, Failures: 0, Errors: 0, Skipped: 0, Time elapsed: 80.678 sec - in org.apache.sysml.test.integration.applications.pydml.NaiveBayesParforPyDMLTest
Running org.apache.sysml.test.integration.applications.dml.NaiveBayesDMLTest
Tests run: 6, Failures: 0, Errors: 0, Skipped: 0, Time elapsed: 80.62 sec - in org.apache.sysml.test.integration.applications.dml.NaiveBayesDMLTest
Running org.apache.sysml.test.integration.applications.dml.MDABivariateStatsDMLTest
Tests run: 4, Failures: 0, Errors: 0, Skipped: 0, Time elapsed: 295.717 sec - in org.apache.sysml.test.integration.applications.dml.MDABivariateStatsDMLTest
Running org.apache.sysml.test.integration.applications.dml.PageRankDMLTest
Tests run: 3, Failures: 0, Errors: 0, Skipped: 0, Time elapsed: 6.041 sec - in org.apache.sysml.test.integration.applications.dml.PageRankDMLTest
Running org.apache.sysml.test.integration.applications.pydml.GLMPyDMLTest
Tests run: 30, Failures: 0, Errors: 0, Skipped: 0, Time elapsed: 582.109 sec - in org.apache.sysml.test.integration.applications.pydml.GLMPyDMLTest
Running org.apache.sysml.test.integration.applications.pydml.MultiClassSVMPyDMLTest
Tests run: 9, Failures: 0, Errors: 0, Skipped: 0, Time elapsed: 88.414 sec - in org.apache.sysml.test.integration.applications.pydml.MultiClassSVMPyDMLTest
Running org.apache.sysml.test.integration.applications.dml.ID3DMLTest
Tests run: 2, Failures: 0, Errors: 0, Skipped: 0, Time elapsed: 390.536 sec - in org.apache.sysml.test.integration.applications.dml.ID3DMLTest
Running org.apache.sysml.test.integration.applications.dml.GLMDMLTest
Tests run: 30, Failures: 0, Errors: 0, Skipped: 0, Time elapsed: 886.075 sec - in org.apache.sysml.test.integration.applications.dml.GLMDMLTest
Running org.apache.sysml.test.integration.applications.pydml.CsplineCGPyDMLTest
Tests run: 3, Failures: 0, Errors: 0, Skipped: 0, Time elapsed: 5.917 sec - in org.apache.sysml.test.integration.applications.pydml.CsplineCGPyDMLTest
Running org.apache.sysml.test.integration.applications.pydml.WelchTPyDMLTest
Tests run: 3, Failures: 0, Errors: 0, Skipped: 0, Time elapsed: 6.425 sec - in org.apache.sysml.test.integration.applications.pydml.WelchTPyDMLTest
Running org.apache.sysml.test.integration.applications.dml.MultiClassSVMDMLTest
Tests run: 9, Failures: 0, Errors: 0, Skipped: 0, Time elapsed: 87.077 sec - in org.apache.sysml.test.integration.applications.dml.MultiClassSVMDMLTest
Running org.apache.sysml.test.integration.applications.dml.CsplineDSDMLTest
Tests run: 3, Failures: 0, Errors: 0, Skipped: 0, Time elapsed: 12.485 sec - in org.apache.sysml.test.integration.applications.dml.CsplineDSDMLTest
Running org.apache.sysml.test.integration.applications.pydml.ApplyTransformPyDMLTest
Tests run: 7, Failures: 0, Errors: 0, Skipped: 0, Time elapsed: 0.878 sec - in org.apache.sysml.test.integration.applications.pydml.ApplyTransformPyDMLTest
Running org.apache.sysml.test.integration.applications.dml.NaiveBayesParforDMLTest
Tests run: 6, Failures: 0, Errors: 0, Skipped: 0, Time elapsed: 80.313 sec - in org.apache.sysml.test.integration.applications.dml.NaiveBayesParforDMLTest
Running org.apache.sysml.test.integration.applications.pydml.L2SVMPyDMLTest
Tests run: 9, Failures: 0, Errors: 0, Skipped: 0, Time elapsed: 64.24 sec - in org.apache.sysml.test.integration.applications.pydml.L2SVMPyDMLTest
Running org.apache.sysml.test.integration.applications.pydml.LinearRegressionPyDMLTest
Tests run: 7, Failures: 0, Errors: 0, Skipped: 0, Time elapsed: 51.192 sec - in org.apache.sysml.test.integration.applications.pydml.LinearRegressionPyDMLTest
Running org.apache.sysml.test.integration.applications.dml.LinearLogRegDMLTest
Tests run: 7, Failures: 0, Errors: 0, Skipped: 0, Time elapsed: 61.848 sec - in org.apache.sysml.test.integration.applications.dml.LinearLogRegDMLTest
Running org.apache.sysml.test.integration.applications.dml.GNMFDMLTest
Tests run: 3, Failures: 0, Errors: 0, Skipped: 0, Time elapsed: 61.738 sec - in org.apache.sysml.test.integration.applications.dml.GNMFDMLTest
Running org.apache.sysml.test.integration.applications.dml.WelchTDMLTest
Tests run: 3, Failures: 0, Errors: 0, Skipped: 0, Time elapsed: 6.299 sec - in org.apache.sysml.test.integration.applications.dml.WelchTDMLTest
Running org.apache.sysml.test.integration.applications.dml.ApplyTransformDMLTest
Tests run: 7, Failures: 0, Errors: 0, Skipped: 0, Time elapsed: 20.334 sec - in org.apache.sysml.test.integration.applications.dml.ApplyTransformDMLTest
Running org.apache.sysml.test.integration.applications.pydml.ID3PyDMLTest
Tests run: 2, Failures: 0, Errors: 0, Skipped: 0, Time elapsed: 389.068 sec - in org.apache.sysml.test.integration.applications.pydml.ID3PyDMLTest
Running org.apache.sysml.test.integration.applications.pydml.GNMFPyDMLTest
Tests run: 3, Failures: 0, Errors: 0, Skipped: 0, Time elapsed: 58.533 sec - in org.apache.sysml.test.integration.applications.pydml.GNMFPyDMLTest

Results :

Failed tests: 
  RightIndexingMatrixTest>AutomatedTestBase.tearDown:1483 Detailed matrices characteristics:
!  B-DML<->B-R # stored values in B-R: 3
!  B-DML<->B-R # stored values in B-DML: 3
!  B-DML<->B-R identical values(z=0): 0
!  B-DML<->B-R wrong values(z=1.0E-10): 3
!  B-DML<->B-R min error: 7.830957057460919
!  B-DML<->B-R max error: 53.43255090167865
    C-DML<->C-R # stored values in C-R: 14884
    C-DML<->C-R # stored values in C-DML: 14884
    C-DML<->C-R identical values(z=0): 14881
    C-DML<->C-R wrong values(z=1.0E-10): 0
    C-DML<->C-R min error: 0.0
    C-DML<->C-R max error: 7.105427357601002E-15
    D-DML<->D-R # stored values in D-R: 2508
    D-DML<->D-R # stored values in D-DML: 2508
    D-DML<->D-R identical values(z=0): 2506
    D-DML<->D-R wrong values(z=1.0E-10): 0
    D-DML<->D-R min error: 0.0
    D-DML<->D-R max error: 7.105427357601002E-15


Tests run: 7205, Failures: 1, Errors: 0, Skipped: 0

[INFO] 
[INFO] --- maven-failsafe-plugin:2.17:verify (default) @ systemml ---
[INFO] Failsafe report directory: <https://sparktc.ibmcloud.com/jenkins/job/SystemML-DailyTest/ws/target/failsafe-reports>
[INFO] ------------------------------------------------------------------------
[INFO] BUILD FAILURE
[INFO] ------------------------------------------------------------------------
[INFO] Total time: 02:46 h
[INFO] Finished at: 2017-07-16T17:26:00-05:00
[INFO] Final Memory: 62M/2681M
[INFO] ------------------------------------------------------------------------
[ERROR] Failed to execute goal org.apache.maven.plugins:maven-failsafe-plugin:2.17:verify
(default) on project systemml: There are test failures.
[ERROR] 
[ERROR] Please refer to <https://sparktc.ibmcloud.com/jenkins/job/SystemML-DailyTest/ws/target/failsafe-reports>
for the individual test results.
[ERROR] -> [Help 1]
[ERROR] 
[ERROR] To see the full stack trace of the errors, re-run Maven with the -e switch.
[ERROR] Re-run Maven using the -X switch to enable full debug logging.
[ERROR] 
[ERROR] For more information about the errors and possible solutions, please read the following
articles:
[ERROR] [Help 1] http://cwiki.apache.org/confluence/display/MAVEN/MojoFailureException
Build step 'Execute shell' marked build as failure
Run condition [Always] enabling perform for step [[]]

Mime
View raw message