systemml-dev mailing list archives

Site index · List index
Message view « Date » · « Thread »
Top « Date » · « Thread »
From jenk...@spark.tc
Subject Build failed in Jenkins: SystemML-DailyTest #1128
Date Sun, 23 Jul 2017 10:01:57 GMT
See <https://sparktc.ibmcloud.com/jenkins/job/SystemML-DailyTest/1128/changes>

Changes:

[Matthias Boehm] [MINOR] Performance and cleanup ctable result extraction

[Matthias Boehm] [SYSTEMML-1787] Column range indexing in codegen rowwise operators

[Matthias Boehm] [SYSTEMML-1788] Extended codegen cell-wise ops (column aggregation)

[Matthias Boehm] [SYSTEMML-1800] Utils for reading matrix/frame blocks from streams

[Matthias Boehm] [SYSTEMML-1506] Support codegen through all APIs, incl jmlc/mlcontext

------------------------------------------
[...truncated 28642 lines...]
17/07/23 04:01:27 INFO scheduler.TaskSchedulerImpl: Removed TaskSet 3.0, whose tasks have
all completed, from pool default
17/07/23 04:01:27 INFO scheduler.DAGScheduler: ShuffleMapStage 3 (parallelizePairs at SparkExecutionContext.java:699)
finished in 0.018 s
17/07/23 04:01:27 INFO scheduler.DAGScheduler: looking for newly runnable stages
17/07/23 04:01:27 INFO scheduler.DAGScheduler: running: Set(ShuffleMapStage 4)
17/07/23 04:01:27 INFO scheduler.DAGScheduler: waiting: Set(ResultStage 5)
17/07/23 04:01:27 INFO scheduler.DAGScheduler: failed: Set()
17/07/23 04:01:27 INFO executor.Executor: Finished task 0.0 in stage 4.0 (TID 4). 1253 bytes
result sent to driver
17/07/23 04:01:27 INFO scheduler.TaskSetManager: Finished task 0.0 in stage 4.0 (TID 4) in
13 ms on localhost (executor driver) (1/1)
17/07/23 04:01:27 INFO scheduler.TaskSchedulerImpl: Removed TaskSet 4.0, whose tasks have
all completed, from pool default
17/07/23 04:01:27 INFO scheduler.DAGScheduler: ShuffleMapStage 4 (parallelizePairs at SparkExecutionContext.java:699)
finished in 0.019 s
17/07/23 04:01:27 INFO scheduler.DAGScheduler: looking for newly runnable stages
17/07/23 04:01:27 INFO scheduler.DAGScheduler: running: Set()
17/07/23 04:01:27 INFO scheduler.DAGScheduler: waiting: Set(ResultStage 5)
17/07/23 04:01:27 INFO scheduler.DAGScheduler: failed: Set()
17/07/23 04:01:27 INFO scheduler.DAGScheduler: Submitting ResultStage 5 (MapPartitionsRDD[11]
at mapValues at BinarySPInstruction.java:117), which has no missing parents
17/07/23 04:01:27 INFO memory.MemoryStore: Block broadcast_5 stored as values in memory (estimated
size 4.2 KB, free 1033.8 MB)
17/07/23 04:01:27 INFO memory.MemoryStore: Block broadcast_5_piece0 stored as bytes in memory
(estimated size 2.3 KB, free 1033.8 MB)
17/07/23 04:01:27 INFO storage.BlockManagerInfo: Added broadcast_5_piece0 in memory on 169.54.146.43:45956
(size: 2.3 KB, free: 1033.8 MB)
17/07/23 04:01:27 INFO spark.SparkContext: Created broadcast 5 from broadcast at DAGScheduler.scala:996
17/07/23 04:01:27 INFO scheduler.DAGScheduler: Submitting 1 missing tasks from ResultStage
5 (MapPartitionsRDD[11] at mapValues at BinarySPInstruction.java:117)
17/07/23 04:01:27 INFO scheduler.TaskSchedulerImpl: Adding task set 5.0 with 1 tasks
17/07/23 04:01:27 INFO scheduler.FairSchedulableBuilder: Added task set TaskSet_5.0 tasks
to pool default
17/07/23 04:01:27 INFO scheduler.TaskSetManager: Starting task 0.0 in stage 5.0 (TID 5, localhost,
executor driver, partition 0, PROCESS_LOCAL, 5814 bytes)
17/07/23 04:01:27 INFO executor.Executor: Running task 0.0 in stage 5.0 (TID 5)
17/07/23 04:01:27 INFO storage.ShuffleBlockFetcherIterator: Getting 1 non-empty blocks out
of 1 blocks
17/07/23 04:01:27 INFO storage.ShuffleBlockFetcherIterator: Started 0 remote fetches in 1
ms
17/07/23 04:01:27 INFO storage.ShuffleBlockFetcherIterator: Getting 1 non-empty blocks out
of 1 blocks
17/07/23 04:01:27 INFO storage.ShuffleBlockFetcherIterator: Started 0 remote fetches in 1
ms
17/07/23 04:01:27 INFO executor.Executor: Finished task 0.0 in stage 5.0 (TID 5). 2327 bytes
result sent to driver
17/07/23 04:01:27 INFO scheduler.TaskSetManager: Finished task 0.0 in stage 5.0 (TID 5) in
18 ms on localhost (executor driver) (1/1)
17/07/23 04:01:27 INFO scheduler.TaskSchedulerImpl: Removed TaskSet 5.0, whose tasks have
all completed, from pool default
17/07/23 04:01:27 INFO scheduler.DAGScheduler: ResultStage 5 (collect at SparkExecutionContext.java:789)
finished in 0.019 s
17/07/23 04:01:27 INFO storage.BlockManagerInfo: Removed broadcast_5_piece0 on 169.54.146.43:45956
in memory (size: 2.3 KB, free: 1033.8 MB)
17/07/23 04:01:27 INFO storage.BlockManagerInfo: Removed broadcast_3_piece0 on 169.54.146.43:45956
in memory (size: 1305.0 B, free: 1033.8 MB)
17/07/23 04:01:27 INFO storage.BlockManagerInfo: Removed broadcast_4_piece0 on 169.54.146.43:45956
in memory (size: 1305.0 B, free: 1033.8 MB)
17/07/23 04:01:27 INFO spark.ContextCleaner: Cleaned shuffle 2
17/07/23 04:01:27 INFO spark.ContextCleaner: Cleaned shuffle 3
Running org.apache.sysml.test.integration.functions.quaternary.WeightedDivMatrixMultTest
Tests run: 90, Failures: 0, Errors: 0, Skipped: 0, Time elapsed: 1,478.161 sec - in org.apache.sysml.test.integration.functions.quaternary.WeightedDivMatrixMultTest
17/07/23 04:03:24 INFO util.ShutdownHookManager: Shutdown hook called
17/07/23 04:03:24 INFO util.ShutdownHookManager: Deleting directory /tmp/spark-e3f6a7ef-6758-4acf-a32a-401609a86e9d
17/07/23 04:03:44 INFO server.ServerConnector: Stopped ServerConnector@586080d{HTTP/1.1}{0.0.0.0:4040}
17/07/23 04:03:44 INFO handler.ContextHandler: Stopped o.s.j.s.ServletContextHandler@3e4bbc89{/stages/stage/kill,null,UNAVAILABLE}
17/07/23 04:03:44 INFO handler.ContextHandler: Stopped o.s.j.s.ServletContextHandler@5fbcd7e8{/jobs/job/kill,null,UNAVAILABLE}
17/07/23 04:03:44 INFO handler.ContextHandler: Stopped o.s.j.s.ServletContextHandler@7bcdfb3f{/api,null,UNAVAILABLE}
17/07/23 04:03:44 INFO handler.ContextHandler: Stopped o.s.j.s.ServletContextHandler@1aa996e1{/,null,UNAVAILABLE}
17/07/23 04:03:44 INFO handler.ContextHandler: Stopped o.s.j.s.ServletContextHandler@6aa176e0{/static,null,UNAVAILABLE}
17/07/23 04:03:44 INFO handler.ContextHandler: Stopped o.s.j.s.ServletContextHandler@39e3b6d8{/executors/threadDump/json,null,UNAVAILABLE}
17/07/23 04:03:44 INFO handler.ContextHandler: Stopped o.s.j.s.ServletContextHandler@125e7b70{/executors/threadDump,null,UNAVAILABLE}
17/07/23 04:03:44 INFO handler.ContextHandler: Stopped o.s.j.s.ServletContextHandler@405605d0{/executors/json,null,UNAVAILABLE}
17/07/23 04:03:44 INFO handler.ContextHandler: Stopped o.s.j.s.ServletContextHandler@4da3c652{/executors,null,UNAVAILABLE}
17/07/23 04:03:44 INFO handler.ContextHandler: Stopped o.s.j.s.ServletContextHandler@77db89ba{/environment/json,null,UNAVAILABLE}
17/07/23 04:03:44 INFO handler.ContextHandler: Stopped o.s.j.s.ServletContextHandler@2ba0c16{/environment,null,UNAVAILABLE}
17/07/23 04:03:44 INFO handler.ContextHandler: Stopped o.s.j.s.ServletContextHandler@49e88214{/storage/rdd/json,null,UNAVAILABLE}
17/07/23 04:03:44 INFO handler.ContextHandler: Stopped o.s.j.s.ServletContextHandler@6ada1300{/storage/rdd,null,UNAVAILABLE}
17/07/23 04:03:44 INFO handler.ContextHandler: Stopped o.s.j.s.ServletContextHandler@2f9b41ea{/storage/json,null,UNAVAILABLE}
17/07/23 04:03:44 INFO handler.ContextHandler: Stopped o.s.j.s.ServletContextHandler@2fac96a1{/storage,null,UNAVAILABLE}
17/07/23 04:03:44 INFO handler.ContextHandler: Stopped o.s.j.s.ServletContextHandler@7ffb8d52{/stages/pool/json,null,UNAVAILABLE}
17/07/23 04:03:44 INFO handler.ContextHandler: Stopped o.s.j.s.ServletContextHandler@119a83ca{/stages/pool,null,UNAVAILABLE}
17/07/23 04:03:44 INFO handler.ContextHandler: Stopped o.s.j.s.ServletContextHandler@69dd3d5b{/stages/stage/json,null,UNAVAILABLE}
17/07/23 04:03:44 INFO handler.ContextHandler: Stopped o.s.j.s.ServletContextHandler@2f5feb1f{/stages/stage,null,UNAVAILABLE}
17/07/23 04:03:44 INFO handler.ContextHandler: Stopped o.s.j.s.ServletContextHandler@7c1243a8{/stages/json,null,UNAVAILABLE}
17/07/23 04:03:44 INFO handler.ContextHandler: Stopped o.s.j.s.ServletContextHandler@2ddaacb6{/stages,null,UNAVAILABLE}
17/07/23 04:03:44 INFO handler.ContextHandler: Stopped o.s.j.s.ServletContextHandler@cf947a8{/jobs/job/json,null,UNAVAILABLE}
17/07/23 04:03:44 INFO handler.ContextHandler: Stopped o.s.j.s.ServletContextHandler@4152499c{/jobs/job,null,UNAVAILABLE}
17/07/23 04:03:44 INFO handler.ContextHandler: Stopped o.s.j.s.ServletContextHandler@4b034356{/jobs/json,null,UNAVAILABLE}
17/07/23 04:03:44 INFO handler.ContextHandler: Stopped o.s.j.s.ServletContextHandler@c05b0f9{/jobs,null,UNAVAILABLE}
17/07/23 04:03:44 INFO ui.SparkUI: Stopped Spark web UI at http://169.54.146.43:4040
17/07/23 04:03:44 INFO spark.MapOutputTrackerMasterEndpoint: MapOutputTrackerMasterEndpoint
stopped!
17/07/23 04:03:44 INFO memory.MemoryStore: MemoryStore cleared
17/07/23 04:03:44 INFO storage.BlockManager: BlockManager stopped
17/07/23 04:03:44 INFO storage.BlockManagerMaster: BlockManagerMaster stopped
17/07/23 04:03:44 INFO scheduler.OutputCommitCoordinator$OutputCommitCoordinatorEndpoint:
OutputCommitCoordinator stopped!
17/07/23 04:03:44 INFO spark.SparkContext: Successfully stopped SparkContext
Running org.apache.sysml.test.integration.scripts.nn.NNTest
Tests run: 1, Failures: 0, Errors: 0, Skipped: 0, Time elapsed: 657.677 sec - in org.apache.sysml.test.integration.scripts.nn.NNTest
17/07/23 04:03:44 INFO util.ShutdownHookManager: Shutdown hook called
17/07/23 04:03:44 INFO util.ShutdownHookManager: Deleting directory /tmp/spark-b0429117-38ba-4def-8896-406bf9ad2484
Running org.apache.sysml.test.integration.applications.descriptivestats.UnivariateWeightedScaleDenseTest
Tests run: 24, Failures: 0, Errors: 0, Skipped: 0, Time elapsed: 368.176 sec - in org.apache.sysml.test.integration.applications.descriptivestats.UnivariateWeightedScaleDenseTest
Running org.apache.sysml.test.integration.functions.append.AppendChainTest
Tests run: 12, Failures: 0, Errors: 0, Skipped: 0, Time elapsed: 1,069.202 sec - in org.apache.sysml.test.integration.functions.append.AppendChainTest
Running org.apache.sysml.test.integration.applications.parfor.ParForNaiveBayesTest
Tests run: 10, Failures: 0, Errors: 0, Skipped: 0, Time elapsed: 536.819 sec - in org.apache.sysml.test.integration.applications.parfor.ParForNaiveBayesTest
Running org.apache.sysml.test.integration.applications.descriptivestats.UnivariateUnweightedScaleSparseTest
Tests run: 24, Failures: 0, Errors: 0, Skipped: 0, Time elapsed: 280.398 sec - in org.apache.sysml.test.integration.applications.descriptivestats.UnivariateUnweightedScaleSparseTest
Running org.apache.sysml.test.integration.applications.parfor.ParForSampleTest
Tests run: 6, Failures: 0, Errors: 0, Skipped: 0, Time elapsed: 105.598 sec - in org.apache.sysml.test.integration.applications.parfor.ParForSampleTest
Running org.apache.sysml.test.integration.applications.parfor.ParForUnivariateStatsTest
Tests run: 3, Failures: 0, Errors: 0, Skipped: 0, Time elapsed: 7.692 sec - in org.apache.sysml.test.integration.applications.parfor.ParForUnivariateStatsTest
Running org.apache.sysml.test.integration.applications.dml.HITSDMLTest
Tests run: 1, Failures: 0, Errors: 0, Skipped: 0, Time elapsed: 87.86 sec - in org.apache.sysml.test.integration.applications.dml.HITSDMLTest
Running org.apache.sysml.test.integration.functions.append.AppendMatrixTest
Tests run: 22, Failures: 0, Errors: 0, Skipped: 0, Time elapsed: 1,416.36 sec - in org.apache.sysml.test.integration.functions.append.AppendMatrixTest
Running org.apache.sysml.test.integration.applications.descriptivestats.UnivariateWeightedScaleSparseTest
Tests run: 24, Failures: 0, Errors: 0, Skipped: 0, Time elapsed: 356.357 sec - in org.apache.sysml.test.integration.applications.descriptivestats.UnivariateWeightedScaleSparseTest
Running org.apache.sysml.test.integration.applications.pydml.ArimaPyDMLTest
Tests run: 1, Failures: 0, Errors: 0, Skipped: 0, Time elapsed: 48.395 sec - in org.apache.sysml.test.integration.applications.pydml.ArimaPyDMLTest
Running org.apache.sysml.test.integration.applications.pydml.HITSPyDMLTest
Tests run: 1, Failures: 0, Errors: 0, Skipped: 0, Time elapsed: 77.664 sec - in org.apache.sysml.test.integration.applications.pydml.HITSPyDMLTest
Running org.apache.sysml.test.integration.applications.dml.LinearRegressionDMLTest
Tests run: 7, Failures: 0, Errors: 0, Skipped: 0, Time elapsed: 50.92 sec - in org.apache.sysml.test.integration.applications.dml.LinearRegressionDMLTest
Running org.apache.sysml.test.integration.applications.pydml.CsplineDSPyDMLTest
Tests run: 3, Failures: 0, Errors: 0, Skipped: 0, Time elapsed: 6.677 sec - in org.apache.sysml.test.integration.applications.pydml.CsplineDSPyDMLTest
Running org.apache.sysml.test.integration.applications.pydml.LinearLogRegPyDMLTest
Tests run: 7, Failures: 0, Errors: 0, Skipped: 0, Time elapsed: 85.576 sec - in org.apache.sysml.test.integration.applications.pydml.LinearLogRegPyDMLTest
Running org.apache.sysml.test.integration.applications.pydml.NaiveBayesPyDMLTest
Tests run: 6, Failures: 0, Errors: 0, Skipped: 0, Time elapsed: 80.781 sec - in org.apache.sysml.test.integration.applications.pydml.NaiveBayesPyDMLTest
Running org.apache.sysml.test.integration.applications.dml.CsplineCGDMLTest
Tests run: 3, Failures: 0, Errors: 0, Skipped: 0, Time elapsed: 18.734 sec - in org.apache.sysml.test.integration.applications.dml.CsplineCGDMLTest
Running org.apache.sysml.test.integration.applications.dml.L2SVMDMLTest
Tests run: 9, Failures: 0, Errors: 0, Skipped: 0, Time elapsed: 64.188 sec - in org.apache.sysml.test.integration.applications.dml.L2SVMDMLTest
Running org.apache.sysml.test.integration.applications.pydml.MDABivariateStatsPyDMLTest
Tests run: 4, Failures: 0, Errors: 0, Skipped: 0, Time elapsed: 294.093 sec - in org.apache.sysml.test.integration.applications.pydml.MDABivariateStatsPyDMLTest
Running org.apache.sysml.test.integration.applications.pydml.PageRankPyDMLTest
Tests run: 3, Failures: 0, Errors: 0, Skipped: 0, Time elapsed: 6.057 sec - in org.apache.sysml.test.integration.applications.pydml.PageRankPyDMLTest
Running org.apache.sysml.test.integration.applications.pydml.NaiveBayesParforPyDMLTest
Tests run: 6, Failures: 0, Errors: 0, Skipped: 0, Time elapsed: 80.638 sec - in org.apache.sysml.test.integration.applications.pydml.NaiveBayesParforPyDMLTest
Running org.apache.sysml.test.integration.applications.dml.NaiveBayesDMLTest
Tests run: 6, Failures: 0, Errors: 0, Skipped: 0, Time elapsed: 80.974 sec - in org.apache.sysml.test.integration.applications.dml.NaiveBayesDMLTest
Running org.apache.sysml.test.integration.applications.dml.MDABivariateStatsDMLTest
Tests run: 4, Failures: 0, Errors: 0, Skipped: 0, Time elapsed: 294.841 sec - in org.apache.sysml.test.integration.applications.dml.MDABivariateStatsDMLTest
Running org.apache.sysml.test.integration.applications.dml.PageRankDMLTest
Tests run: 3, Failures: 0, Errors: 0, Skipped: 0, Time elapsed: 6.133 sec - in org.apache.sysml.test.integration.applications.dml.PageRankDMLTest
Running org.apache.sysml.test.integration.applications.pydml.GLMPyDMLTest
Tests run: 30, Failures: 0, Errors: 0, Skipped: 0, Time elapsed: 586.636 sec - in org.apache.sysml.test.integration.applications.pydml.GLMPyDMLTest
Running org.apache.sysml.test.integration.applications.pydml.MultiClassSVMPyDMLTest
Tests run: 9, Failures: 0, Errors: 0, Skipped: 0, Time elapsed: 87.773 sec - in org.apache.sysml.test.integration.applications.pydml.MultiClassSVMPyDMLTest
Running org.apache.sysml.test.integration.applications.dml.ID3DMLTest
Tests run: 2, Failures: 0, Errors: 0, Skipped: 0, Time elapsed: 405.419 sec - in org.apache.sysml.test.integration.applications.dml.ID3DMLTest
Running org.apache.sysml.test.integration.applications.dml.GLMDMLTest
Tests run: 30, Failures: 0, Errors: 0, Skipped: 0, Time elapsed: 868.31 sec - in org.apache.sysml.test.integration.applications.dml.GLMDMLTest
Running org.apache.sysml.test.integration.applications.pydml.CsplineCGPyDMLTest
Tests run: 3, Failures: 0, Errors: 0, Skipped: 0, Time elapsed: 6.067 sec - in org.apache.sysml.test.integration.applications.pydml.CsplineCGPyDMLTest
Running org.apache.sysml.test.integration.applications.pydml.WelchTPyDMLTest
Tests run: 3, Failures: 0, Errors: 0, Skipped: 0, Time elapsed: 6.412 sec - in org.apache.sysml.test.integration.applications.pydml.WelchTPyDMLTest
Running org.apache.sysml.test.integration.applications.dml.MultiClassSVMDMLTest
Tests run: 9, Failures: 0, Errors: 0, Skipped: 0, Time elapsed: 87.202 sec - in org.apache.sysml.test.integration.applications.dml.MultiClassSVMDMLTest
Running org.apache.sysml.test.integration.applications.dml.CsplineDSDMLTest
Tests run: 3, Failures: 0, Errors: 0, Skipped: 0, Time elapsed: 13.02 sec - in org.apache.sysml.test.integration.applications.dml.CsplineDSDMLTest
Running org.apache.sysml.test.integration.applications.pydml.ApplyTransformPyDMLTest
Tests run: 7, Failures: 0, Errors: 0, Skipped: 0, Time elapsed: 0.846 sec - in org.apache.sysml.test.integration.applications.pydml.ApplyTransformPyDMLTest
Running org.apache.sysml.test.integration.applications.dml.NaiveBayesParforDMLTest
Tests run: 6, Failures: 0, Errors: 0, Skipped: 0, Time elapsed: 80.794 sec - in org.apache.sysml.test.integration.applications.dml.NaiveBayesParforDMLTest
Running org.apache.sysml.test.integration.applications.pydml.L2SVMPyDMLTest
Tests run: 9, Failures: 0, Errors: 0, Skipped: 0, Time elapsed: 64.524 sec - in org.apache.sysml.test.integration.applications.pydml.L2SVMPyDMLTest
Running org.apache.sysml.test.integration.applications.pydml.LinearRegressionPyDMLTest
Tests run: 7, Failures: 0, Errors: 0, Skipped: 0, Time elapsed: 51.101 sec - in org.apache.sysml.test.integration.applications.pydml.LinearRegressionPyDMLTest
Running org.apache.sysml.test.integration.applications.dml.LinearLogRegDMLTest
Tests run: 7, Failures: 0, Errors: 0, Skipped: 0, Time elapsed: 61.252 sec - in org.apache.sysml.test.integration.applications.dml.LinearLogRegDMLTest
Running org.apache.sysml.test.integration.applications.dml.GNMFDMLTest
Tests run: 3, Failures: 0, Errors: 0, Skipped: 0, Time elapsed: 65.254 sec - in org.apache.sysml.test.integration.applications.dml.GNMFDMLTest
Running org.apache.sysml.test.integration.applications.dml.WelchTDMLTest
Tests run: 3, Failures: 0, Errors: 0, Skipped: 0, Time elapsed: 6.385 sec - in org.apache.sysml.test.integration.applications.dml.WelchTDMLTest
Running org.apache.sysml.test.integration.applications.dml.ApplyTransformDMLTest
Tests run: 7, Failures: 0, Errors: 0, Skipped: 0, Time elapsed: 15.296 sec - in org.apache.sysml.test.integration.applications.dml.ApplyTransformDMLTest
Running org.apache.sysml.test.integration.applications.pydml.ID3PyDMLTest
Tests run: 2, Failures: 0, Errors: 0, Skipped: 0, Time elapsed: 387.207 sec - in org.apache.sysml.test.integration.applications.pydml.ID3PyDMLTest
Running org.apache.sysml.test.integration.applications.pydml.GNMFPyDMLTest
Tests run: 3, Failures: 0, Errors: 0, Skipped: 0, Time elapsed: 56.643 sec - in org.apache.sysml.test.integration.applications.pydml.GNMFPyDMLTest

Results :

Failed tests: 
  ParForReplaceThreadIDRecompileTest.testThreadIDReplaceParForRecompile:57->runThreadIDReplaceTest:88->AutomatedTestBase.runTest:1244
failed to run script ./src/test/scripts/functions/parfor/parfor_threadid_recompile2.dml
exception: org.apache.sysml.api.DMLException: org.apache.sysml.runtime.DMLRuntimeException:
org.apache.sysml.runtime.DMLRuntimeException: PARFOR: Failed to execute loop in parallel.
message: org.apache.sysml.runtime.DMLRuntimeException: org.apache.sysml.runtime.DMLRuntimeException:
PARFOR: Failed to execute loop in parallel.
stack trace:
>org.apache.sysml.api.DMLScript.executeScript(DMLScript.java:531)
>org.apache.sysml.api.DMLScript.main(DMLScript.java:231)
>org.apache.sysml.test.integration.AutomatedTestBase.runTest(AutomatedTestBase.java:1224)
>org.apache.sysml.test.integration.functions.parfor.ParForReplaceThreadIDRecompileTest.runThreadIDReplaceTest(ParForReplaceThreadIDRecompileTest.java:88)
>org.apache.sysml.test.integration.functions.parfor.ParForReplaceThreadIDRecompileTest.testThreadIDReplaceParForRecompile(ParForReplaceThreadIDRecompileTest.java:57)
>sun.reflect.NativeMethodAccessorImpl.invoke0(Native Method)
>sun.reflect.NativeMethodAccessorImpl.invoke(NativeMethodAccessorImpl.java:62)
>sun.reflect.DelegatingMethodAccessorImpl.invoke(DelegatingMethodAccessorImpl.java:43)
>java.lang.reflect.Method.invoke(Method.java:497)
>org.junit.runners.model.FrameworkMethod$1.runReflectiveCall(FrameworkMethod.java:47)
>org.junit.internal.runners.model.ReflectiveCallable.run(ReflectiveCallable.java:12)
>org.junit.runners.model.FrameworkMethod.invokeExplosively(FrameworkMethod.java:44)
>org.junit.internal.runners.statements.InvokeMethod.evaluate(InvokeMethod.java:17)
>org.junit.internal.runners.statements.RunBefores.evaluate(RunBefores.java:26)
>org.junit.internal.runners.statements.RunAfters.evaluate(RunAfters.java:27)
>org.junit.runners.ParentRunner.runLeaf(ParentRunner.java:271)
>org.junit.runners.BlockJUnit4ClassRunner.runChild(BlockJUnit4ClassRunner.java:70)
>org.junit.runners.BlockJUnit4ClassRunner.runChild(BlockJUnit4ClassRunner.java:50)
>org.junit.runners.ParentRunner$3.run(ParentRunner.java:238)
>org.apache.maven.surefire.junitcore.pc.Scheduler$1.run(Scheduler.java:318)
>org.apache.maven.surefire.junitcore.pc.InvokerStrategy.schedule(InvokerStrategy.java:41)
>org.apache.maven.surefire.junitcore.pc.Scheduler.schedule(Scheduler.java:274)
>org.junit.runners.ParentRunner.runChildren(ParentRunner.java:236)
>org.junit.runners.ParentRunner.access$000(ParentRunner.java:53)
>org.junit.runners.ParentRunner$2.evaluate(ParentRunner.java:229)
>org.junit.runners.ParentRunner.run(ParentRunner.java:309)
>org.junit.runners.Suite.runChild(Suite.java:127)
>org.junit.runners.Suite.runChild(Suite.java:26)
>org.junit.runners.ParentRunner$3.run(ParentRunner.java:238)
>org.apache.maven.surefire.junitcore.pc.Scheduler$1.run(Scheduler.java:318)
>org.apache.maven.surefire.junitcore.pc.InvokerStrategy.schedule(InvokerStrategy.java:41)
>org.apache.maven.surefire.junitcore.pc.Scheduler.schedule(Scheduler.java:274)
>org.junit.runners.ParentRunner.runChildren(ParentRunner.java:236)
>org.junit.runners.ParentRunner.access$000(ParentRunner.java:53)
>org.junit.runners.ParentRunner$2.evaluate(ParentRunner.java:229)
>org.junit.runners.ParentRunner.run(ParentRunner.java:309)
>org.junit.runners.Suite.runChild(Suite.java:127)
>org.junit.runners.Suite.runChild(Suite.java:26)
>org.junit.runners.ParentRunner$3.run(ParentRunner.java:238)
>org.apache.maven.surefire.junitcore.pc.Scheduler$1.run(Scheduler.java:318)
>org.apache.maven.surefire.junitcore.pc.InvokerStrategy.schedule(InvokerStrategy.java:41)
>org.apache.maven.surefire.junitcore.pc.Scheduler.schedule(Scheduler.java:274)
>org.junit.runners.ParentRunner.runChildren(ParentRunner.java:236)
>org.junit.runners.ParentRunner.access$000(ParentRunner.java:53)
>org.junit.runners.ParentRunner$2.evaluate(ParentRunner.java:229)
>org.junit.runners.ParentRunner.run(ParentRunner.java:309)
>org.apache.maven.surefire.junitcore.pc.ParallelComputerBuilder$PC$2.run(ParallelComputerBuilder.java:491)
>org.junit.runner.JUnitCore.run(JUnitCore.java:160)
>org.junit.runner.JUnitCore.run(JUnitCore.java:138)
>org.apache.maven.surefire.junitcore.JUnitCoreWrapper.createRequestAndRun(JUnitCoreWrapper.java:113)
>org.apache.maven.surefire.junitcore.JUnitCoreWrapper.executeEager(JUnitCoreWrapper.java:85)
>org.apache.maven.surefire.junitcore.JUnitCoreWrapper.execute(JUnitCoreWrapper.java:54)
>org.apache.maven.surefire.junitcore.JUnitCoreProvider.invoke(JUnitCoreProvider.java:134)
>org.apache.maven.surefire.booter.ForkedBooter.invokeProviderInSameClassLoader(ForkedBooter.java:200)
>org.apache.maven.surefire.booter.ForkedBooter.runSuitesInProcess(ForkedBooter.java:153)
>org.apache.maven.surefire.booter.ForkedBooter.main(ForkedBooter.java:103)

Tests run: 7216, Failures: 1, Errors: 0, Skipped: 0

[INFO] 
[INFO] --- maven-failsafe-plugin:2.17:verify (default) @ systemml ---
[INFO] Failsafe report directory: <https://sparktc.ibmcloud.com/jenkins/job/SystemML-DailyTest/ws/target/failsafe-reports>
[INFO] ------------------------------------------------------------------------
[INFO] BUILD FAILURE
[INFO] ------------------------------------------------------------------------
[INFO] Total time: 02:29 h
[INFO] Finished at: 2017-07-23T05:01:57-05:00
[INFO] Final Memory: 63M/2281M
[INFO] ------------------------------------------------------------------------
[ERROR] Failed to execute goal org.apache.maven.plugins:maven-failsafe-plugin:2.17:verify
(default) on project systemml: There are test failures.
[ERROR] 
[ERROR] Please refer to <https://sparktc.ibmcloud.com/jenkins/job/SystemML-DailyTest/ws/target/failsafe-reports>
for the individual test results.
[ERROR] -> [Help 1]
[ERROR] 
[ERROR] To see the full stack trace of the errors, re-run Maven with the -e switch.
[ERROR] Re-run Maven using the -X switch to enable full debug logging.
[ERROR] 
[ERROR] For more information about the errors and possible solutions, please read the following
articles:
[ERROR] [Help 1] http://cwiki.apache.org/confluence/display/MAVEN/MojoFailureException
Build step 'Execute shell' marked build as failure
Run condition [Always] enabling perform for step [[]]

Mime
View raw message