systemml-dev mailing list archives

Site index · List index
Message view « Date » · « Thread »
Top « Date » · « Thread »
From jenk...@spark.tc
Subject Build failed in Jenkins: SystemML-DailyTest #1141
Date Sat, 29 Jul 2017 21:49:40 GMT
See <https://sparktc.ibmcloud.com/jenkins/job/SystemML-DailyTest/1141/changes>

Changes:

[Matthias Boehm] [SYSTEMML-1817] Fix hop construction for full standard dev computation

------------------------------------------
[...truncated 29391 lines...]
17/07/29 15:53:37 INFO scheduler.DAGScheduler: running: Set(ShuffleMapStage 1)
17/07/29 15:53:37 INFO scheduler.DAGScheduler: waiting: Set(ResultStage 2)
17/07/29 15:53:37 INFO scheduler.DAGScheduler: failed: Set()
17/07/29 15:53:37 INFO scheduler.DAGScheduler: ShuffleMapStage 1 (parallelizePairs at SparkExecutionContext.java:699)
finished in 0.123 s
17/07/29 15:53:37 INFO scheduler.DAGScheduler: looking for newly runnable stages
17/07/29 15:53:37 INFO scheduler.DAGScheduler: running: Set()
17/07/29 15:53:37 INFO scheduler.DAGScheduler: waiting: Set(ResultStage 2)
17/07/29 15:53:37 INFO scheduler.DAGScheduler: failed: Set()
17/07/29 15:53:37 INFO scheduler.DAGScheduler: Submitting ResultStage 2 (MapPartitionsRDD[5]
at mapValues at BinarySPInstruction.java:117), which has no missing parents
17/07/29 15:53:37 INFO memory.MemoryStore: Block broadcast_2 stored as values in memory (estimated
size 4.2 KB, free 1033.8 MB)
17/07/29 15:53:37 INFO memory.MemoryStore: Block broadcast_2_piece0 stored as bytes in memory
(estimated size 2.3 KB, free 1033.8 MB)
17/07/29 15:53:37 INFO storage.BlockManagerInfo: Added broadcast_2_piece0 in memory on 23.246.248.181:37857
(size: 2.3 KB, free: 1033.8 MB)
17/07/29 15:53:37 INFO spark.SparkContext: Created broadcast 2 from broadcast at DAGScheduler.scala:996
17/07/29 15:53:37 INFO scheduler.DAGScheduler: Submitting 1 missing tasks from ResultStage
2 (MapPartitionsRDD[5] at mapValues at BinarySPInstruction.java:117)
17/07/29 15:53:37 INFO scheduler.TaskSchedulerImpl: Adding task set 2.0 with 1 tasks
17/07/29 15:53:37 INFO scheduler.FairSchedulableBuilder: Added task set TaskSet_2.0 tasks
to pool default
17/07/29 15:53:37 INFO scheduler.TaskSetManager: Starting task 0.0 in stage 2.0 (TID 2, localhost,
executor driver, partition 0, PROCESS_LOCAL, 5813 bytes)
17/07/29 15:53:37 INFO executor.Executor: Running task 0.0 in stage 2.0 (TID 2)
17/07/29 15:53:37 INFO storage.ShuffleBlockFetcherIterator: Getting 1 non-empty blocks out
of 1 blocks
17/07/29 15:53:37 INFO storage.ShuffleBlockFetcherIterator: Started 0 remote fetches in 4
ms
17/07/29 15:53:37 INFO storage.ShuffleBlockFetcherIterator: Getting 1 non-empty blocks out
of 1 blocks
17/07/29 15:53:37 INFO storage.ShuffleBlockFetcherIterator: Started 0 remote fetches in 0
ms
17/07/29 15:53:37 INFO storage.BlockManagerInfo: Removed broadcast_1_piece0 on 23.246.248.181:37857
in memory (size: 1302.0 B, free: 1033.8 MB)
17/07/29 15:53:37 INFO storage.BlockManagerInfo: Removed broadcast_0_piece0 on 23.246.248.181:37857
in memory (size: 1305.0 B, free: 1033.8 MB)
17/07/29 15:53:37 INFO executor.Executor: Finished task 0.0 in stage 2.0 (TID 2). 2150 bytes
result sent to driver
17/07/29 15:53:37 INFO scheduler.TaskSetManager: Finished task 0.0 in stage 2.0 (TID 2) in
58 ms on localhost (executor driver) (1/1)
17/07/29 15:53:37 INFO scheduler.TaskSchedulerImpl: Removed TaskSet 2.0, whose tasks have
all completed, from pool default
17/07/29 15:53:37 INFO scheduler.DAGScheduler: ResultStage 2 (collect at SparkExecutionContext.java:789)
finished in 0.059 s
17/07/29 15:53:38 INFO scheduler.DAGScheduler: Registering RDD 7 (parallelizePairs at SparkExecutionContext.java:699)
17/07/29 15:53:38 INFO scheduler.DAGScheduler: Registering RDD 6 (parallelizePairs at SparkExecutionContext.java:699)
17/07/29 15:53:38 INFO scheduler.DAGScheduler: Got job 1 (collect at SparkExecutionContext.java:789)
with 1 output partitions
17/07/29 15:53:38 INFO scheduler.DAGScheduler: Final stage: ResultStage 5 (collect at SparkExecutionContext.java:789)
17/07/29 15:53:38 INFO scheduler.DAGScheduler: Parents of final stage: List(ShuffleMapStage
3, ShuffleMapStage 4)
17/07/29 15:53:38 INFO scheduler.DAGScheduler: Missing parents: List(ShuffleMapStage 3, ShuffleMapStage
4)
17/07/29 15:53:38 INFO scheduler.DAGScheduler: Submitting ShuffleMapStage 3 (ParallelCollectionRDD[7]
at parallelizePairs at SparkExecutionContext.java:699), which has no missing parents
17/07/29 15:53:38 INFO memory.MemoryStore: Block broadcast_3 stored as values in memory (estimated
size 2032.0 B, free 1033.8 MB)
17/07/29 15:53:38 INFO memory.MemoryStore: Block broadcast_3_piece0 stored as bytes in memory
(estimated size 1305.0 B, free 1033.8 MB)
17/07/29 15:53:38 INFO storage.BlockManagerInfo: Added broadcast_3_piece0 in memory on 23.246.248.181:37857
(size: 1305.0 B, free: 1033.8 MB)
17/07/29 15:53:38 INFO spark.SparkContext: Created broadcast 3 from broadcast at DAGScheduler.scala:996
17/07/29 15:53:38 INFO scheduler.DAGScheduler: Submitting 1 missing tasks from ShuffleMapStage
3 (ParallelCollectionRDD[7] at parallelizePairs at SparkExecutionContext.java:699)
17/07/29 15:53:38 INFO scheduler.TaskSchedulerImpl: Adding task set 3.0 with 1 tasks
17/07/29 15:53:38 INFO scheduler.FairSchedulableBuilder: Added task set TaskSet_3.0 tasks
to pool default
17/07/29 15:53:38 INFO scheduler.DAGScheduler: Submitting ShuffleMapStage 4 (ParallelCollectionRDD[6]
at parallelizePairs at SparkExecutionContext.java:699), which has no missing parents
17/07/29 15:53:38 INFO scheduler.TaskSetManager: Starting task 0.0 in stage 3.0 (TID 3, localhost,
executor driver, partition 0, PROCESS_LOCAL, 6445 bytes)
17/07/29 15:53:38 INFO executor.Executor: Running task 0.0 in stage 3.0 (TID 3)
17/07/29 15:53:38 INFO memory.MemoryStore: Block broadcast_4 stored as values in memory (estimated
size 2032.0 B, free 1033.8 MB)
17/07/29 15:53:38 INFO memory.MemoryStore: Block broadcast_4_piece0 stored as bytes in memory
(estimated size 1305.0 B, free 1033.8 MB)
17/07/29 15:53:38 INFO storage.BlockManagerInfo: Added broadcast_4_piece0 in memory on 23.246.248.181:37857
(size: 1305.0 B, free: 1033.8 MB)
17/07/29 15:53:38 INFO spark.SparkContext: Created broadcast 4 from broadcast at DAGScheduler.scala:996
17/07/29 15:53:38 INFO scheduler.DAGScheduler: Submitting 1 missing tasks from ShuffleMapStage
4 (ParallelCollectionRDD[6] at parallelizePairs at SparkExecutionContext.java:699)
17/07/29 15:53:38 INFO scheduler.TaskSchedulerImpl: Adding task set 4.0 with 1 tasks
17/07/29 15:53:38 INFO executor.Executor: Finished task 0.0 in stage 3.0 (TID 3). 1254 bytes
result sent to driver
17/07/29 15:53:38 INFO scheduler.FairSchedulableBuilder: Added task set TaskSet_4.0 tasks
to pool default
17/07/29 15:53:38 INFO scheduler.TaskSetManager: Starting task 0.0 in stage 4.0 (TID 4, localhost,
executor driver, partition 0, PROCESS_LOCAL, 6445 bytes)
17/07/29 15:53:38 INFO executor.Executor: Running task 0.0 in stage 4.0 (TID 4)
17/07/29 15:53:38 INFO scheduler.TaskSetManager: Finished task 0.0 in stage 3.0 (TID 3) in
31 ms on localhost (executor driver) (1/1)
17/07/29 15:53:38 INFO scheduler.TaskSchedulerImpl: Removed TaskSet 3.0, whose tasks have
all completed, from pool default
17/07/29 15:53:38 INFO scheduler.DAGScheduler: ShuffleMapStage 3 (parallelizePairs at SparkExecutionContext.java:699)
finished in 0.037 s
17/07/29 15:53:38 INFO scheduler.DAGScheduler: looking for newly runnable stages
17/07/29 15:53:38 INFO scheduler.DAGScheduler: running: Set(ShuffleMapStage 4)
17/07/29 15:53:38 INFO scheduler.DAGScheduler: waiting: Set(ResultStage 5)
17/07/29 15:53:38 INFO scheduler.DAGScheduler: failed: Set()
17/07/29 15:53:38 INFO executor.Executor: Finished task 0.0 in stage 4.0 (TID 4). 1254 bytes
result sent to driver
17/07/29 15:53:38 INFO scheduler.TaskSetManager: Finished task 0.0 in stage 4.0 (TID 4) in
17 ms on localhost (executor driver) (1/1)
17/07/29 15:53:38 INFO scheduler.TaskSchedulerImpl: Removed TaskSet 4.0, whose tasks have
all completed, from pool default
17/07/29 15:53:38 INFO scheduler.DAGScheduler: ShuffleMapStage 4 (parallelizePairs at SparkExecutionContext.java:699)
finished in 0.025 s
17/07/29 15:53:38 INFO scheduler.DAGScheduler: looking for newly runnable stages
17/07/29 15:53:38 INFO scheduler.DAGScheduler: running: Set()
17/07/29 15:53:38 INFO scheduler.DAGScheduler: waiting: Set(ResultStage 5)
17/07/29 15:53:38 INFO scheduler.DAGScheduler: failed: Set()
17/07/29 15:53:38 INFO scheduler.DAGScheduler: Submitting ResultStage 5 (MapPartitionsRDD[11]
at mapValues at BinarySPInstruction.java:117), which has no missing parents
17/07/29 15:53:38 INFO memory.MemoryStore: Block broadcast_5 stored as values in memory (estimated
size 4.2 KB, free 1033.8 MB)
17/07/29 15:53:38 INFO memory.MemoryStore: Block broadcast_5_piece0 stored as bytes in memory
(estimated size 2.3 KB, free 1033.8 MB)
17/07/29 15:53:38 INFO storage.BlockManagerInfo: Added broadcast_5_piece0 in memory on 23.246.248.181:37857
(size: 2.3 KB, free: 1033.8 MB)
17/07/29 15:53:38 INFO spark.SparkContext: Created broadcast 5 from broadcast at DAGScheduler.scala:996
17/07/29 15:53:38 INFO scheduler.DAGScheduler: Submitting 1 missing tasks from ResultStage
5 (MapPartitionsRDD[11] at mapValues at BinarySPInstruction.java:117)
17/07/29 15:53:38 INFO scheduler.TaskSchedulerImpl: Adding task set 5.0 with 1 tasks
17/07/29 15:53:38 INFO scheduler.FairSchedulableBuilder: Added task set TaskSet_5.0 tasks
to pool default
17/07/29 15:53:38 INFO scheduler.TaskSetManager: Starting task 0.0 in stage 5.0 (TID 5, localhost,
executor driver, partition 0, PROCESS_LOCAL, 5814 bytes)
17/07/29 15:53:38 INFO executor.Executor: Running task 0.0 in stage 5.0 (TID 5)
17/07/29 15:53:38 INFO storage.ShuffleBlockFetcherIterator: Getting 1 non-empty blocks out
of 1 blocks
17/07/29 15:53:38 INFO storage.ShuffleBlockFetcherIterator: Started 0 remote fetches in 1
ms
17/07/29 15:53:38 INFO storage.ShuffleBlockFetcherIterator: Getting 1 non-empty blocks out
of 1 blocks
17/07/29 15:53:38 INFO storage.ShuffleBlockFetcherIterator: Started 0 remote fetches in 0
ms
17/07/29 15:53:38 INFO executor.Executor: Finished task 0.0 in stage 5.0 (TID 5). 2327 bytes
result sent to driver
17/07/29 15:53:38 INFO scheduler.TaskSetManager: Finished task 0.0 in stage 5.0 (TID 5) in
21 ms on localhost (executor driver) (1/1)
17/07/29 15:53:38 INFO scheduler.TaskSchedulerImpl: Removed TaskSet 5.0, whose tasks have
all completed, from pool default
17/07/29 15:53:38 INFO scheduler.DAGScheduler: ResultStage 5 (collect at SparkExecutionContext.java:789)
finished in 0.021 s
17/07/29 15:53:38 INFO storage.BlockManagerInfo: Removed broadcast_4_piece0 on 23.246.248.181:37857
in memory (size: 1305.0 B, free: 1033.8 MB)
17/07/29 15:53:38 INFO storage.BlockManagerInfo: Removed broadcast_5_piece0 on 23.246.248.181:37857
in memory (size: 2.3 KB, free: 1033.8 MB)
17/07/29 15:53:38 INFO storage.BlockManagerInfo: Removed broadcast_3_piece0 on 23.246.248.181:37857
in memory (size: 1305.0 B, free: 1033.8 MB)
17/07/29 15:53:38 INFO storage.BlockManagerInfo: Removed broadcast_2_piece0 on 23.246.248.181:37857
in memory (size: 2.3 KB, free: 1033.8 MB)
17/07/29 15:53:38 INFO spark.ContextCleaner: Cleaned shuffle 2
17/07/29 15:53:38 INFO spark.ContextCleaner: Cleaned shuffle 3
17/07/29 15:53:38 INFO spark.ContextCleaner: Cleaned shuffle 0
17/07/29 15:53:38 INFO spark.ContextCleaner: Cleaned shuffle 1
17/07/29 15:55:13 INFO server.ServerConnector: Stopped ServerConnector@1fcf2b87{HTTP/1.1}{0.0.0.0:4041}
17/07/29 15:55:13 INFO handler.ContextHandler: Stopped o.s.j.s.ServletContextHandler@70bf6aa6{/stages/stage/kill,null,UNAVAILABLE}
17/07/29 15:55:13 INFO handler.ContextHandler: Stopped o.s.j.s.ServletContextHandler@2886ff17{/jobs/job/kill,null,UNAVAILABLE}
17/07/29 15:55:13 INFO handler.ContextHandler: Stopped o.s.j.s.ServletContextHandler@61ef9357{/api,null,UNAVAILABLE}
17/07/29 15:55:13 INFO handler.ContextHandler: Stopped o.s.j.s.ServletContextHandler@2dec8333{/,null,UNAVAILABLE}
17/07/29 15:55:13 INFO handler.ContextHandler: Stopped o.s.j.s.ServletContextHandler@23ef61c0{/static,null,UNAVAILABLE}
17/07/29 15:55:13 INFO handler.ContextHandler: Stopped o.s.j.s.ServletContextHandler@40e1382d{/executors/threadDump/json,null,UNAVAILABLE}
17/07/29 15:55:13 INFO handler.ContextHandler: Stopped o.s.j.s.ServletContextHandler@32dfc203{/executors/threadDump,null,UNAVAILABLE}
17/07/29 15:55:13 INFO handler.ContextHandler: Stopped o.s.j.s.ServletContextHandler@1812d3f5{/executors/json,null,UNAVAILABLE}
17/07/29 15:55:13 INFO handler.ContextHandler: Stopped o.s.j.s.ServletContextHandler@1d4fd44d{/executors,null,UNAVAILABLE}
17/07/29 15:55:13 INFO handler.ContextHandler: Stopped o.s.j.s.ServletContextHandler@268a98c5{/environment/json,null,UNAVAILABLE}
17/07/29 15:55:13 INFO handler.ContextHandler: Stopped o.s.j.s.ServletContextHandler@550ffd01{/environment,null,UNAVAILABLE}
17/07/29 15:55:13 INFO handler.ContextHandler: Stopped o.s.j.s.ServletContextHandler@74fe24dd{/storage/rdd/json,null,UNAVAILABLE}
17/07/29 15:55:13 INFO handler.ContextHandler: Stopped o.s.j.s.ServletContextHandler@510d4e6f{/storage/rdd,null,UNAVAILABLE}
17/07/29 15:55:13 INFO handler.ContextHandler: Stopped o.s.j.s.ServletContextHandler@383979fc{/storage/json,null,UNAVAILABLE}
17/07/29 15:55:13 INFO handler.ContextHandler: Stopped o.s.j.s.ServletContextHandler@70ea2744{/storage,null,UNAVAILABLE}
17/07/29 15:55:13 INFO handler.ContextHandler: Stopped o.s.j.s.ServletContextHandler@39238eb5{/stages/pool/json,null,UNAVAILABLE}
17/07/29 15:55:13 INFO handler.ContextHandler: Stopped o.s.j.s.ServletContextHandler@78f235e9{/stages/pool,null,UNAVAILABLE}
17/07/29 15:55:13 INFO handler.ContextHandler: Stopped o.s.j.s.ServletContextHandler@69c43bee{/stages/stage/json,null,UNAVAILABLE}
17/07/29 15:55:13 INFO handler.ContextHandler: Stopped o.s.j.s.ServletContextHandler@5633e66b{/stages/stage,null,UNAVAILABLE}
17/07/29 15:55:13 INFO handler.ContextHandler: Stopped o.s.j.s.ServletContextHandler@5db38476{/stages/json,null,UNAVAILABLE}
17/07/29 15:55:13 INFO handler.ContextHandler: Stopped o.s.j.s.ServletContextHandler@2a476c0b{/stages,null,UNAVAILABLE}
17/07/29 15:55:13 INFO handler.ContextHandler: Stopped o.s.j.s.ServletContextHandler@cb67fdc{/jobs/job/json,null,UNAVAILABLE}
17/07/29 15:55:13 INFO handler.ContextHandler: Stopped o.s.j.s.ServletContextHandler@66ddbad9{/jobs/job,null,UNAVAILABLE}
17/07/29 15:55:13 INFO handler.ContextHandler: Stopped o.s.j.s.ServletContextHandler@5eb536db{/jobs/json,null,UNAVAILABLE}
17/07/29 15:55:13 INFO handler.ContextHandler: Stopped o.s.j.s.ServletContextHandler@79fbe584{/jobs,null,UNAVAILABLE}
17/07/29 15:55:13 INFO ui.SparkUI: Stopped Spark web UI at http://23.246.248.181:4041
17/07/29 15:55:13 INFO spark.MapOutputTrackerMasterEndpoint: MapOutputTrackerMasterEndpoint
stopped!
17/07/29 15:55:13 INFO memory.MemoryStore: MemoryStore cleared
17/07/29 15:55:13 INFO storage.BlockManager: BlockManager stopped
17/07/29 15:55:13 INFO storage.BlockManagerMaster: BlockManagerMaster stopped
17/07/29 15:55:13 INFO scheduler.OutputCommitCoordinator$OutputCommitCoordinatorEndpoint:
OutputCommitCoordinator stopped!
17/07/29 15:55:13 INFO spark.SparkContext: Successfully stopped SparkContext
Running org.apache.sysml.test.integration.scripts.nn.NNTest
Tests run: 1, Failures: 0, Errors: 0, Skipped: 0, Time elapsed: 481.141 sec - in org.apache.sysml.test.integration.scripts.nn.NNTest
17/07/29 15:55:13 INFO util.ShutdownHookManager: Shutdown hook called
17/07/29 15:55:13 INFO util.ShutdownHookManager: Deleting directory /tmp/spark-d7419ab0-9fe8-4243-a9ae-15572cb7a5c9
Running org.apache.sysml.test.integration.functions.quaternary.WeightedDivMatrixMultTest
Tests run: 90, Failures: 0, Errors: 0, Skipped: 0, Time elapsed: 1,097.039 sec - in org.apache.sysml.test.integration.functions.quaternary.WeightedDivMatrixMultTest
17/07/29 15:55:16 INFO util.ShutdownHookManager: Shutdown hook called
17/07/29 15:55:16 INFO util.ShutdownHookManager: Deleting directory /tmp/spark-254280ae-7d16-43cc-8189-9e261fb5feb8
Running org.apache.sysml.test.integration.applications.descriptivestats.UnivariateWeightedScaleDenseTest
Tests run: 24, Failures: 0, Errors: 0, Skipped: 0, Time elapsed: 303.244 sec - in org.apache.sysml.test.integration.applications.descriptivestats.UnivariateWeightedScaleDenseTest
Running org.apache.sysml.test.integration.functions.append.AppendChainTest
Tests run: 12, Failures: 0, Errors: 0, Skipped: 0, Time elapsed: 819.204 sec - in org.apache.sysml.test.integration.functions.append.AppendChainTest
Running org.apache.sysml.test.integration.applications.parfor.ParForNaiveBayesTest
Tests run: 10, Failures: 0, Errors: 0, Skipped: 0, Time elapsed: 401.683 sec - in org.apache.sysml.test.integration.applications.parfor.ParForNaiveBayesTest
Running org.apache.sysml.test.integration.applications.dml.HITSDMLTest
Tests run: 1, Failures: 0, Errors: 0, Skipped: 0, Time elapsed: 68.346 sec - in org.apache.sysml.test.integration.applications.dml.HITSDMLTest
Running org.apache.sysml.test.integration.applications.parfor.ParForSampleTest
Tests run: 6, Failures: 0, Errors: 0, Skipped: 0, Time elapsed: 88.363 sec - in org.apache.sysml.test.integration.applications.parfor.ParForSampleTest
Running org.apache.sysml.test.integration.applications.parfor.ParForUnivariateStatsTest
Tests run: 3, Failures: 0, Errors: 0, Skipped: 0, Time elapsed: 5.701 sec - in org.apache.sysml.test.integration.applications.parfor.ParForUnivariateStatsTest
Running org.apache.sysml.test.integration.applications.descriptivestats.UnivariateUnweightedScaleSparseTest
Tests run: 24, Failures: 0, Errors: 0, Skipped: 0, Time elapsed: 231.607 sec - in org.apache.sysml.test.integration.applications.descriptivestats.UnivariateUnweightedScaleSparseTest
Running org.apache.sysml.test.integration.functions.append.AppendMatrixTest
Tests run: 22, Failures: 0, Errors: 0, Skipped: 0, Time elapsed: 1,124.138 sec - in org.apache.sysml.test.integration.functions.append.AppendMatrixTest
Running org.apache.sysml.test.integration.applications.descriptivestats.UnivariateWeightedScaleSparseTest
Tests run: 24, Failures: 0, Errors: 0, Skipped: 0, Time elapsed: 306.858 sec - in org.apache.sysml.test.integration.applications.descriptivestats.UnivariateWeightedScaleSparseTest
Running org.apache.sysml.test.integration.applications.pydml.ArimaPyDMLTest
Tests run: 1, Failures: 0, Errors: 0, Skipped: 0, Time elapsed: 23.287 sec - in org.apache.sysml.test.integration.applications.pydml.ArimaPyDMLTest
Running org.apache.sysml.test.integration.applications.pydml.HITSPyDMLTest
Tests run: 1, Failures: 0, Errors: 0, Skipped: 0, Time elapsed: 133.896 sec - in org.apache.sysml.test.integration.applications.pydml.HITSPyDMLTest
Running org.apache.sysml.test.integration.applications.dml.LinearRegressionDMLTest
Tests run: 7, Failures: 0, Errors: 0, Skipped: 0, Time elapsed: 36.442 sec - in org.apache.sysml.test.integration.applications.dml.LinearRegressionDMLTest
Running org.apache.sysml.test.integration.applications.pydml.CsplineDSPyDMLTest
Tests run: 3, Failures: 0, Errors: 0, Skipped: 0, Time elapsed: 4.093 sec - in org.apache.sysml.test.integration.applications.pydml.CsplineDSPyDMLTest
Running org.apache.sysml.test.integration.applications.pydml.LinearLogRegPyDMLTest
Tests run: 7, Failures: 0, Errors: 0, Skipped: 0, Time elapsed: 137.685 sec - in org.apache.sysml.test.integration.applications.pydml.LinearLogRegPyDMLTest
Running org.apache.sysml.test.integration.applications.pydml.NaiveBayesPyDMLTest
Tests run: 6, Failures: 0, Errors: 0, Skipped: 0, Time elapsed: 92.287 sec - in org.apache.sysml.test.integration.applications.pydml.NaiveBayesPyDMLTest
Running org.apache.sysml.test.integration.applications.dml.CsplineCGDMLTest
Tests run: 3, Failures: 0, Errors: 0, Skipped: 0, Time elapsed: 11.463 sec - in org.apache.sysml.test.integration.applications.dml.CsplineCGDMLTest
Running org.apache.sysml.test.integration.applications.dml.L2SVMDMLTest
Tests run: 9, Failures: 0, Errors: 0, Skipped: 0, Time elapsed: 55.421 sec - in org.apache.sysml.test.integration.applications.dml.L2SVMDMLTest
Running org.apache.sysml.test.integration.applications.pydml.MDABivariateStatsPyDMLTest
Tests run: 4, Failures: 0, Errors: 0, Skipped: 0, Time elapsed: 381.97 sec - in org.apache.sysml.test.integration.applications.pydml.MDABivariateStatsPyDMLTest
Running org.apache.sysml.test.integration.applications.pydml.PageRankPyDMLTest
Tests run: 3, Failures: 0, Errors: 0, Skipped: 0, Time elapsed: 8.351 sec - in org.apache.sysml.test.integration.applications.pydml.PageRankPyDMLTest
Running org.apache.sysml.test.integration.applications.pydml.NaiveBayesParforPyDMLTest
Tests run: 6, Failures: 0, Errors: 0, Skipped: 0, Time elapsed: 95.168 sec - in org.apache.sysml.test.integration.applications.pydml.NaiveBayesParforPyDMLTest
Running org.apache.sysml.test.integration.applications.dml.NaiveBayesDMLTest
Tests run: 6, Failures: 0, Errors: 0, Skipped: 0, Time elapsed: 47.384 sec - in org.apache.sysml.test.integration.applications.dml.NaiveBayesDMLTest
Running org.apache.sysml.test.integration.applications.dml.MDABivariateStatsDMLTest
Tests run: 4, Failures: 0, Errors: 0, Skipped: 0, Time elapsed: 198.374 sec - in org.apache.sysml.test.integration.applications.dml.MDABivariateStatsDMLTest
Running org.apache.sysml.test.integration.applications.dml.PageRankDMLTest
Tests run: 3, Failures: 0, Errors: 0, Skipped: 0, Time elapsed: 4.359 sec - in org.apache.sysml.test.integration.applications.dml.PageRankDMLTest
Running org.apache.sysml.test.integration.applications.pydml.GLMPyDMLTest
Tests run: 30, Failures: 0, Errors: 0, Skipped: 0, Time elapsed: 388.118 sec - in org.apache.sysml.test.integration.applications.pydml.GLMPyDMLTest
Running org.apache.sysml.test.integration.applications.pydml.MultiClassSVMPyDMLTest
Tests run: 9, Failures: 0, Errors: 0, Skipped: 0, Time elapsed: 98.974 sec - in org.apache.sysml.test.integration.applications.pydml.MultiClassSVMPyDMLTest
Running org.apache.sysml.test.integration.applications.dml.ID3DMLTest
Tests run: 2, Failures: 0, Errors: 0, Skipped: 0, Time elapsed: 245.51 sec - in org.apache.sysml.test.integration.applications.dml.ID3DMLTest
Running org.apache.sysml.test.integration.applications.dml.GLMDMLTest
Tests run: 30, Failures: 0, Errors: 0, Skipped: 0, Time elapsed: 624.485 sec - in org.apache.sysml.test.integration.applications.dml.GLMDMLTest
Running org.apache.sysml.test.integration.applications.pydml.CsplineCGPyDMLTest
Tests run: 3, Failures: 0, Errors: 0, Skipped: 0, Time elapsed: 3.635 sec - in org.apache.sysml.test.integration.applications.pydml.CsplineCGPyDMLTest
Running org.apache.sysml.test.integration.applications.pydml.WelchTPyDMLTest
Tests run: 3, Failures: 0, Errors: 0, Skipped: 0, Time elapsed: 10.038 sec - in org.apache.sysml.test.integration.applications.pydml.WelchTPyDMLTest
Running org.apache.sysml.test.integration.applications.dml.MultiClassSVMDMLTest
Tests run: 9, Failures: 0, Errors: 0, Skipped: 0, Time elapsed: 52.133 sec - in org.apache.sysml.test.integration.applications.dml.MultiClassSVMDMLTest
Running org.apache.sysml.test.integration.applications.dml.CsplineDSDMLTest
Tests run: 3, Failures: 0, Errors: 0, Skipped: 0, Time elapsed: 14.131 sec - in org.apache.sysml.test.integration.applications.dml.CsplineDSDMLTest
Running org.apache.sysml.test.integration.applications.pydml.ApplyTransformPyDMLTest
Tests run: 7, Failures: 0, Errors: 0, Skipped: 0, Time elapsed: 0.501 sec - in org.apache.sysml.test.integration.applications.pydml.ApplyTransformPyDMLTest
Running org.apache.sysml.test.integration.applications.dml.NaiveBayesParforDMLTest
Tests run: 6, Failures: 0, Errors: 0, Skipped: 0, Time elapsed: 47.499 sec - in org.apache.sysml.test.integration.applications.dml.NaiveBayesParforDMLTest
Running org.apache.sysml.test.integration.applications.pydml.L2SVMPyDMLTest
Tests run: 9, Failures: 0, Errors: 0, Skipped: 0, Time elapsed: 112.846 sec - in org.apache.sysml.test.integration.applications.pydml.L2SVMPyDMLTest
Running org.apache.sysml.test.integration.applications.pydml.LinearRegressionPyDMLTest
Tests run: 7, Failures: 0, Errors: 0, Skipped: 0, Time elapsed: 81.714 sec - in org.apache.sysml.test.integration.applications.pydml.LinearRegressionPyDMLTest
Running org.apache.sysml.test.integration.applications.dml.LinearLogRegDMLTest
Tests run: 7, Failures: 0, Errors: 0, Skipped: 0, Time elapsed: 50.853 sec - in org.apache.sysml.test.integration.applications.dml.LinearLogRegDMLTest
Running org.apache.sysml.test.integration.applications.dml.GNMFDMLTest
Tests run: 3, Failures: 0, Errors: 0, Skipped: 0, Time elapsed: 53.849 sec - in org.apache.sysml.test.integration.applications.dml.GNMFDMLTest
Running org.apache.sysml.test.integration.applications.dml.WelchTDMLTest
Tests run: 3, Failures: 0, Errors: 0, Skipped: 0, Time elapsed: 3.989 sec - in org.apache.sysml.test.integration.applications.dml.WelchTDMLTest
Running org.apache.sysml.test.integration.applications.dml.ApplyTransformDMLTest
Tests run: 7, Failures: 0, Errors: 0, Skipped: 0, Time elapsed: 8.306 sec - in org.apache.sysml.test.integration.applications.dml.ApplyTransformDMLTest
Running org.apache.sysml.test.integration.applications.pydml.ID3PyDMLTest
Tests run: 2, Failures: 0, Errors: 0, Skipped: 0, Time elapsed: 554.851 sec - in org.apache.sysml.test.integration.applications.pydml.ID3PyDMLTest
Running org.apache.sysml.test.integration.applications.pydml.GNMFPyDMLTest
Tests run: 3, Failures: 0, Errors: 0, Skipped: 0, Time elapsed: 108.457 sec - in org.apache.sysml.test.integration.applications.pydml.GNMFPyDMLTest

Results :

Failed tests: 
  FullReblockTest.testBinaryBlockSingeMSparseSP:272->runReblockTest:479 25 values are not
in equal

Tests run: 7216, Failures: 1, Errors: 0, Skipped: 0

[INFO] 
[INFO] --- maven-failsafe-plugin:2.17:verify (default) @ systemml ---
[INFO] Failsafe report directory: <https://sparktc.ibmcloud.com/jenkins/job/SystemML-DailyTest/ws/target/failsafe-reports>
[INFO] ------------------------------------------------------------------------
[INFO] BUILD FAILURE
[INFO] ------------------------------------------------------------------------
[INFO] Total time: 02:11 h
[INFO] Finished at: 2017-07-29T16:49:39-05:00
[INFO] Final Memory: 63M/2430M
[INFO] ------------------------------------------------------------------------
[ERROR] Failed to execute goal org.apache.maven.plugins:maven-failsafe-plugin:2.17:verify
(default) on project systemml: There are test failures.
[ERROR] 
[ERROR] Please refer to <https://sparktc.ibmcloud.com/jenkins/job/SystemML-DailyTest/ws/target/failsafe-reports>
for the individual test results.
[ERROR] -> [Help 1]
[ERROR] 
[ERROR] To see the full stack trace of the errors, re-run Maven with the -e switch.
[ERROR] Re-run Maven using the -X switch to enable full debug logging.
[ERROR] 
[ERROR] For more information about the errors and possible solutions, please read the following
articles:
[ERROR] [Help 1] http://cwiki.apache.org/confluence/display/MAVEN/MojoFailureException
Build step 'Execute shell' marked build as failure
Run condition [Always] enabling perform for step [[]]

Mime
View raw message