tapestry-dev mailing list archives

Site index · List index
Message view « Date » · « Thread »
Top « Date » · « Thread »
From Apache Hudson Server <hud...@hudson.apache.org>
Subject Build failed in Jenkins: tapestry-5.2-freestyle #314
Date Thu, 14 Apr 2011 09:44:01 GMT
See <https://hudson.apache.org/hudson/job/tapestry-5.2-freestyle/314/changes>

Changes:

[drobiazko] Added org.apache.tomcat:dbcp dependency to tapestry-test

------------------------------------------
[...truncated 65527 lines...]
[dix] Could not init font path element /usr/share/fonts/X11/Type1, removing from list!
[dix] Could not init font path element /usr/share/fonts/X11/100dpi, removing from list!
[dix] Could not init font path element /usr/share/fonts/X11/75dpi, removing from list!
[dix] Could not init font path element /usr/share/fonts/X11/cyrillic, removing from list!
[dix] Could not init font path element /usr/share/fonts/X11/100dpi/:unscaled, removing from
list!
[dix] Could not init font path element /usr/share/fonts/X11/75dpi/:unscaled, removing from
list!
[dix] Could not init font path element /usr/share/fonts/X11/Type1, removing from list!
[dix] Could not init font path element /usr/share/fonts/X11/100dpi, removing from list!
[dix] Could not init font path element /usr/share/fonts/X11/75dpi, removing from list!
[EL Fine]: 2011-04-14 09:43:57.299--ClientSession(25989259)--Connection(23441700)--Thread(Thread[http-localhost%2F127.0.0.1-9090-1,5,main])--UPDATE
SEQUENCE SET SEQ_COUNT = SEQ_COUNT + ? WHERE SEQ_NAME = ?
	bind => [50, SEQ_GEN]
[EL Fine]: 2011-04-14 09:43:57.309--ClientSession(25989259)--Connection(23441700)--Thread(Thread[http-localhost%2F127.0.0.1-9090-1,5,main])--SELECT
SEQ_COUNT FROM SEQUENCE WHERE SEQ_NAME = ?
	bind => [SEQ_GEN]
[EL Fine]: 2011-04-14 09:43:57.317--ClientSession(25989259)--Connection(12819932)--Thread(Thread[http-localhost%2F127.0.0.1-9090-1,5,main])--INSERT
INTO THING (THING_ID, NAME) VALUES (?, ?)
	bind => [1, name]
[dix] Could not init font path element /usr/share/fonts/X11/cyrillic, removing from list!
[dix] Could not init font path element /usr/share/fonts/X11/100dpi/:unscaled, removing from
list!
[dix] Could not init font path element /usr/share/fonts/X11/75dpi/:unscaled, removing from
list!
[dix] Could not init font path element /usr/share/fonts/X11/Type1, removing from list!
[dix] Could not init font path element /usr/share/fonts/X11/100dpi, removing from list!
[dix] Could not init font path element /usr/share/fonts/X11/75dpi, removing from list!
Stopping Tomcat instance on port 9090/8443
09:43:58.471 INFO - Stopping Coyote HTTP/1.1 on http-localhost%2F127.0.0.1-9090
[EL Config]: 2011-04-14 09:43:58.472--ServerSession(11203640)--Connection(30906782)--Thread(Thread[main,5,main])--disconnect
[EL Info]: 2011-04-14 09:43:58.472--ServerSession(11203640)--Thread(Thread[main,5,main])--<https://hudson.apache.org/hudson/job/tapestry-5.2-freestyle/ws/trunk/tapestry-jpa/target/test-classes/_JndiDataSourcePersistenceUnit>
logout successful
Tomcat instance has stopped.
PASSED: persist_thing

===============================================
    JNDI DataSource Integration Tests
    Tests run: 1, Failures: 0, Skips: 0
===============================================

PASSED: persistence_unit_missing
PASSED: persistence_unit_missing_single_unit_configured
PASSED: persistence_unit_name_missing
PASSED: persistence_unit_name_missing_single_unit_configured
PASSED: undecorated
FAILED: checked_exception_will_commit_transaction
java.lang.AssertionError: 
  Unexpected method call EntityManagerManager.getEntityManagers():
    EntityManagerManager.getEntityManager("FooUnit"): expected: 1, actual: 0
    EntityManager.getTransaction(): expected: 1, actual: 0
    EntityTransaction.isActive(): expected: 2, actual: 0
    Performer.perform(): expected: 1, actual: 0
    EntityTransaction.commit(): expected: 1, actual: 0
	at org.easymock.internal.MockInvocationHandler.invoke(MockInvocationHandler.java:45)
	at org.easymock.internal.ObjectMethodsFilter.invoke(ObjectMethodsFilter.java:73)
	at $Proxy98.getEntityManagers(Unknown Source)
	at org.apache.tapestry5.internal.jpa.JpaInternalUtils.getEntityManager(JpaInternalUtils.java:85)
	at org.apache.tapestry5.internal.jpa.CommitAfterMethodAdvice.getTransaction(CommitAfterMethodAdvice.java:73)
	at org.apache.tapestry5.internal.jpa.CommitAfterMethodAdvice.advise(CommitAfterMethodAdvice.java:38)
	at org.apache.tapestry5.ioc.internal.util.InternalUtils$16.advise(InternalUtils.java:1374)
	at org.apache.tapestry5.internal.plastic.AbstractMethodInvocation.proceed(AbstractMethodInvocation.java:78)
	at $PlasticProxy$Performer_c9e0ddbe0bc13.perform(Unknown Source)
	at org.apache.tapestry5.internal.jpa.JpaTransactionAdvisorImplTest.checked_exception_will_commit_transaction(JpaTransactionAdvisorImplTest.java:332)
	at org.apache.maven.surefire.testng.TestNGExecutor.run(TestNGExecutor.java:74)
	at org.apache.maven.surefire.testng.TestNGXmlTestSuite.execute(TestNGXmlTestSuite.java:92)
	at org.apache.maven.surefire.Surefire.run(Surefire.java:177)
	at org.apache.maven.surefire.booter.SurefireBooter.runSuitesInProcess(SurefireBooter.java:345)
	at org.apache.maven.surefire.booter.SurefireBooter.main(SurefireBooter.java:1009)
... Removed 24 stack frames
FAILED: return_type_method
java.lang.AssertionError: 
  Unexpected method call EntityManagerManager.getEntityManagers():
    EntityManagerManager.getEntityManager("FooUnit"): expected: 1, actual: 0
    EntityManager.getTransaction(): expected: 1, actual: 0
    EntityTransaction.isActive(): expected: 2, actual: 0
    EntityTransaction.commit(): expected: 1, actual: 0
	at org.easymock.internal.MockInvocationHandler.invoke(MockInvocationHandler.java:45)
	at org.easymock.internal.ObjectMethodsFilter.invoke(ObjectMethodsFilter.java:73)
	at $Proxy98.getEntityManagers(Unknown Source)
	at org.apache.tapestry5.internal.jpa.JpaInternalUtils.getEntityManager(JpaInternalUtils.java:85)
	at org.apache.tapestry5.internal.jpa.CommitAfterMethodAdvice.getTransaction(CommitAfterMethodAdvice.java:73)
	at org.apache.tapestry5.internal.jpa.CommitAfterMethodAdvice.advise(CommitAfterMethodAdvice.java:38)
	at org.apache.tapestry5.ioc.internal.util.InternalUtils$16.advise(InternalUtils.java:1374)
	at org.apache.tapestry5.internal.plastic.AbstractMethodInvocation.proceed(AbstractMethodInvocation.java:78)
	at $PlasticProxy$ReturnTypeService_c9e0ddbe0bc4b.returnTypeMethod(Unknown Source)
	at org.apache.tapestry5.internal.jpa.JpaTransactionAdvisorImplTest.return_type_method(JpaTransactionAdvisorImplTest.java:364)
	at org.apache.maven.surefire.testng.TestNGExecutor.run(TestNGExecutor.java:74)
	at org.apache.maven.surefire.testng.TestNGXmlTestSuite.execute(TestNGXmlTestSuite.java:92)
	at org.apache.maven.surefire.Surefire.run(Surefire.java:177)
	at org.apache.maven.surefire.booter.SurefireBooter.runSuitesInProcess(SurefireBooter.java:345)
	at org.apache.maven.surefire.booter.SurefireBooter.main(SurefireBooter.java:1009)
... Removed 24 stack frames
FAILED: return_type_method_with_param
java.lang.AssertionError: 
  Unexpected method call EntityManagerManager.getEntityManagers():
    EntityManagerManager.getEntityManager("FooUnit"): expected: 1, actual: 0
    EntityManager.getTransaction(): expected: 1, actual: 0
    EntityTransaction.isActive(): expected: 2, actual: 0
    EntityTransaction.commit(): expected: 1, actual: 0
	at org.easymock.internal.MockInvocationHandler.invoke(MockInvocationHandler.java:45)
	at org.easymock.internal.ObjectMethodsFilter.invoke(ObjectMethodsFilter.java:73)
	at $Proxy98.getEntityManagers(Unknown Source)
	at org.apache.tapestry5.internal.jpa.JpaInternalUtils.getEntityManager(JpaInternalUtils.java:85)
	at org.apache.tapestry5.internal.jpa.CommitAfterMethodAdvice.getTransaction(CommitAfterMethodAdvice.java:73)
	at org.apache.tapestry5.internal.jpa.CommitAfterMethodAdvice.advise(CommitAfterMethodAdvice.java:38)
	at org.apache.tapestry5.ioc.internal.util.InternalUtils$16.advise(InternalUtils.java:1374)
	at org.apache.tapestry5.internal.plastic.AbstractMethodInvocation.proceed(AbstractMethodInvocation.java:78)
	at $PlasticProxy$ReturnTypeService_c9e0ddbe0bc52.returnTypeMethodWithParam(Unknown Source)
	at org.apache.tapestry5.internal.jpa.JpaTransactionAdvisorImplTest.return_type_method_with_param(JpaTransactionAdvisorImplTest.java:389)
	at org.apache.maven.surefire.testng.TestNGExecutor.run(TestNGExecutor.java:74)
	at org.apache.maven.surefire.testng.TestNGXmlTestSuite.execute(TestNGXmlTestSuite.java:92)
	at org.apache.maven.surefire.Surefire.run(Surefire.java:177)
	at org.apache.maven.surefire.booter.SurefireBooter.runSuitesInProcess(SurefireBooter.java:345)
	at org.apache.maven.surefire.booter.SurefireBooter.main(SurefireBooter.java:1009)
... Removed 24 stack frames
FAILED: runtime_exception_will_abort_transaction
java.lang.AssertionError: 
  Unexpected method call EntityManagerManager.getEntityManagers():
    EntityManagerManager.getEntityManager("FooUnit"): expected: 1, actual: 0
    EntityManager.getTransaction(): expected: 1, actual: 0
    EntityTransaction.isActive(): expected: 2, actual: 0
    Performer.perform(): expected: 1, actual: 0
    EntityTransaction.rollback(): expected: 1, actual: 0
	at org.easymock.internal.MockInvocationHandler.invoke(MockInvocationHandler.java:45)
	at org.easymock.internal.ObjectMethodsFilter.invoke(ObjectMethodsFilter.java:73)
	at $Proxy98.getEntityManagers(Unknown Source)
	at org.apache.tapestry5.internal.jpa.JpaInternalUtils.getEntityManager(JpaInternalUtils.java:85)
	at org.apache.tapestry5.internal.jpa.CommitAfterMethodAdvice.getTransaction(CommitAfterMethodAdvice.java:73)
	at org.apache.tapestry5.internal.jpa.CommitAfterMethodAdvice.advise(CommitAfterMethodAdvice.java:38)
	at org.apache.tapestry5.ioc.internal.util.InternalUtils$16.advise(InternalUtils.java:1374)
	at org.apache.tapestry5.internal.plastic.AbstractMethodInvocation.proceed(AbstractMethodInvocation.java:78)
	at $PlasticProxy$Performer_c9e0ddbe0bc59.perform(Unknown Source)
	at org.apache.tapestry5.internal.jpa.JpaTransactionAdvisorImplTest.runtime_exception_will_abort_transaction(JpaTransactionAdvisorImplTest.java:296)
	at org.apache.maven.surefire.testng.TestNGExecutor.run(TestNGExecutor.java:74)
	at org.apache.maven.surefire.testng.TestNGXmlTestSuite.execute(TestNGXmlTestSuite.java:92)
	at org.apache.maven.surefire.Surefire.run(Surefire.java:177)
	at org.apache.maven.surefire.booter.SurefireBooter.runSuitesInProcess(SurefireBooter.java:345)
	at org.apache.maven.surefire.booter.SurefireBooter.main(SurefireBooter.java:1009)
... Removed 24 stack frames
FAILED: transaction_inactive
java.lang.AssertionError: 
  Unexpected method call EntityManagerManager.getEntityManagers():
    EntityManagerManager.getEntityManager("FooUnit"): expected: 1, actual: 0
    EntityManager.getTransaction(): expected: 1, actual: 0
    EntityTransaction.isActive(): expected: 2, actual: 0
    EntityTransaction.begin(): expected: 1, actual: 0
    VoidService.voidMethod(): expected: 1, actual: 0
    EntityTransaction.commit(): expected: 1, actual: 0
	at org.easymock.internal.MockInvocationHandler.invoke(MockInvocationHandler.java:45)
	at org.easymock.internal.ObjectMethodsFilter.invoke(ObjectMethodsFilter.java:73)
	at $Proxy98.getEntityManagers(Unknown Source)
	at org.apache.tapestry5.internal.jpa.JpaInternalUtils.getEntityManager(JpaInternalUtils.java:85)
	at org.apache.tapestry5.internal.jpa.CommitAfterMethodAdvice.getTransaction(CommitAfterMethodAdvice.java:73)
	at org.apache.tapestry5.internal.jpa.CommitAfterMethodAdvice.advise(CommitAfterMethodAdvice.java:38)
	at org.apache.tapestry5.ioc.internal.util.InternalUtils$16.advise(InternalUtils.java:1374)
	at org.apache.tapestry5.internal.plastic.AbstractMethodInvocation.proceed(AbstractMethodInvocation.java:78)
	at $PlasticProxy$VoidService_c9e0ddbe0bc5d.voidMethod(Unknown Source)
	at org.apache.tapestry5.internal.jpa.JpaTransactionAdvisorImplTest.transaction_inactive(JpaTransactionAdvisorImplTest.java:215)
	at org.apache.maven.surefire.testng.TestNGExecutor.run(TestNGExecutor.java:74)
	at org.apache.maven.surefire.testng.TestNGXmlTestSuite.execute(TestNGXmlTestSuite.java:92)
	at org.apache.maven.surefire.Surefire.run(Surefire.java:177)
	at org.apache.maven.surefire.booter.SurefireBooter.runSuitesInProcess(SurefireBooter.java:345)
	at org.apache.maven.surefire.booter.SurefireBooter.main(SurefireBooter.java:1009)
... Removed 24 stack frames
FAILED: void_method
java.lang.AssertionError: 
  Unexpected method call EntityManagerManager.getEntityManagers():
    EntityManagerManager.getEntityManager("FooUnit"): expected: 1, actual: 0
    EntityManager.getTransaction(): expected: 1, actual: 0
    EntityTransaction.isActive(): expected: 2, actual: 0
    VoidService.voidMethod(): expected: 1, actual: 0
    EntityTransaction.commit(): expected: 1, actual: 0
	at org.easymock.internal.MockInvocationHandler.invoke(MockInvocationHandler.java:45)
	at org.easymock.internal.ObjectMethodsFilter.invoke(ObjectMethodsFilter.java:73)
	at $Proxy98.getEntityManagers(Unknown Source)
	at org.apache.tapestry5.internal.jpa.JpaInternalUtils.getEntityManager(JpaInternalUtils.java:85)
	at org.apache.tapestry5.internal.jpa.CommitAfterMethodAdvice.getTransaction(CommitAfterMethodAdvice.java:73)
	at org.apache.tapestry5.internal.jpa.CommitAfterMethodAdvice.advise(CommitAfterMethodAdvice.java:38)
	at org.apache.tapestry5.ioc.internal.util.InternalUtils$16.advise(InternalUtils.java:1374)
	at org.apache.tapestry5.internal.plastic.AbstractMethodInvocation.proceed(AbstractMethodInvocation.java:78)
	at $PlasticProxy$VoidService_c9e0ddbe0bc77.voidMethod(Unknown Source)
	at org.apache.tapestry5.internal.jpa.JpaTransactionAdvisorImplTest.void_method(JpaTransactionAdvisorImplTest.java:242)
	at org.apache.maven.surefire.testng.TestNGExecutor.run(TestNGExecutor.java:74)
	at org.apache.maven.surefire.testng.TestNGXmlTestSuite.execute(TestNGXmlTestSuite.java:92)
	at org.apache.maven.surefire.Surefire.run(Surefire.java:177)
	at org.apache.maven.surefire.booter.SurefireBooter.runSuitesInProcess(SurefireBooter.java:345)
	at org.apache.maven.surefire.booter.SurefireBooter.main(SurefireBooter.java:1009)
... Removed 24 stack frames
FAILED: void_method_with_param
java.lang.AssertionError: 
  Unexpected method call EntityManagerManager.getEntityManagers():
    EntityManagerManager.getEntityManager("FooUnit"): expected: 1, actual: 0
    EntityManager.getTransaction(): expected: 1, actual: 0
    EntityTransaction.isActive(): expected: 2, actual: 0
    VoidService.voidMethodWithParam(777): expected: 1, actual: 0
    EntityTransaction.commit(): expected: 1, actual: 0
	at org.easymock.internal.MockInvocationHandler.invoke(MockInvocationHandler.java:45)
	at org.easymock.internal.ObjectMethodsFilter.invoke(ObjectMethodsFilter.java:73)
	at $Proxy98.getEntityManagers(Unknown Source)
	at org.apache.tapestry5.internal.jpa.JpaInternalUtils.getEntityManager(JpaInternalUtils.java:85)
	at org.apache.tapestry5.internal.jpa.CommitAfterMethodAdvice.getTransaction(CommitAfterMethodAdvice.java:73)
	at org.apache.tapestry5.internal.jpa.CommitAfterMethodAdvice.advise(CommitAfterMethodAdvice.java:38)
	at org.apache.tapestry5.ioc.internal.util.InternalUtils$16.advise(InternalUtils.java:1374)
	at org.apache.tapestry5.internal.plastic.AbstractMethodInvocation.proceed(AbstractMethodInvocation.java:78)
	at $PlasticProxy$VoidService_c9e0ddbe0bc84.voidMethodWithParam(Unknown Source)
	at org.apache.tapestry5.internal.jpa.JpaTransactionAdvisorImplTest.void_method_with_param(JpaTransactionAdvisorImplTest.java:267)
	at org.apache.maven.surefire.testng.TestNGExecutor.run(TestNGExecutor.java:74)
	at org.apache.maven.surefire.testng.TestNGXmlTestSuite.execute(TestNGXmlTestSuite.java:92)
	at org.apache.maven.surefire.Surefire.run(Surefire.java:177)
	at org.apache.maven.surefire.booter.SurefireBooter.runSuitesInProcess(SurefireBooter.java:345)
	at org.apache.maven.surefire.booter.SurefireBooter.main(SurefireBooter.java:1009)
... Removed 24 stack frames

===============================================
    Tapestry JPA Unit Tests
    Tests run: 12, Failures: 7, Skips: 0
===============================================


===============================================
Tapestry JPA
Total tests run: 18, Failures: 8, Skips: 0
===============================================

[org.testng.internal.PoolService] Shutting down poolservice org.testng.internal.PoolService@1129103
terminated:false
Tests run: 18, Failures: 8, Errors: 0, Skipped: 0, Time elapsed: 41.514 sec <<< FAILURE!

Results :

Failed tests: 
  sso_entities(org.apache.tapestry5.jpa.integration.app1.JpaIntegrationTest)
  checked_exception_will_commit_transaction(org.apache.tapestry5.internal.jpa.JpaTransactionAdvisorImplTest)
  return_type_method(org.apache.tapestry5.internal.jpa.JpaTransactionAdvisorImplTest)
  return_type_method_with_param(org.apache.tapestry5.internal.jpa.JpaTransactionAdvisorImplTest)
  runtime_exception_will_abort_transaction(org.apache.tapestry5.internal.jpa.JpaTransactionAdvisorImplTest)
  transaction_inactive(org.apache.tapestry5.internal.jpa.JpaTransactionAdvisorImplTest)
  void_method(org.apache.tapestry5.internal.jpa.JpaTransactionAdvisorImplTest)
  void_method_with_param(org.apache.tapestry5.internal.jpa.JpaTransactionAdvisorImplTest)

Tests run: 18, Failures: 8, Errors: 0, Skipped: 0

[INFO] ------------------------------------------------------------------------
[ERROR] BUILD FAILURE
[INFO] ------------------------------------------------------------------------
[INFO] There are test failures.

Please refer to <https://hudson.apache.org/hudson/job/tapestry-5.2-freestyle/ws/trunk/tapestry-jpa/target/surefire-reports>
for the individual test results.
[INFO] ------------------------------------------------------------------------
[INFO] For more information, run Maven with the -e switch
[INFO] ------------------------------------------------------------------------
[INFO] Total time: 13 minutes 26 seconds
[INFO] Finished at: Thu Apr 14 09:43:58 UTC 2011
[INFO] Final Memory: 105M/550M
[INFO] ------------------------------------------------------------------------
[WARNINGS] Skipping publisher since build result is FAILURE
[TASKS] Skipping publisher since build result is FAILURE


---------------------------------------------------------------------
To unsubscribe, e-mail: dev-unsubscribe@tapestry.apache.org
For additional commands, e-mail: dev-help@tapestry.apache.org


Mime
View raw message