tapestry-dev mailing list archives

Site index · List index
Message view « Date » · « Thread »
Top « Date » · « Thread »
From Apache Jenkins Server <jenk...@builds.apache.org>
Subject Build failed in Jenkins: tapestry-trunk-freestyle #451
Date Sat, 06 Aug 2011 17:55:05 GMT
See <https://builds.apache.org/job/tapestry-trunk-freestyle/451/changes>

Changes:

[uli] first shot at snapshot deployment from jenkins

------------------------------------------
Started by user uli
Building remotely on ubuntu2
Updating https://svn.apache.org/repos/asf/tapestry/tapestry5/trunk
U         build.gradle
At revision 1154560
[tapestry-trunk-freestyle] $ /bin/bash -xe /tmp/hudson1184444212039461856.sh
+ Xvfb :6 -ac -screen 0 1024x768x8
[dix] Could not init font path element /usr/share/fonts/X11/cyrillic, removing from list!
[dix] Could not init font path element /usr/share/fonts/X11/100dpi/:unscaled, removing from
list!
[dix] Could not init font path element /usr/share/fonts/X11/75dpi/:unscaled, removing from
list!
[dix] Could not init font path element /usr/share/fonts/X11/Type1, removing from list!
[dix] Could not init font path element /usr/share/fonts/X11/100dpi, removing from list!
[dix] Could not init font path element /usr/share/fonts/X11/75dpi, removing from list!
Process leaked file descriptors. See http://wiki.jenkins-ci.org/display/JENKINS/Spawning+processes+from+build
for more information
[tapestry-trunk-freestyle] $ /bin/bash -xe /tmp/hudson6466308358248854708.sh
+ DISPLAY=:6.0
+ /home/hudson/tools/gradle/gradle-1.0-milestone-2/bin/gradle -b <https://builds.apache.org/job/tapestry-trunk-freestyle/ws/trunk/build.gradle>
continuousIntegration
:plastic:compileJava UP-TO-DATE
:plastic:compileGroovy UP-TO-DATE
:plastic:processResources UP-TO-DATE
:plastic:classes UP-TO-DATE
:plastic:jar
:tapestry-core:generateGrammarSource UP-TO-DATE
:tapestry-func:compileJava UP-TO-DATE
:tapestry-func:compileGroovy UP-TO-DATE
:tapestry-func:processResources UP-TO-DATE
:tapestry-func:classes UP-TO-DATE
:tapestry-func:jar
:tapestry-test:compileJava UP-TO-DATE
:tapestry-test:compileGroovy UP-TO-DATE
:tapestry-test:processResources UP-TO-DATE
:tapestry-test:classes UP-TO-DATE
:tapestry-test:jar
:tapestry5-annotations:compileJava UP-TO-DATE
:tapestry5-annotations:compileGroovy UP-TO-DATE
:tapestry5-annotations:processResources UP-TO-DATE
:tapestry5-annotations:classes UP-TO-DATE
:tapestry5-annotations:jar
:tapestry-ioc:compileJavaNote: Some input files use or override a deprecated API.
Note: Recompile with -Xlint:deprecation for details.
Note: Some input files use unchecked or unsafe operations.
Note: Recompile with -Xlint:unchecked for details.

:tapestry-ioc:compileGroovy UP-TO-DATE
:tapestry-ioc:processResources UP-TO-DATE
:tapestry-ioc:classes
:tapestry-ioc:jar
:tapestry-json:compileJava
:tapestry-json:compileGroovy UP-TO-DATE
:tapestry-json:processResources UP-TO-DATE
:tapestry-json:classes
:tapestry-json:jar
:tapestry-core:compileJava
[ant:javac] Note: Some input files use or override a deprecated API.
[ant:javac] Note: Recompile with -Xlint:deprecation for details.
[ant:javac] Note: Some input files use unchecked or unsafe operations.
[ant:javac] Note: Recompile with -Xlint:unchecked for details.
:tapestry-core:compileGroovy UP-TO-DATE
:tapestry-core:processResources UP-TO-DATE
:tapestry-core:classes
:tapestry-core:generateProjectProperties UP-TO-DATE
:tapestry-core:jar
:tapestry-beanvalidator:compileJavaNote: <https://builds.apache.org/job/tapestry-trunk-freestyle/ws/trunk/tapestry-beanvalidator/src/main/java/org/apache/tapestry5/beanvalidator/BeanValidatorModule.java>
uses or overrides a deprecated API.
Note: Recompile with -Xlint:deprecation for details.

:tapestry-beanvalidator:compileGroovy UP-TO-DATE
:tapestry-beanvalidator:processResources UP-TO-DATE
:tapestry-beanvalidator:classes
:tapestry-hibernate-core:compileJavaNote: Some input files use or override a deprecated API.
Note: Recompile with -Xlint:deprecation for details.

:tapestry-hibernate-core:compileGroovy UP-TO-DATE
:tapestry-hibernate-core:processResources UP-TO-DATE
:tapestry-hibernate-core:classes
:tapestry-hibernate-core:jar
:tapestry-hibernate:compileJavaNote: <https://builds.apache.org/job/tapestry-trunk-freestyle/ws/trunk/tapestry-hibernate/src/main/java/org/apache/tapestry5/hibernate/HibernateModule.java>
uses or overrides a deprecated API.
Note: Recompile with -Xlint:deprecation for details.

:tapestry-hibernate:compileGroovy UP-TO-DATE
:tapestry-hibernate:processResources UP-TO-DATE
:tapestry-hibernate:classes
:tapestry-javadoc:compileJava
:tapestry-javadoc:compileGroovy UP-TO-DATE
:tapestry-javadoc:processResources UP-TO-DATE
:tapestry-javadoc:classes
:tapestry-javadoc:jar
:tapestry-jmx:compileJavaNote: <https://builds.apache.org/job/tapestry-trunk-freestyle/ws/trunk/tapestry-jmx/src/main/java/org/apache/tapestry5/internal/jmx/MBeanSupportImpl.java>
uses unchecked or unsafe operations.
Note: Recompile with -Xlint:unchecked for details.

:tapestry-jmx:compileGroovy UP-TO-DATE
:tapestry-jmx:processResources UP-TO-DATE
:tapestry-jmx:classes
:tapestry-jpa:compileJavaNote: <https://builds.apache.org/job/tapestry-trunk-freestyle/ws/trunk/tapestry-jpa/src/main/java/org/apache/tapestry5/internal/jpa/EntityManagerObjectProvider.java>
uses or overrides a deprecated API.
Note: Recompile with -Xlint:deprecation for details.
Note: Some input files use unchecked or unsafe operations.
Note: Recompile with -Xlint:unchecked for details.

:tapestry-jpa:compileGroovy UP-TO-DATE
:tapestry-jpa:processResources UP-TO-DATE
:tapestry-jpa:classes
:tapestry-kaptcha:compileJava
:tapestry-kaptcha:compileGroovy UP-TO-DATE
:tapestry-kaptcha:processResources UP-TO-DATE
:tapestry-kaptcha:classes
:tapestry-spring:compileJavaNote: <https://builds.apache.org/job/tapestry-trunk-freestyle/ws/trunk/tapestry-spring/src/main/java/org/apache/tapestry5/internal/spring/SpringModuleDef.java>
uses or overrides a deprecated API.
Note: Recompile with -Xlint:deprecation for details.
Note: Some input files use unchecked or unsafe operations.
Note: Recompile with -Xlint:unchecked for details.

:tapestry-spring:compileGroovy UP-TO-DATE
:tapestry-spring:processResources UP-TO-DATE
:tapestry-spring:classes
:tapestry-upload:compileJavaNote: Some input files use or override a deprecated API.
Note: Recompile with -Xlint:deprecation for details.
Note: <https://builds.apache.org/job/tapestry-trunk-freestyle/ws/trunk/tapestry-upload/src/main/java/org/apache/tapestry5/upload/components/Upload.java>
uses unchecked or unsafe operations.
Note: Recompile with -Xlint:unchecked for details.

:tapestry-upload:compileGroovy UP-TO-DATE
:tapestry-upload:processResources UP-TO-DATE
:tapestry-upload:classes
:tapestry-yuicompressor:compileJava
:tapestry-yuicompressor:compileGroovy UP-TO-DATE
:tapestry-yuicompressor:processResources UP-TO-DATE
:tapestry-yuicompressor:classes
:aggregateJavadoc<https://builds.apache.org/job/tapestry-trunk-freestyle/ws/trunk/tapestry-core/src/main/java/org/apache/tapestry5/annotations/Import.java>:49:
warning - Tag @link: can't find containingPageDidLoad() in org.apache.tapestry5.runtime.Component
<https://builds.apache.org/job/tapestry-trunk-freestyle/ws/trunk/tapestry-ioc/src/main/java/org/apache/tapestry5/ioc/services/DefaultImplementationBuilder.java>:33:
warning - @return tag has no arguments.
<https://builds.apache.org/job/tapestry-trunk-freestyle/ws/trunk/tapestry-ioc/src/main/java/org/apache/tapestry5/ioc/services/PipelineBuilder.java>:66:
warning - @return tag has no arguments.
<https://builds.apache.org/job/tapestry-trunk-freestyle/ws/trunk/tapestry-core/src/main/java/org/apache/tapestry5/services/javascript/JavaScriptSupport.java>:47:
warning - Tag @linkplain: can't find importStylesheet(Asset, StylesheetOptions) in org.apache.tapestry5.services.javascript.JavaScriptSupport
<https://builds.apache.org/job/tapestry-trunk-freestyle/ws/trunk/tapestry-core/src/main/java/org/apache/tapestry5/services/javascript/JavaScriptSupport.java>:175:
warning - Tag @see: reference not found: IncludeJavaScriptLibrary
<https://builds.apache.org/job/tapestry-trunk-freestyle/ws/trunk/tapestry-core/src/main/java/org/apache/tapestry5/services/javascript/StylesheetOptions.java>:55:
warning - Tag @see:illegal character: "58" in "http://en.wikipedia.org/wiki/Conditional_comment"
<https://builds.apache.org/job/tapestry-trunk-freestyle/ws/trunk/tapestry-core/src/main/java/org/apache/tapestry5/services/javascript/StylesheetOptions.java>:55:
warning - Tag @see:illegal character: "47" in "http://en.wikipedia.org/wiki/Conditional_comment"
<https://builds.apache.org/job/tapestry-trunk-freestyle/ws/trunk/tapestry-core/src/main/java/org/apache/tapestry5/services/javascript/StylesheetOptions.java>:55:
warning - Tag @see:illegal character: "47" in "http://en.wikipedia.org/wiki/Conditional_comment"
<https://builds.apache.org/job/tapestry-trunk-freestyle/ws/trunk/tapestry-core/src/main/java/org/apache/tapestry5/services/javascript/StylesheetOptions.java>:55:
warning - Tag @see:illegal character: "47" in "http://en.wikipedia.org/wiki/Conditional_comment"
<https://builds.apache.org/job/tapestry-trunk-freestyle/ws/trunk/tapestry-core/src/main/java/org/apache/tapestry5/services/javascript/StylesheetOptions.java>:55:
warning - Tag @see:illegal character: "47" in "http://en.wikipedia.org/wiki/Conditional_comment"
<https://builds.apache.org/job/tapestry-trunk-freestyle/ws/trunk/tapestry-core/src/main/java/org/apache/tapestry5/services/javascript/StylesheetOptions.java>:55:
warning - Tag @see: reference not found: http://en.wikipedia.org/wiki/Conditional_comment
<https://builds.apache.org/job/tapestry-trunk-freestyle/ws/trunk/tapestry-core/src/main/java/org/apache/tapestry5/services/javascript/JavaScriptSupport.java>:175:
warning - Tag @see: reference not found: IncludeJavaScriptLibrary
<https://builds.apache.org/job/tapestry-trunk-freestyle/ws/trunk/tapestry-ioc/src/main/java/org/apache/tapestry5/ioc/services/ExceptionInfo.java>:24:
warning - Tag @see:illegal character: "123" in "{@link org.apache.tapestry5.ioc.services.ExceptionAnalysis}"
<https://builds.apache.org/job/tapestry-trunk-freestyle/ws/trunk/tapestry-ioc/src/main/java/org/apache/tapestry5/ioc/services/ExceptionInfo.java>:24:
warning - Tag @see:illegal character: "64" in "{@link org.apache.tapestry5.ioc.services.ExceptionAnalysis}"
<https://builds.apache.org/job/tapestry-trunk-freestyle/ws/trunk/tapestry-ioc/src/main/java/org/apache/tapestry5/ioc/services/ExceptionInfo.java>:24:
warning - Tag @see: reference not found: {@link org.apache.tapestry5.ioc.services.ExceptionAnalysis}
<https://builds.apache.org/job/tapestry-trunk-freestyle/ws/trunk/tapestry-ioc/src/main/java/org/apache/tapestry5/ioc/services/FieldValueConduit.java>:27:
warning - Tag @see:illegal character: "123" in "{@link PlasticField}, {@link FieldConduit}"
<https://builds.apache.org/job/tapestry-trunk-freestyle/ws/trunk/tapestry-ioc/src/main/java/org/apache/tapestry5/ioc/services/FieldValueConduit.java>:27:
warning - Tag @see:illegal character: "64" in "{@link PlasticField}, {@link FieldConduit}"
<https://builds.apache.org/job/tapestry-trunk-freestyle/ws/trunk/tapestry-ioc/src/main/java/org/apache/tapestry5/ioc/services/FieldValueConduit.java>:27:
warning - Tag @see: reference not found: {@link PlasticField}, {@link FieldConduit}
<https://builds.apache.org/job/tapestry-trunk-freestyle/ws/trunk/tapestry-ioc/src/main/java/org/apache/tapestry5/ioc/services/PerThreadValue.java>:22:
warning - Tag @link: can't find get(Object) in org.apache.tapestry5.ioc.services.PerthreadManager
<https://builds.apache.org/job/tapestry-trunk-freestyle/ws/trunk/tapestry-ioc/src/main/java/org/apache/tapestry5/ioc/services/PerThreadValue.java>:22:
warning - Tag @link: can't find put(Object, Object) in org.apache.tapestry5.ioc.services.PerthreadManager
<https://builds.apache.org/job/tapestry-trunk-freestyle/ws/trunk/tapestry-core/src/main/java/org/apache/tapestry5/services/messages/ComponentMessagesSource.java>:60:
warning - @param argument "locale" is not a parameter name.
<https://builds.apache.org/job/tapestry-trunk-freestyle/ws/trunk/tapestry-ioc/src/main/java/org/apache/tapestry5/ioc/internal/InternalRegistry.java>:122:
warning - @param argument "<K," is not a parameter name.
<https://builds.apache.org/job/tapestry-trunk-freestyle/ws/trunk/tapestry-test/src/main/java/org/apache/tapestry5/test/SeleniumLauncher.java>:56:
warning - Tag @link: can't find startup(String, String, int, String, ITestContext) in org.apache.tapestry5.test.SeleniumLauncher
<https://builds.apache.org/job/tapestry-trunk-freestyle/ws/trunk/tapestry-test/src/main/java/org/apache/tapestry5/test/SeleniumTestCase.java>:144:
warning - Tag @link: reference not found: org.apache.tapestry5.integration.reload.ReloadTests#beforeStartup
<https://builds.apache.org/job/tapestry-trunk-freestyle/ws/trunk/tapestry-core/src/main/java/org/apache/tapestry5/internal/transform/ParameterConduit.java>:57:
warning - Tag @link: can't find containingPageDidLoad() in org.apache.tapestry5.runtime.Component
<https://builds.apache.org/job/tapestry-trunk-freestyle/ws/trunk/tapestry-core/src/main/java/org/apache/tapestry5/internal/structure/Page.java>:193:
warning - Tag @link: reference not found: PagePool
<https://builds.apache.org/job/tapestry-trunk-freestyle/ws/trunk/tapestry-core/src/main/java/org/apache/tapestry5/internal/structure/Page.java>:193:
warning - Tag @link: reference not found: PagePool
<https://builds.apache.org/job/tapestry-trunk-freestyle/ws/trunk/tapestry-core/src/main/java/org/apache/tapestry5/services/ClassTransformation.java>:62:
warning - Tag @see: can't find provideOldStyleCassTransformWorkers(
 org.apache.tapestry5.ioc.OrderedConfiguration, org.apache.tapestry5.services.meta.MetaWorker,
ComponentClassResolver) in org.apache.tapestry5.services.TapestryModule
<https://builds.apache.org/job/tapestry-trunk-freestyle/ws/trunk/tapestry-core/src/main/java/org/apache/tapestry5/services/ComponentEventHandler.java>:26:
warning - Tag @link: can't find addEventHandler(String, int, ComponentEventHandler) in org.apache.tapestry5.services.transform.TransformationSupport
<https://builds.apache.org/job/tapestry-trunk-freestyle/ws/trunk/tapestry-core/src/main/java/org/apache/tapestry5/services/ContextValueEncoder.java>:23:
warning - @See is an unknown tag -- same as a known tag except for case.
<https://builds.apache.org/job/tapestry-trunk-freestyle/ws/trunk/tapestry-core/src/main/java/org/apache/tapestry5/services/DataTypeAnalyzer.java>:42:
warning - End Delimiter } missing for possible See Tag in comment string: "Used by {@link
BeanModelSource} to identify the type of data associated with a particular property (represented
as a
 {@link PropertyAdapter}). The data type is a string used to determine what kind of interface
to use for displaying
 the value of the property, or what kind of interface to use for editing the value of the
property. Common property
 types are "text", "enum", "checkbox", but the list is extensible.
 <p/>
 <p>Different strategies for identifying the data type are encapsulated in the DataTypeAnalyzer
service, forming a
 chain of command.
 <p/>
 The DefaultDataTypeAnalyzer service maps property types to data type names.
 <p/>
 The DataTypeAnalyzer service is an extensible {@linkplain org.apache.tapestry5.ioc.services.ChainBuilder
chain of
 command), that (by default) includes {@link org.apache.tapestry5.internal.services.AnnotationDataTypeAnalyzer}
and
 the DefaultDataTypeAnalyzer service (ordered last).   It uses an ordered configuration."
<https://builds.apache.org/job/tapestry-trunk-freestyle/ws/trunk/tapestry-core/src/main/java/org/apache/tapestry5/services/DataTypeAnalyzer.java>:42:
warning - Tag @see: reference not found: Grid
<https://builds.apache.org/job/tapestry-trunk-freestyle/ws/trunk/tapestry-core/src/main/java/org/apache/tapestry5/services/DataTypeAnalyzer.java>:42:
warning - Tag @see: reference not found: BeanEditForm
<https://builds.apache.org/job/tapestry-trunk-freestyle/ws/trunk/tapestry-core/src/main/java/org/apache/tapestry5/services/LibraryMapping.java>:38:
warning - Tag @see: can't find contributeComponentClassResolver(org.apache.tapestry5.ioc.Configuration)
in org.apache.tapestry5.services.TapestryModule
<https://builds.apache.org/job/tapestry-trunk-freestyle/ws/trunk/tapestry-core/src/main/java/org/apache/tapestry5/services/MarkupRenderer.java>:31:
warning - @{@link is an unknown tag.
<https://builds.apache.org/job/tapestry-trunk-freestyle/ws/trunk/tapestry-core/src/main/java/org/apache/tapestry5/services/MethodAccess.java>:31:
warning - Tag @see:illegal character: "123" in "{@link PlasticClass}, {@link {@link PlasticMethod},
{@link MethodHandle}"
<https://builds.apache.org/job/tapestry-trunk-freestyle/ws/trunk/tapestry-core/src/main/java/org/apache/tapestry5/services/MethodAccess.java>:31:
warning - Tag @see:illegal character: "64" in "{@link PlasticClass}, {@link {@link PlasticMethod},
{@link MethodHandle}"
<https://builds.apache.org/job/tapestry-trunk-freestyle/ws/trunk/tapestry-core/src/main/java/org/apache/tapestry5/services/MethodAccess.java>:31:
warning - Tag @see: reference not found: {@link PlasticClass}, {@link {@link PlasticMethod},
{@link MethodHandle}
<https://builds.apache.org/job/tapestry-trunk-freestyle/ws/trunk/tapestry-core/src/main/java/org/apache/tapestry5/services/PageRenderRequestParameters.java>:37:
warning - Missing closing '}' character for inline tag: "{@link #PageRenderRequestParameters(String,
EventContext, boolean)"
<https://builds.apache.org/job/tapestry-trunk-freestyle/ws/trunk/tapestry-core/src/main/java/org/apache/tapestry5/services/TapestryModule.java>:975:
warning - Tag @link: reference not found: .ComponentResourcesAware
<https://builds.apache.org/job/tapestry-trunk-freestyle/ws/trunk/tapestry-core/src/main/java/org/apache/tapestry5/services/TapestryModule.java>:2691:
warning - @return tag has no arguments.
<https://builds.apache.org/job/tapestry-trunk-freestyle/ws/trunk/tapestry-core/src/main/java/org/apache/tapestry5/services/TapestryModule.java>:975:
warning - Tag @link: reference not found: .ComponentResourcesAware
<https://builds.apache.org/job/tapestry-trunk-freestyle/ws/trunk/tapestry-core/src/main/java/org/apache/tapestry5/services/TransformMethod.java>:83:
warning - @param argument "signature" is not a parameter name.
<https://builds.apache.org/job/tapestry-trunk-freestyle/ws/trunk/tapestry-core/src/main/java/org/apache/tapestry5/services/TransformMethodSignature.java>:257:
warning - @return tag has no arguments.
<https://builds.apache.org/job/tapestry-trunk-freestyle/ws/trunk/tapestry-ioc/src/main/java/org/apache/tapestry5/ioc/internal/util/InternalUtils.java>:1303:
warning - @lihk is an unknown tag.
<https://builds.apache.org/job/tapestry-trunk-freestyle/ws/trunk/tapestry-ioc/src/main/java/org/apache/tapestry5/ioc/internal/util/InternalUtils.java>:1303:
warning - @lihk is an unknown tag.
<https://builds.apache.org/job/tapestry-trunk-freestyle/ws/trunk/tapestry-ioc/src/main/java/org/apache/tapestry5/ioc/internal/util/InternalUtils.java>:1303:
warning - @lihk is an unknown tag.
<https://builds.apache.org/job/tapestry-trunk-freestyle/ws/trunk/tapestry-ioc/src/main/java/org/apache/tapestry5/ioc/RegistryBuilder.java>:233:
warning - @param argument "moduleDef" is not a parameter name.
<https://builds.apache.org/job/tapestry-trunk-freestyle/ws/trunk/tapestry-core/src/main/java/org/apache/tapestry5/services/pageload/ComponentRequestSelectorAnalyzer.java>:27:
warning - Tag @link: reference not found: Request
<https://builds.apache.org/job/tapestry-trunk-freestyle/ws/trunk/tapestry-core/src/main/java/org/apache/tapestry5/services/pageload/ComponentResourceSelector.java>:122:
warning - @return tag has no arguments.
<https://builds.apache.org/job/tapestry-trunk-freestyle/ws/trunk/tapestry-core/src/main/java/org/apache/tapestry5/services/pageload/ComponentResourceSelector.java>:60:
warning - @return tag has no arguments.
<https://builds.apache.org/job/tapestry-trunk-freestyle/ws/trunk/tapestry-core/src/main/java/org/apache/tapestry5/corelib/components/Alerts.java>:38:
warning - Missing closing '}' character for inline tag: "{@linkplain org.apache.tapestry5.alerts.AlertStorage#dismissNonPersistent()
removes all non-persistent alerts)."
<https://builds.apache.org/job/tapestry-trunk-freestyle/ws/trunk/tapestry-core/src/main/java/org/apache/tapestry5/tree/TreeExpansionModel.java>:37:
warning - @return tag has no arguments.
<https://builds.apache.org/job/tapestry-trunk-freestyle/ws/trunk/tapestry-core/src/main/java/org/apache/tapestry5/services/TapestryModule.java>:975:
warning - Tag @link: reference not found: .ComponentResourcesAware
<https://builds.apache.org/job/tapestry-trunk-freestyle/ws/trunk/tapestry-core/src/main/java/org/apache/tapestry5/services/TapestryModule.java>:975:
warning - Tag @link: reference not found: .ComponentResourcesAware
<https://builds.apache.org/job/tapestry-trunk-freestyle/ws/trunk/tapestry-core/src/main/java/org/apache/tapestry5/services/TapestryModule.java>:975:
warning - Tag @link: reference not found: .ComponentResourcesAware
<https://builds.apache.org/job/tapestry-trunk-freestyle/ws/trunk/tapestry-core/src/main/java/org/apache/tapestry5/services/TapestryModule.java>:975:
warning - Tag @link: reference not found: .ComponentResourcesAware
<https://builds.apache.org/job/tapestry-trunk-freestyle/ws/trunk/tapestry-core/src/main/java/org/apache/tapestry5/services/TapestryModule.java>:975:
warning - Tag @link: reference not found: .ComponentResourcesAware
<https://builds.apache.org/job/tapestry-trunk-freestyle/ws/trunk/tapestry-core/src/main/java/org/apache/tapestry5/services/TapestryModule.java>:975:
warning - Tag @link: reference not found: .ComponentResourcesAware
<https://builds.apache.org/job/tapestry-trunk-freestyle/ws/trunk/tapestry-ioc/src/main/java/org/apache/tapestry5/ioc/internal/util/InternalUtils.java>:1303:
warning - @lihk is an unknown tag.
<https://builds.apache.org/job/tapestry-trunk-freestyle/ws/trunk/tapestry-core/src/main/java/org/apache/tapestry5/services/TapestryModule.java>:975:
warning - Tag @link: reference not found: .ComponentResourcesAware
<https://builds.apache.org/job/tapestry-trunk-freestyle/ws/trunk/tapestry-core/src/main/java/org/apache/tapestry5/services/TapestryModule.java>:975:
warning - Tag @link: reference not found: .ComponentResourcesAware
<https://builds.apache.org/job/tapestry-trunk-freestyle/ws/trunk/tapestry-ioc/src/main/java/org/apache/tapestry5/ioc/internal/util/InternalUtils.java>:1303:
warning - @lihk is an unknown tag.
<https://builds.apache.org/job/tapestry-trunk-freestyle/ws/trunk/tapestry-core/src/main/java/org/apache/tapestry5/services/TapestryModule.java>:975:
warning - Tag @link: reference not found: .ComponentResourcesAware
<https://builds.apache.org/job/tapestry-trunk-freestyle/ws/trunk/tapestry-core/src/main/java/org/apache/tapestry5/services/TapestryModule.java>:975:
warning - Tag @link: reference not found: .ComponentResourcesAware
<https://builds.apache.org/job/tapestry-trunk-freestyle/ws/trunk/tapestry-core/src/main/java/org/apache/tapestry5/services/TapestryModule.java>:975:
warning - Tag @link: reference not found: .ComponentResourcesAware
<https://builds.apache.org/job/tapestry-trunk-freestyle/ws/trunk/tapestry-core/src/main/java/org/apache/tapestry5/services/TapestryModule.java>:975:
warning - Tag @link: reference not found: .ComponentResourcesAware
<https://builds.apache.org/job/tapestry-trunk-freestyle/ws/trunk/tapestry-core/src/main/java/org/apache/tapestry5/services/TapestryModule.java>:975:
warning - Tag @link: reference not found: .ComponentResourcesAware
<https://builds.apache.org/job/tapestry-trunk-freestyle/ws/trunk/tapestry-ioc/src/main/java/org/apache/tapestry5/ioc/internal/util/InternalUtils.java>:1303:
warning - @lihk is an unknown tag.

69 warnings
:plastic:sourcesJar
:plastic:assemble
:plastic:compileTestJava UP-TO-DATE
:plastic:compileTestGroovy UP-TO-DATE
:plastic:processTestResources UP-TO-DATE
:plastic:testClasses UP-TO-DATE
:plastic:test UP-TO-DATE
:plastic:check UP-TO-DATE
:plastic:build
:plastic:uploadPublished

FAILURE: Build failed with an exception.

* What went wrong:
Execution failed for task ':plastic:uploadPublished'.
Cause: Could not publish configurations [configuration ':plastic:published', configuration
':plastic:archives', configuration ':plastic:meta'].
Cause: Error deploying artifact 'org.apache.tapestry:plastic:jar': Error retrieving previous
build number for artifact 'org.apache.tapestry:plastic:jar': repository metadata for: 'snapshot
org.apache.tapestry:plastic:5.3-SNAPSHOT' could not be retrieved from repository: remote due
to an error: Authorization failed: Access denied to: https://repository.apache.org/service/local/snapshots/deploy/maven2/org/apache/tapestry/plastic/5.3-SNAPSHOT/maven-metadata.xml
Cause: Error retrieving previous build number for artifact 'org.apache.tapestry:plastic:jar':
repository metadata for: 'snapshot org.apache.tapestry:plastic:5.3-SNAPSHOT' could not be
retrieved from repository: remote due to an error: Authorization failed: Access denied to:
https://repository.apache.org/service/local/snapshots/deploy/maven2/org/apache/tapestry/plastic/5.3-SNAPSHOT/maven-metadata.xml
Cause: repository metadata for: 'snapshot org.apache.tapestry:plastic:5.3-SNAPSHOT' could
not be retrieved from repository: remote due to an error: Authorization failed: Access denied
to: https://repository.apache.org/service/local/snapshots/deploy/maven2/org/apache/tapestry/plastic/5.3-SNAPSHOT/maven-metadata.xml
Cause: Authorization failed: Access denied to: https://repository.apache.org/service/local/snapshots/deploy/maven2/org/apache/tapestry/plastic/5.3-SNAPSHOT/maven-metadata.xml
Cause: Access denied to: https://repository.apache.org/service/local/snapshots/deploy/maven2/org/apache/tapestry/plastic/5.3-SNAPSHOT/maven-metadata.xml

* Try:
Run with --stacktrace option to get the stack trace. Run with --info or --debug option to
get more log output.

BUILD FAILED

Total time: 1 mins 10.764 secs
[WARNINGS] Skipping publisher since build result is FAILURE
[TASKS] Skipping publisher since build result is FAILURE
Publishing Javadoc


---------------------------------------------------------------------
To unsubscribe, e-mail: dev-unsubscribe@tapestry.apache.org
For additional commands, e-mail: dev-help@tapestry.apache.org


Mime
View raw message