tapestry-dev mailing list archives

Site index · List index
Message view « Date » · « Thread »
Top « Date » · « Thread »
From Apache Jenkins Server <jenk...@builds.apache.org>
Subject Build failed in Jenkins: tapestry-trunk-freestyle #662
Date Tue, 24 Jan 2012 10:32:18 GMT
See <https://builds.apache.org/job/tapestry-trunk-freestyle/662/changes>

Changes:

[mlusetti] TAP5-1826 Setup the Sonar plugin for analysis.apache.org

------------------------------------------
Started by an SCM change
Building remotely on ubuntu1
Updating https://svn.apache.org/repos/asf/tapestry/tapestry5/trunk
U         build.gradle
U         tapestry-core/build.gradle
U         tapestry-spring/src/test/conf/testng.xml
At revision 1235198
[tapestry-trunk-freestyle] $ /bin/bash -xe /tmp/hudson9103906336202553660.sh
+ Xvfb :6 -ac -screen 0 1024x768x8
[dix] Could not init font path element /usr/share/fonts/X11/cyrillic, removing from list!
[dix] Could not init font path element /usr/share/fonts/X11/100dpi/:unscaled, removing from
list!
[dix] Could not init font path element /usr/share/fonts/X11/75dpi/:unscaled, removing from
list!
[dix] Could not init font path element /usr/share/fonts/X11/Type1, removing from list!
[dix] Could not init font path element /usr/share/fonts/X11/100dpi, removing from list!
[dix] Could not init font path element /usr/share/fonts/X11/75dpi, removing from list!
[dix] Could not init font path element /var/lib/defoma/x-ttcidfont-conf.d/dirs/TrueType, removing
from list!
Process leaked file descriptors. See http://wiki.jenkins-ci.org/display/JENKINS/Spawning+processes+from+build
for more information
[tapestry-trunk-freestyle] $ /bin/bash -xe /tmp/hudson3702079268752447211.sh
+ DISPLAY=:6.0
+ bash <https://builds.apache.org/job/tapestry-trunk-freestyle/ws/trunk/gradlew> -Dproject-version=5.4-SNAPSHOT
-Dfile.encoding=UTF-8 -b <https://builds.apache.org/job/tapestry-trunk-freestyle/ws/trunk/build.gradle>
continuousIntegration
:plastic:compileJava UP-TO-DATE
:plastic:compileGroovy UP-TO-DATE
:plastic:processResources UP-TO-DATE
:plastic:classes UP-TO-DATE
:plastic:jar UP-TO-DATE
:tapestry-core:generateGrammarSource
:tapestry-func:compileJava UP-TO-DATE
:tapestry-func:compileGroovy UP-TO-DATE
:tapestry-func:processResources UP-TO-DATE
:tapestry-func:classes UP-TO-DATE
:tapestry-func:jar UP-TO-DATE
:tapestry-test:compileJava UP-TO-DATE
:tapestry-test:compileGroovy UP-TO-DATE
:tapestry-test:processResources UP-TO-DATE
:tapestry-test:classes UP-TO-DATE
:tapestry-test:jar UP-TO-DATE
:tapestry5-annotations:compileJava UP-TO-DATE
:tapestry5-annotations:compileGroovy UP-TO-DATE
:tapestry5-annotations:processResources UP-TO-DATE
:tapestry5-annotations:classes UP-TO-DATE
:tapestry5-annotations:jar UP-TO-DATE
:tapestry-ioc:compileJava UP-TO-DATE
:tapestry-ioc:compileGroovy UP-TO-DATE
:tapestry-ioc:processResources UP-TO-DATE
:tapestry-ioc:classes UP-TO-DATE
:tapestry-ioc:jar UP-TO-DATE
:tapestry-json:compileJava UP-TO-DATE
:tapestry-json:compileGroovy UP-TO-DATE
:tapestry-json:processResources UP-TO-DATE
:tapestry-json:classes UP-TO-DATE
:tapestry-json:jar UP-TO-DATE
:tapestry-core:compileJava
[ant:javac] Note: Some input files use or override a deprecated API.
[ant:javac] Note: Recompile with -Xlint:deprecation for details.
[ant:javac] Note: Some input files use unchecked or unsafe operations.
[ant:javac] Note: Recompile with -Xlint:unchecked for details.
:tapestry-core:compileGroovy UP-TO-DATE
:tapestry-core:processResources UP-TO-DATE
:tapestry-core:classes
:tapestry-core:jar UP-TO-DATE
:tapestry-hibernate-core:compileJava UP-TO-DATE
:tapestry-hibernate-core:compileGroovy UP-TO-DATE
:tapestry-hibernate-core:processResources UP-TO-DATE
:tapestry-hibernate-core:classes UP-TO-DATE
:tapestry-hibernate-core:jar UP-TO-DATE
:tapestry-javadoc:compileJava UP-TO-DATE
:tapestry-javadoc:compileGroovy UP-TO-DATE
:tapestry-javadoc:processResources UP-TO-DATE
:tapestry-javadoc:classes UP-TO-DATE
:tapestry-javadoc:jar UP-TO-DATE
:aggregateJavadoc<https://builds.apache.org/job/tapestry-trunk-freestyle/ws/trunk/tapestry-ioc/src/main/java/org/apache/tapestry5/ioc/services/ClassFabUtils.java>:28:
warning - Tag @link: reference not found: org.apache.tapestry5.ioc.services.ClassFab
<https://builds.apache.org/job/tapestry-trunk-freestyle/ws/trunk/tapestry-ioc/src/main/java/org/apache/tapestry5/ioc/services/DefaultImplementationBuilder.java>:22:
warning - Tag @see: reference not found: org.apache.tapestry5.ioc.services.ClassFab#addNoOpMethod(MethodSignature)
<https://builds.apache.org/job/tapestry-trunk-freestyle/ws/trunk/tapestry-ioc/src/main/java/org/apache/tapestry5/ioc/services/MethodSignature.java>:38:
warning - Tag @link: reference not found: org.apache.tapestry5.ioc.services.ClassFab
<https://builds.apache.org/job/tapestry-trunk-freestyle/ws/trunk/tapestry-core/src/main/java/org/apache/tapestry5/services/MarkupRendererFilter.java>:29:
warning - Tag @see: can't find contributeMarkupRenderer(org.apache.tapestry5.ioc.OrderedConfiguration,
      org.apache.tapestry5.Asset, boolean, String, boolean, org.apache.tapestry5.ioc.services.SymbolSource,
      AssetSource, org.apache.tapestry5.services.javascript.JavaScriptStackSource,
      org.apache.tapestry5.internal.services.javascript.JavaScriptStackPathConstructor, org.apache.tapestry5.Asset)
in org.apache.tapestry5.services.TapestryModule
<https://builds.apache.org/job/tapestry-trunk-freestyle/ws/trunk/tapestry-core/src/main/java/org/apache/tapestry5/services/PartialMarkupRendererFilter.java>:31:
warning - Tag @see: can't find contributePartialMarkupRenderer(org.apache.tapestry5.ioc.OrderedConfiguration,
      org.apache.tapestry5.Asset, org.apache.tapestry5.services.javascript.JavaScriptStackSource,
      org.apache.tapestry5.internal.services.javascript.JavaScriptStackPathConstructor,
      org.apache.tapestry5.ioc.services.SymbolSource, AssetSource) in org.apache.tapestry5.services.TapestryModule
<https://builds.apache.org/job/tapestry-trunk-freestyle/ws/trunk/tapestry-core/src/main/java/org/apache/tapestry5/services/TapestryModule.java>:1331:
warning - Tag @link: reference not found: InjectionProvider

6 warnings
:plastic:assemble UP-TO-DATE
:plastic:compileTestJava UP-TO-DATE
:plastic:compileTestGroovy UP-TO-DATE
:plastic:processTestResources UP-TO-DATE
:plastic:testClasses UP-TO-DATE
:plastic:test UP-TO-DATE
:plastic:check UP-TO-DATE
:plastic:build UP-TO-DATE
:plastic:sourcesJar UP-TO-DATE
:plastic:uploadPublishedUploading: org/apache/tapestry/plastic/5.4-SNAPSHOT/plastic-5.4-20120124.103123-8.jar
to repository remote at https://repository.apache.org/content/repositories/snapshots
Transferring 478K from remote
Uploaded 478K
Uploading: org/apache/tapestry/plastic/5.4-SNAPSHOT/plastic-5.4-20120124.103123-8-sources.jar
to repository remote at https://repository.apache.org/content/repositories/snapshots
Transferring 722K from remote
Uploaded 722K

:quickstart:compileJava UP-TO-DATE
:quickstart:compileGroovy UP-TO-DATE
:quickstart:processFiltered
:quickstart:processResources UP-TO-DATE
:quickstart:classes UP-TO-DATE
:quickstart:jar UP-TO-DATE
:quickstart:assemble UP-TO-DATE
:quickstart:compileTestJava UP-TO-DATE
:quickstart:compileTestGroovy UP-TO-DATE
:quickstart:processTestResources UP-TO-DATE
:quickstart:testClasses UP-TO-DATE
:quickstart:test UP-TO-DATE
:quickstart:check UP-TO-DATE
:quickstart:build UP-TO-DATE
:quickstart:sourcesJar UP-TO-DATE
:quickstart:uploadPublishedUploading: org/apache/tapestry/quickstart/5.4-SNAPSHOT/quickstart-5.4-20120124.103129-8.jar
to repository remote at https://repository.apache.org/content/repositories/snapshots
Transferring 63K from remote
Uploaded 63K
Uploading: org/apache/tapestry/quickstart/5.4-SNAPSHOT/quickstart-5.4-20120124.103129-8-sources.jar
to repository remote at https://repository.apache.org/content/repositories/snapshots
Transferring 51K from remote
Uploaded 51K

:tapestry-beanvalidator:compileJava UP-TO-DATE
:tapestry-beanvalidator:compileGroovy UP-TO-DATE
:tapestry-beanvalidator:processResources UP-TO-DATE
:tapestry-beanvalidator:classes UP-TO-DATE
:tapestry-beanvalidator:jar UP-TO-DATE
:tapestry-beanvalidator:assemble UP-TO-DATE
:tapestry-beanvalidator:compileTestJava UP-TO-DATE
:tapestry-beanvalidator:compileTestGroovy UP-TO-DATE
:tapestry-beanvalidator:processTestResources UP-TO-DATE
:tapestry-beanvalidator:testClasses UP-TO-DATE
:tapestry-beanvalidator:testTest org.apache.tapestry5.beanvalidator.integration.TapestryBeanValidationIntegrationTests
FAILED
7 tests completed, 1 failure


FAILURE: Build failed with an exception.

* What went wrong:
Execution failed for task ':tapestry-beanvalidator:test'.
Cause: There were failing tests. See the report at <https://builds.apache.org/job/tapestry-trunk-freestyle/ws/trunk/tapestry-beanvalidator/build/reports/tests.>

* Try:
Run with --stacktrace option to get the stack trace. Run with --info or --debug option to
get more log output.

BUILD FAILED

Total time: 1 mins 11.979 secs
Build step 'Execute shell' marked build as failure
Updating TAP5-1826
Publishing Javadoc


---------------------------------------------------------------------
To unsubscribe, e-mail: dev-unsubscribe@tapestry.apache.org
For additional commands, e-mail: dev-help@tapestry.apache.org


Mime
View raw message