tapestry-dev mailing list archives

Site index · List index
Message view « Date » · « Thread »
Top « Date » · « Thread »
From Apache Jenkins Server <jenk...@builds.apache.org>
Subject Build failed in Jenkins: tapestry-trunk-freestyle #970
Date Fri, 26 Oct 2012 09:51:04 GMT
See <https://builds.apache.org/job/tapestry-trunk-freestyle/970/changes>

Changes:

[uli] org.apache.tapestry5.ioc.test.IOCTestCase makes use of TestBase from the

[uli] tapestry-ioc needed in order to compile.

[uli] restore java 1.5 compatibility

------------------------------------------
Started by user uli
Building remotely on tapestry in workspace <https://builds.apache.org/job/tapestry-trunk-freestyle/ws/>
Checkout:tapestry-trunk-freestyle / <https://builds.apache.org/job/tapestry-trunk-freestyle/ws/>
- hudson.remoting.Channel@79e759ac:tapestry
Using strategy: Default
Last Built Revision: Revision afc57527452e12b4a3b6f843d2fb38db549ecde8 (origin/master)
Cloning the remote Git repository
Cloning repository https://git-wip-us.apache.org/repos/asf/tapestry-5.git
git --version
git version 1.7.0.4
Fetching upstream changes from https://git-wip-us.apache.org/repos/asf/tapestry-5.git
Commencing build of Revision 209efb82723603d9a78d209d6c3edeb901987b3b (origin/master)
Checking out Revision 209efb82723603d9a78d209d6c3edeb901987b3b (origin/master)
[tapestry-trunk-freestyle] $ /bin/bash -xe /tmp/hudson3505096529514079150.sh
+ Xvfb :6 -ac -screen 0 1024x768x8
[dix] Could not init font path element /var/lib/defoma/x-ttcidfont-conf.d/dirs/TrueType, removing
from list!
Process leaked file descriptors. See http://wiki.jenkins-ci.org/display/JENKINS/Spawning+processes+from+build
for more information
[tapestry-trunk-freestyle] $ /bin/bash -xe /tmp/hudson6413509288672265464.sh
+ DISPLAY=:6.0
+ bash <https://builds.apache.org/job/tapestry-trunk-freestyle/ws/gradlew> -Dproject-version=5.4-SNAPSHOT
-Dfile.encoding=UTF-8 -b <https://builds.apache.org/job/tapestry-trunk-freestyle/ws/build.gradle>
continuousIntegration
Dynamic properties are deprecated: http://gradle.org/docs/current/dsl/org.gradle.api.plugins.ExtraPropertiesExtension.html
Deprecated dynamic property: "jdkName" on "org.gradle.plugins.ide.idea.model.IdeaModel_Decorated@7448bc3d",
value: "1.5".
Deprecated dynamic property "jdkName" created in multiple locations.
:plastic:compileJavaNote: Some input files use unchecked or unsafe operations.
Note: Recompile with -Xlint:unchecked for details.

:plastic:compileGroovy UP-TO-DATE
:plastic:processResources UP-TO-DATE
:plastic:classes
:plastic:jar
:tapestry-core:generateGrammarSource
:tapestry-func:compileJava
:tapestry-func:compileGroovy UP-TO-DATE
:tapestry-func:processResources UP-TO-DATE
:tapestry-func:classes
:tapestry-func:jar
:tapestry-test:compileJava
:tapestry-test:compileGroovy UP-TO-DATE
:tapestry-test:processResources
:tapestry-test:classes
:tapestry-test:jar
:tapestry5-annotations:compileJava
:tapestry5-annotations:compileGroovy UP-TO-DATE
:tapestry5-annotations:processResources UP-TO-DATE
:tapestry5-annotations:classes
:tapestry5-annotations:jar
:tapestry-ioc:compileJavaNote: Some input files use or override a deprecated API.
Note: Recompile with -Xlint:deprecation for details.
Note: Some input files use unchecked or unsafe operations.
Note: Recompile with -Xlint:unchecked for details.

:tapestry-ioc:compileGroovy UP-TO-DATE
:tapestry-ioc:processResources
:tapestry-ioc:classes
:tapestry-ioc:jar
:tapestry-json:compileJava
:tapestry-json:compileGroovy UP-TO-DATE
:tapestry-json:processResources UP-TO-DATE
:tapestry-json:classes
:tapestry-json:jar
:tapestry-core:compileJavaNote: Some input files use or override a deprecated API.
Note: Recompile with -Xlint:deprecation for details.
Note: Some input files use unchecked or unsafe operations.
Note: Recompile with -Xlint:unchecked for details.

:tapestry-core:compileGroovy UP-TO-DATE
:tapestry-core:processResources
:tapestry-core:classes
:tapestry-core:jar
:tapestry-hibernate-core:compileJavaNote: Some input files use or override a deprecated API.
Note: Recompile with -Xlint:deprecation for details.

:tapestry-hibernate-core:compileGroovy UP-TO-DATE
:tapestry-hibernate-core:processResources
:tapestry-hibernate-core:classes
:tapestry-hibernate-core:jar
:tapestry-javadoc:compileJava
:tapestry-javadoc:compileGroovy UP-TO-DATE
:tapestry-javadoc:processResources UP-TO-DATE
:tapestry-javadoc:classes
:tapestry-javadoc:jar
:aggregateJavadoc
:plastic:assemble
:plastic:compileTestJava
:plastic:compileTestGroovy
:plastic:processTestResources UP-TO-DATE
:plastic:testClasses
:plastic:testTest org.apache.tapestry5.internal.plastic.PlasticUtilsTests FAILED
128 tests completed, 1 failure


FAILURE: Build failed with an exception.

* What went wrong:
Execution failed for task ':plastic:test'.
> There were failing tests. See the report at <https://builds.apache.org/job/tapestry-trunk-freestyle/ws/plastic/build/reports/tests.>

* Try:
Run with --stacktrace option to get the stack trace. Run with --info or --debug option to
get more log output.

BUILD FAILED

Total time: 2 mins 20.784 secs
Build step 'Execute shell' marked build as failure

---------------------------------------------------------------------
To unsubscribe, e-mail: dev-unsubscribe@tapestry.apache.org
For additional commands, e-mail: dev-help@tapestry.apache.org


Mime
View raw message