tapestry-dev mailing list archives

Site index · List index
Message view « Date » · « Thread »
Top « Date » · « Thread »
From Apache Jenkins Server <jenk...@builds.apache.org>
Subject Build failed in Jenkins: tapestry-trunk-freestyle #968
Date Sun, 21 Oct 2012 23:55:12 GMT
See <https://builds.apache.org/job/tapestry-trunk-freestyle/968/>

------------------------------------------
Started by user bobharner
Building remotely on tapestry in workspace <https://builds.apache.org/job/tapestry-trunk-freestyle/ws/>
Checkout:tapestry-trunk-freestyle / <https://builds.apache.org/job/tapestry-trunk-freestyle/ws/>
- hudson.remoting.Channel@332f6634:tapestry
Using strategy: Default
Last Built Revision: Revision afc57527452e12b4a3b6f843d2fb38db549ecde8 (origin/master)
Fetching changes from 1 remote Git repository
Fetching upstream changes from https://git-wip-us.apache.org/repos/asf/tapestry-5.git
Commencing build of Revision afc57527452e12b4a3b6f843d2fb38db549ecde8 (origin/master)
Checking out Revision afc57527452e12b4a3b6f843d2fb38db549ecde8 (origin/master)
[tapestry-trunk-freestyle] $ /bin/bash -xe /tmp/hudson508264171823914289.sh
+ Xvfb :6 -ac -screen 0 1024x768x8
[dix] Could not init font path element /var/lib/defoma/x-ttcidfont-conf.d/dirs/TrueType, removing
from list!
Process leaked file descriptors. See http://wiki.jenkins-ci.org/display/JENKINS/Spawning+processes+from+build
for more information
[tapestry-trunk-freestyle] $ /bin/bash -xe /tmp/hudson2518828922869905566.sh
+ DISPLAY=:6.0
+ bash <https://builds.apache.org/job/tapestry-trunk-freestyle/ws/gradlew> -Dfile.encoding=UTF-8
-b <https://builds.apache.org/job/tapestry-trunk-freestyle/ws/build.gradle> continuousIntegration
Dynamic properties are deprecated: http://gradle.org/docs/current/dsl/org.gradle.api.plugins.ExtraPropertiesExtension.html
Deprecated dynamic property: "jdkName" on "org.gradle.plugins.ide.idea.model.IdeaModel_Decorated@7c7ba849",
value: "1.6".
Deprecated dynamic property "jdkName" created in multiple locations.
:plastic:compileJava UP-TO-DATE
:plastic:compileGroovy UP-TO-DATE
:plastic:processResources UP-TO-DATE
:plastic:classes UP-TO-DATE
:plastic:jar UP-TO-DATE
:tapestry-core:generateGrammarSource UP-TO-DATE
:tapestry-func:compileJava UP-TO-DATE
:tapestry-func:compileGroovy UP-TO-DATE
:tapestry-func:processResources UP-TO-DATE
:tapestry-func:classes UP-TO-DATE
:tapestry-func:jar UP-TO-DATE
:tapestry-test:compileJava UP-TO-DATE
:tapestry-test:compileGroovy UP-TO-DATE
:tapestry-test:processResources UP-TO-DATE
:tapestry-test:classes UP-TO-DATE
:tapestry-test:jar UP-TO-DATE
:tapestry5-annotations:compileJava UP-TO-DATE
:tapestry5-annotations:compileGroovy UP-TO-DATE
:tapestry5-annotations:processResources UP-TO-DATE
:tapestry5-annotations:classes UP-TO-DATE
:tapestry5-annotations:jar UP-TO-DATE
:tapestry-ioc:compileJava UP-TO-DATE
:tapestry-ioc:compileGroovy UP-TO-DATE
:tapestry-ioc:processResources UP-TO-DATE
:tapestry-ioc:classes UP-TO-DATE
:tapestry-ioc:jar UP-TO-DATE
:tapestry-json:compileJava UP-TO-DATE
:tapestry-json:compileGroovy UP-TO-DATE
:tapestry-json:processResources UP-TO-DATE
:tapestry-json:classes UP-TO-DATE
:tapestry-json:jar UP-TO-DATE
:tapestry-core:compileJava UP-TO-DATE
:tapestry-core:compileGroovy UP-TO-DATE
:tapestry-core:processResources UP-TO-DATE
:tapestry-core:classes UP-TO-DATE
:tapestry-core:jar UP-TO-DATE
:tapestry-hibernate-core:compileJava UP-TO-DATE
:tapestry-hibernate-core:compileGroovy UP-TO-DATE
:tapestry-hibernate-core:processResources UP-TO-DATE
:tapestry-hibernate-core:classes UP-TO-DATE
:tapestry-hibernate-core:jar UP-TO-DATE
:tapestry-javadoc:compileJava UP-TO-DATE
:tapestry-javadoc:compileGroovy UP-TO-DATE
:tapestry-javadoc:processResources UP-TO-DATE
:tapestry-javadoc:classes UP-TO-DATE
:tapestry-javadoc:jar UP-TO-DATE
:aggregateJavadoc UP-TO-DATE
:plastic:assemble UP-TO-DATE
:plastic:compileTestJava UP-TO-DATE
:plastic:compileTestGroovy UP-TO-DATE
:plastic:processTestResources UP-TO-DATE
:plastic:testClasses UP-TO-DATE
:plastic:testTest org.apache.tapestry5.internal.plastic.PlasticUtilsTests FAILED
128 tests completed, 1 failure


FAILURE: Build failed with an exception.

* What went wrong:
Execution failed for task ':plastic:test'.
> There were failing tests. See the report at <https://builds.apache.org/job/tapestry-trunk-freestyle/ws/plastic/build/reports/tests.>

* Try:
Run with --stacktrace option to get the stack trace. Run with --info or --debug option to
get more log output.

BUILD FAILED

Total time: 29.249 secs
Build step 'Execute shell' marked build as failure

---------------------------------------------------------------------
To unsubscribe, e-mail: dev-unsubscribe@tapestry.apache.org
For additional commands, e-mail: dev-help@tapestry.apache.org


Mime
View raw message