tapestry-dev mailing list archives

Site index · List index
Message view « Date » · « Thread »
Top « Date » · « Thread »
From Apache Jenkins Server <jenk...@builds.apache.org>
Subject Build failed in Jenkins: tapestry-trunk-freestyle #1174
Date Fri, 01 Nov 2013 20:32:53 GMT
See <https://builds.apache.org/job/tapestry-trunk-freestyle/1174/changes>

Changes:

[thiagohp] Changes Element.attribute() so it returns null in both jQuery and

[thiagohp] TAP5-2158: Client-side validation of @Size is not working when only min

------------------------------------------
[...truncated 20 lines...]
:buildSrc:jar UP-TO-DATE
:buildSrc:assemble UP-TO-DATE
:buildSrc:compileTestJava UP-TO-DATE
:buildSrc:compileTestGroovy UP-TO-DATE
:buildSrc:processTestResources UP-TO-DATE
:buildSrc:testClasses UP-TO-DATE
:buildSrc:test UP-TO-DATE
:buildSrc:check UP-TO-DATE
:buildSrc:build UP-TO-DATE
Creating properties on demand (a.k.a. dynamic properties) has been deprecated and is scheduled
to be removed in Gradle 2.0. Please read http://gradle.org/docs/current/dsl/org.gradle.api.plugins.ExtraPropertiesExtension.html
for information on the replacement for dynamic properties.
Deprecated dynamic property: "languageLevel" on "org.gradle.plugins.ide.idea.model.IdeaModel_Decorated@5f787338",
value: "1.5".
Deprecated dynamic property: "jdkName" on "org.gradle.plugins.ide.idea.model.IdeaModel_Decorated@5f787338",
value: "1.7".
Deprecated dynamic property "languageLevel" created in multiple locations.
Deprecated dynamic property "jdkName" created in multiple locations.
sources=file collection
:plastic:compileJava UP-TO-DATE
:plastic:compileGroovy UP-TO-DATE
:plastic:processResources UP-TO-DATE
:plastic:classes UP-TO-DATE
:plastic:jar UP-TO-DATE
:tapestry-core:compileCoffeeScript UP-TO-DATE
:tapestry-core:generateGrammarSource UP-TO-DATE
:tapestry-func:compileJava UP-TO-DATE
:tapestry-func:compileGroovy UP-TO-DATE
:tapestry-func:processResources UP-TO-DATE
:tapestry-func:classes UP-TO-DATE
:tapestry-func:jar UP-TO-DATE
:tapestry-runner:compileJava UP-TO-DATE
:tapestry-runner:compileGroovy UP-TO-DATE
:tapestry-runner:processResources UP-TO-DATE
:tapestry-runner:classes UP-TO-DATE
:tapestry-runner:jar UP-TO-DATE
:tapestry-test-data:compileJava UP-TO-DATE
:tapestry-test-data:compileGroovy UP-TO-DATE
:tapestry-test-data:processResources UP-TO-DATE
:tapestry-test-data:classes UP-TO-DATE
:tapestry-test-data:jar UP-TO-DATE
:tapestry-test:compileJava UP-TO-DATE
:tapestry-test:compileGroovy UP-TO-DATE
:tapestry-test:processResources UP-TO-DATE
:tapestry-test:classes UP-TO-DATE
:tapestry-test:jar UP-TO-DATE
:tapestry5-annotations:compileJava UP-TO-DATE
:tapestry5-annotations:compileGroovy UP-TO-DATE
:tapestry5-annotations:processResources UP-TO-DATE
:tapestry5-annotations:classes UP-TO-DATE
:tapestry5-annotations:jar UP-TO-DATE
:tapestry-ioc:compileJava UP-TO-DATE
:tapestry-ioc:compileGroovy UP-TO-DATE
:tapestry-ioc:processResources UP-TO-DATE
:tapestry-ioc:classes UP-TO-DATE
:tapestry-ioc:jar UP-TO-DATE
:tapestry-json:compileJava UP-TO-DATE
:tapestry-json:compileGroovy UP-TO-DATE
:tapestry-json:processResources UP-TO-DATE
:tapestry-json:classes UP-TO-DATE
:tapestry-json:jar UP-TO-DATE
:tapestry-core:compileJava UP-TO-DATE
:tapestry-core:compileGroovy UP-TO-DATE
:tapestry-core:preprocessCoffeeScript
:tapestry-core:compileProcessedCoffeescript
:tapestry-core:processResources UP-TO-DATE
:tapestry-core:classes
:tapestry-core:jar
:tapestry-hibernate-core:compileJava UP-TO-DATE
:tapestry-hibernate-core:compileGroovy UP-TO-DATE
:tapestry-hibernate-core:processResources UP-TO-DATE
:tapestry-hibernate-core:classes UP-TO-DATE
:tapestry-hibernate-core:jar UP-TO-DATE
:tapestry-javadoc:compileJava
:tapestry-javadoc:compileGroovy UP-TO-DATE
:tapestry-javadoc:processResources UP-TO-DATE
:tapestry-javadoc:classes
:tapestry-javadoc:jar UP-TO-DATE
:aggregateJavadoc<https://builds.apache.org/job/tapestry-trunk-freestyle/ws/tapestry-core/src/main/java/org/apache/tapestry5/services/ValueLabelProvider.java>:31:
warning - @return tag has no arguments.
<https://builds.apache.org/job/tapestry-trunk-freestyle/ws/tapestry-core/src/main/java/org/apache/tapestry5/internal/services/UnknownActivationContextHandler.java>:33:
warning - Tag @see:illegal character: "58" in "http://issues.apache.org/jira/browse/TAP5-2070"
<https://builds.apache.org/job/tapestry-trunk-freestyle/ws/tapestry-core/src/main/java/org/apache/tapestry5/internal/services/UnknownActivationContextHandler.java>:33:
warning - Tag @see:illegal character: "47" in "http://issues.apache.org/jira/browse/TAP5-2070"
<https://builds.apache.org/job/tapestry-trunk-freestyle/ws/tapestry-core/src/main/java/org/apache/tapestry5/internal/services/UnknownActivationContextHandler.java>:33:
warning - Tag @see:illegal character: "47" in "http://issues.apache.org/jira/browse/TAP5-2070"
<https://builds.apache.org/job/tapestry-trunk-freestyle/ws/tapestry-core/src/main/java/org/apache/tapestry5/internal/services/UnknownActivationContextHandler.java>:33:
warning - Tag @see:illegal character: "47" in "http://issues.apache.org/jira/browse/TAP5-2070"
<https://builds.apache.org/job/tapestry-trunk-freestyle/ws/tapestry-core/src/main/java/org/apache/tapestry5/internal/services/UnknownActivationContextHandler.java>:33:
warning - Tag @see:illegal character: "47" in "http://issues.apache.org/jira/browse/TAP5-2070"
<https://builds.apache.org/job/tapestry-trunk-freestyle/ws/tapestry-core/src/main/java/org/apache/tapestry5/internal/services/UnknownActivationContextHandler.java>:33:
warning - Tag @see:illegal character: "47" in "http://issues.apache.org/jira/browse/TAP5-2070"
<https://builds.apache.org/job/tapestry-trunk-freestyle/ws/tapestry-core/src/main/java/org/apache/tapestry5/internal/services/UnknownActivationContextHandler.java>:33:
warning - Tag @see:illegal character: "45" in "http://issues.apache.org/jira/browse/TAP5-2070"
<https://builds.apache.org/job/tapestry-trunk-freestyle/ws/tapestry-core/src/main/java/org/apache/tapestry5/internal/services/UnknownActivationContextHandler.java>:33:
warning - Tag @see: reference not found: http://issues.apache.org/jira/browse/TAP5-2070
<https://builds.apache.org/job/tapestry-trunk-freestyle/ws/tapestry-core/src/main/java/org/apache/tapestry5/services/assets/AssetPathConstructor.java>:64:
warning - Tag @link: reference not found: 
<https://builds.apache.org/job/tapestry-trunk-freestyle/ws/tapestry-core/src/main/java/org/apache/tapestry5/services/LibraryMapping.java>:79:
warning - Tag @link: can't find getLibraryName() in org.apache.tapestry5.services.LibraryMapping
<https://builds.apache.org/job/tapestry-trunk-freestyle/ws/tapestry-core/src/main/java/org/apache/tapestry5/model/ComponentModel.java>:224:
warning - Tag @see:illegal character: "123" in "{@link MutableComponentModel.doHandleActivationEventContext()}"
<https://builds.apache.org/job/tapestry-trunk-freestyle/ws/tapestry-core/src/main/java/org/apache/tapestry5/model/ComponentModel.java>:224:
warning - Tag @see:illegal character: "64" in "{@link MutableComponentModel.doHandleActivationEventContext()}"
<https://builds.apache.org/job/tapestry-trunk-freestyle/ws/tapestry-core/src/main/java/org/apache/tapestry5/model/ComponentModel.java>:224:
warning - Tag @link: reference not found: org.apache.tapestry5.EventConstants.ACTIVATE
<https://builds.apache.org/job/tapestry-trunk-freestyle/ws/tapestry-core/src/main/java/org/apache/tapestry5/model/ComponentModel.java>:224:
warning - Tag @link: reference not found: org.apache.tapestry5.EventConstants.ACTIVATE
<https://builds.apache.org/job/tapestry-trunk-freestyle/ws/tapestry-core/src/main/java/org/apache/tapestry5/model/ComponentModel.java>:224:
warning - Tag @see: reference not found: {@link MutableComponentModel.doHandleActivationEventContext()}
<https://builds.apache.org/job/tapestry-trunk-freestyle/ws/tapestry-core/src/main/java/org/apache/tapestry5/model/MutableComponentModel.java>:135:
warning - Tag @link: reference not found: org.apache.tapestry5.EventConstants.ACTIVATE
<https://builds.apache.org/job/tapestry-trunk-freestyle/ws/tapestry-core/src/main/java/org/apache/tapestry5/model/MutableComponentModel.java>:135:
warning - Tag @link: reference not found: org.apache.tapestry5.EventConstants.ACTIVATE
<https://builds.apache.org/job/tapestry-trunk-freestyle/ws/tapestry-core/src/main/java/org/apache/tapestry5/services/assets/AssetPathConstructor.java>:64:
warning - Tag @link: reference not found: 
<https://builds.apache.org/job/tapestry-trunk-freestyle/ws/tapestry-core/src/main/java/org/apache/tapestry5/model/MutableComponentModel.java>:135:
warning - Tag @link: reference not found: org.apache.tapestry5.EventConstants.ACTIVATE
<https://builds.apache.org/job/tapestry-trunk-freestyle/ws/tapestry-core/src/main/java/org/apache/tapestry5/model/ComponentModel.java>:224:
warning - Tag @link: reference not found: org.apache.tapestry5.EventConstants.ACTIVATE
<https://builds.apache.org/job/tapestry-trunk-freestyle/ws/tapestry-core/src/main/java/org/apache/tapestry5/model/MutableComponentModel.java>:135:
warning - Tag @link: reference not found: org.apache.tapestry5.EventConstants.ACTIVATE
<https://builds.apache.org/job/tapestry-trunk-freestyle/ws/tapestry-core/src/main/java/org/apache/tapestry5/model/ComponentModel.java>:224:
warning - Tag @link: reference not found: org.apache.tapestry5.EventConstants.ACTIVATE
<https://builds.apache.org/job/tapestry-trunk-freestyle/ws/tapestry-core/src/main/java/org/apache/tapestry5/model/ComponentModel.java>:224:
warning - Tag @link: missing '#': "MutableComponentModel.doHandleActivationEventContext()"
<https://builds.apache.org/job/tapestry-trunk-freestyle/ws/tapestry-core/src/main/java/org/apache/tapestry5/model/ComponentModel.java>:224:
warning - Tag @link: can't find MutableComponentModel.doHandleActivationEventContext() in
org.apache.tapestry5.model.ComponentModel
<https://builds.apache.org/job/tapestry-trunk-freestyle/ws/tapestry-core/src/main/java/org/apache/tapestry5/model/ComponentModel.java>:224:
warning - Tag @see: reference not found: {@link MutableComponentModel.doHandleActivationEventContext()}
<https://builds.apache.org/job/tapestry-trunk-freestyle/ws/tapestry-webresources/src/main/java/org/apache/tapestry5/internal/webresources/ResourceTransformerFactory.java>:25:
warning - Tag @link: reference not found: org.apache.tapestry5.webresources.services.ResourceProcessor
<https://builds.apache.org/job/tapestry-trunk-freestyle/ws/tapestry-webresources/src/main/java/org/apache/tapestry5/internal/webresources/ResourceTransformerFactory.java>:43:
warning - Tag @see: reference not found: org.apache.tapestry5.webresources.services.ResourceProcessorSource
<https://builds.apache.org/job/tapestry-trunk-freestyle/ws/tapestry-webresources/src/main/java/org/apache/tapestry5/internal/webresources/ResourceTransformerFactory.java>:43:
warning - Tag @see: reference not found: org.apache.tapestry5.webresources.services.ResourceProcessorSource
<https://builds.apache.org/job/tapestry-trunk-freestyle/ws/tapestry-core/src/main/java/org/apache/tapestry5/SymbolConstants.java>:481:
warning - Tag @see:illegal character: "58" in "https://issues.apache.org/jira/browse/TAP5-2182"
<https://builds.apache.org/job/tapestry-trunk-freestyle/ws/tapestry-core/src/main/java/org/apache/tapestry5/SymbolConstants.java>:481:
warning - Tag @see:illegal character: "47" in "https://issues.apache.org/jira/browse/TAP5-2182"
<https://builds.apache.org/job/tapestry-trunk-freestyle/ws/tapestry-core/src/main/java/org/apache/tapestry5/SymbolConstants.java>:481:
warning - Tag @see:illegal character: "47" in "https://issues.apache.org/jira/browse/TAP5-2182"
<https://builds.apache.org/job/tapestry-trunk-freestyle/ws/tapestry-core/src/main/java/org/apache/tapestry5/SymbolConstants.java>:481:
warning - Tag @see:illegal character: "47" in "https://issues.apache.org/jira/browse/TAP5-2182"
<https://builds.apache.org/job/tapestry-trunk-freestyle/ws/tapestry-core/src/main/java/org/apache/tapestry5/SymbolConstants.java>:481:
warning - Tag @see:illegal character: "47" in "https://issues.apache.org/jira/browse/TAP5-2182"
<https://builds.apache.org/job/tapestry-trunk-freestyle/ws/tapestry-core/src/main/java/org/apache/tapestry5/SymbolConstants.java>:481:
warning - Tag @see:illegal character: "47" in "https://issues.apache.org/jira/browse/TAP5-2182"
<https://builds.apache.org/job/tapestry-trunk-freestyle/ws/tapestry-core/src/main/java/org/apache/tapestry5/SymbolConstants.java>:481:
warning - Tag @see:illegal character: "45" in "https://issues.apache.org/jira/browse/TAP5-2182"
<https://builds.apache.org/job/tapestry-trunk-freestyle/ws/tapestry-core/src/main/java/org/apache/tapestry5/SymbolConstants.java>:461:
warning - Tag @see:illegal character: "58" in "https://issues.apache.org/jira/browse/TAP5-2182"
<https://builds.apache.org/job/tapestry-trunk-freestyle/ws/tapestry-core/src/main/java/org/apache/tapestry5/SymbolConstants.java>:461:
warning - Tag @see:illegal character: "47" in "https://issues.apache.org/jira/browse/TAP5-2182"
<https://builds.apache.org/job/tapestry-trunk-freestyle/ws/tapestry-core/src/main/java/org/apache/tapestry5/SymbolConstants.java>:461:
warning - Tag @see:illegal character: "47" in "https://issues.apache.org/jira/browse/TAP5-2182"
<https://builds.apache.org/job/tapestry-trunk-freestyle/ws/tapestry-core/src/main/java/org/apache/tapestry5/SymbolConstants.java>:461:
warning - Tag @see:illegal character: "47" in "https://issues.apache.org/jira/browse/TAP5-2182"
<https://builds.apache.org/job/tapestry-trunk-freestyle/ws/tapestry-core/src/main/java/org/apache/tapestry5/SymbolConstants.java>:461:
warning - Tag @see:illegal character: "47" in "https://issues.apache.org/jira/browse/TAP5-2182"
<https://builds.apache.org/job/tapestry-trunk-freestyle/ws/tapestry-core/src/main/java/org/apache/tapestry5/SymbolConstants.java>:461:
warning - Tag @see:illegal character: "47" in "https://issues.apache.org/jira/browse/TAP5-2182"
<https://builds.apache.org/job/tapestry-trunk-freestyle/ws/tapestry-core/src/main/java/org/apache/tapestry5/SymbolConstants.java>:461:
warning - Tag @see:illegal character: "45" in "https://issues.apache.org/jira/browse/TAP5-2182"
<https://builds.apache.org/job/tapestry-trunk-freestyle/ws/tapestry-core/src/main/java/org/apache/tapestry5/SymbolConstants.java>:450:
warning - Tag @see:illegal character: "58" in "https://issues.apache.org/jira/browse/TAP5-2182"
<https://builds.apache.org/job/tapestry-trunk-freestyle/ws/tapestry-core/src/main/java/org/apache/tapestry5/SymbolConstants.java>:450:
warning - Tag @see:illegal character: "47" in "https://issues.apache.org/jira/browse/TAP5-2182"
<https://builds.apache.org/job/tapestry-trunk-freestyle/ws/tapestry-core/src/main/java/org/apache/tapestry5/SymbolConstants.java>:450:
warning - Tag @see:illegal character: "47" in "https://issues.apache.org/jira/browse/TAP5-2182"
<https://builds.apache.org/job/tapestry-trunk-freestyle/ws/tapestry-core/src/main/java/org/apache/tapestry5/SymbolConstants.java>:450:
warning - Tag @see:illegal character: "47" in "https://issues.apache.org/jira/browse/TAP5-2182"
<https://builds.apache.org/job/tapestry-trunk-freestyle/ws/tapestry-core/src/main/java/org/apache/tapestry5/SymbolConstants.java>:450:
warning - Tag @see:illegal character: "47" in "https://issues.apache.org/jira/browse/TAP5-2182"
<https://builds.apache.org/job/tapestry-trunk-freestyle/ws/tapestry-core/src/main/java/org/apache/tapestry5/SymbolConstants.java>:450:
warning - Tag @see:illegal character: "47" in "https://issues.apache.org/jira/browse/TAP5-2182"
<https://builds.apache.org/job/tapestry-trunk-freestyle/ws/tapestry-core/src/main/java/org/apache/tapestry5/SymbolConstants.java>:450:
warning - Tag @see:illegal character: "45" in "https://issues.apache.org/jira/browse/TAP5-2182"
<https://builds.apache.org/job/tapestry-trunk-freestyle/ws/tapestry-core/src/main/java/org/apache/tapestry5/SymbolConstants.java>:472:
warning - Tag @see:illegal character: "58" in "https://issues.apache.org/jira/browse/TAP5-2182"
<https://builds.apache.org/job/tapestry-trunk-freestyle/ws/tapestry-core/src/main/java/org/apache/tapestry5/SymbolConstants.java>:472:
warning - Tag @see:illegal character: "47" in "https://issues.apache.org/jira/browse/TAP5-2182"
<https://builds.apache.org/job/tapestry-trunk-freestyle/ws/tapestry-core/src/main/java/org/apache/tapestry5/SymbolConstants.java>:472:
warning - Tag @see:illegal character: "47" in "https://issues.apache.org/jira/browse/TAP5-2182"
<https://builds.apache.org/job/tapestry-trunk-freestyle/ws/tapestry-core/src/main/java/org/apache/tapestry5/SymbolConstants.java>:472:
warning - Tag @see:illegal character: "47" in "https://issues.apache.org/jira/browse/TAP5-2182"
<https://builds.apache.org/job/tapestry-trunk-freestyle/ws/tapestry-core/src/main/java/org/apache/tapestry5/SymbolConstants.java>:472:
warning - Tag @see:illegal character: "47" in "https://issues.apache.org/jira/browse/TAP5-2182"
<https://builds.apache.org/job/tapestry-trunk-freestyle/ws/tapestry-core/src/main/java/org/apache/tapestry5/SymbolConstants.java>:472:
warning - Tag @see:illegal character: "47" in "https://issues.apache.org/jira/browse/TAP5-2182"
<https://builds.apache.org/job/tapestry-trunk-freestyle/ws/tapestry-core/src/main/java/org/apache/tapestry5/SymbolConstants.java>:472:
warning - Tag @see:illegal character: "45" in "https://issues.apache.org/jira/browse/TAP5-2182"
<https://builds.apache.org/job/tapestry-trunk-freestyle/ws/tapestry-core/src/main/java/org/apache/tapestry5/SymbolConstants.java>:438:
warning - Tag @see:illegal character: "58" in "https://issues.apache.org/jira/browse/TAP5-2182"
<https://builds.apache.org/job/tapestry-trunk-freestyle/ws/tapestry-core/src/main/java/org/apache/tapestry5/SymbolConstants.java>:438:
warning - Tag @see:illegal character: "47" in "https://issues.apache.org/jira/browse/TAP5-2182"
<https://builds.apache.org/job/tapestry-trunk-freestyle/ws/tapestry-core/src/main/java/org/apache/tapestry5/SymbolConstants.java>:438:
warning - Tag @see:illegal character: "47" in "https://issues.apache.org/jira/browse/TAP5-2182"
<https://builds.apache.org/job/tapestry-trunk-freestyle/ws/tapestry-core/src/main/java/org/apache/tapestry5/SymbolConstants.java>:438:
warning - Tag @see:illegal character: "47" in "https://issues.apache.org/jira/browse/TAP5-2182"
<https://builds.apache.org/job/tapestry-trunk-freestyle/ws/tapestry-core/src/main/java/org/apache/tapestry5/SymbolConstants.java>:438:
warning - Tag @see:illegal character: "47" in "https://issues.apache.org/jira/browse/TAP5-2182"
<https://builds.apache.org/job/tapestry-trunk-freestyle/ws/tapestry-core/src/main/java/org/apache/tapestry5/SymbolConstants.java>:438:
warning - Tag @see:illegal character: "47" in "https://issues.apache.org/jira/browse/TAP5-2182"
<https://builds.apache.org/job/tapestry-trunk-freestyle/ws/tapestry-core/src/main/java/org/apache/tapestry5/SymbolConstants.java>:438:
warning - Tag @see:illegal character: "45" in "https://issues.apache.org/jira/browse/TAP5-2182"
<https://builds.apache.org/job/tapestry-trunk-freestyle/ws/tapestry-core/src/main/java/org/apache/tapestry5/SymbolConstants.java>:427:
warning - Tag @see:illegal character: "58" in "https://issues.apache.org/jira/browse/TAP5-2169"
<https://builds.apache.org/job/tapestry-trunk-freestyle/ws/tapestry-core/src/main/java/org/apache/tapestry5/SymbolConstants.java>:427:
warning - Tag @see:illegal character: "47" in "https://issues.apache.org/jira/browse/TAP5-2169"
<https://builds.apache.org/job/tapestry-trunk-freestyle/ws/tapestry-core/src/main/java/org/apache/tapestry5/SymbolConstants.java>:427:
warning - Tag @see:illegal character: "47" in "https://issues.apache.org/jira/browse/TAP5-2169"
<https://builds.apache.org/job/tapestry-trunk-freestyle/ws/tapestry-core/src/main/java/org/apache/tapestry5/SymbolConstants.java>:427:
warning - Tag @see:illegal character: "47" in "https://issues.apache.org/jira/browse/TAP5-2169"
<https://builds.apache.org/job/tapestry-trunk-freestyle/ws/tapestry-core/src/main/java/org/apache/tapestry5/SymbolConstants.java>:427:
warning - Tag @see:illegal character: "47" in "https://issues.apache.org/jira/browse/TAP5-2169"
<https://builds.apache.org/job/tapestry-trunk-freestyle/ws/tapestry-core/src/main/java/org/apache/tapestry5/SymbolConstants.java>:427:
warning - Tag @see:illegal character: "47" in "https://issues.apache.org/jira/browse/TAP5-2169"
<https://builds.apache.org/job/tapestry-trunk-freestyle/ws/tapestry-core/src/main/java/org/apache/tapestry5/SymbolConstants.java>:427:
warning - Tag @see:illegal character: "45" in "https://issues.apache.org/jira/browse/TAP5-2169"
<https://builds.apache.org/job/tapestry-trunk-freestyle/ws/tapestry-core/src/main/java/org/apache/tapestry5/SymbolConstants.java>:427:
warning - Tag @see: reference not found: https://issues.apache.org/jira/browse/TAP5-2169
<https://builds.apache.org/job/tapestry-trunk-freestyle/ws/tapestry-core/src/main/java/org/apache/tapestry5/SymbolConstants.java>:438:
warning - Tag @see: reference not found: https://issues.apache.org/jira/browse/TAP5-2182
<https://builds.apache.org/job/tapestry-trunk-freestyle/ws/tapestry-core/src/main/java/org/apache/tapestry5/SymbolConstants.java>:450:
warning - Tag @see: reference not found: https://issues.apache.org/jira/browse/TAP5-2182
<https://builds.apache.org/job/tapestry-trunk-freestyle/ws/tapestry-core/src/main/java/org/apache/tapestry5/SymbolConstants.java>:461:
warning - Tag @linkplain: reference not found: FORM_GROUP_FORM_FIELD_WRAPPER_ELEMENT_NAME
<https://builds.apache.org/job/tapestry-trunk-freestyle/ws/tapestry-core/src/main/java/org/apache/tapestry5/SymbolConstants.java>:461:
warning - Tag @see: reference not found: https://issues.apache.org/jira/browse/TAP5-2182
<https://builds.apache.org/job/tapestry-trunk-freestyle/ws/tapestry-core/src/main/java/org/apache/tapestry5/SymbolConstants.java>:472:
warning - Tag @see: reference not found: https://issues.apache.org/jira/browse/TAP5-2182
<https://builds.apache.org/job/tapestry-trunk-freestyle/ws/tapestry-core/src/main/java/org/apache/tapestry5/SymbolConstants.java>:481:
warning - Tag @see: reference not found: https://issues.apache.org/jira/browse/TAP5-2182
<https://builds.apache.org/job/tapestry-trunk-freestyle/ws/tapestry-webresources/src/main/java/org/apache/tapestry5/internal/webresources/ResourceTransformerFactory.java>:25:
warning - Tag @link: reference not found: org.apache.tapestry5.webresources.services.ResourceProcessor
<https://builds.apache.org/job/tapestry-trunk-freestyle/ws/tapestry-webresources/src/main/java/org/apache/tapestry5/internal/webresources/ResourceTransformerFactory.java>:25:
warning - Tag @link: reference not found: org.apache.tapestry5.webresources.services.ResourceProcessor
<https://builds.apache.org/job/tapestry-trunk-freestyle/ws/tapestry-webresources/src/main/java/org/apache/tapestry5/internal/webresources/ResourceTransformerFactory.java>:25:
warning - Tag @link: reference not found: org.apache.tapestry5.webresources.services.ResourceProcessor
<https://builds.apache.org/job/tapestry-trunk-freestyle/ws/tapestry-core/src/main/java/org/apache/tapestry5/model/MutableComponentModel.java>:135:
warning - Tag @link: reference not found: org.apache.tapestry5.EventConstants.ACTIVATE
<https://builds.apache.org/job/tapestry-trunk-freestyle/ws/tapestry-core/src/main/java/org/apache/tapestry5/model/ComponentModel.java>:224:
warning - Tag @link: reference not found: org.apache.tapestry5.EventConstants.ACTIVATE
<https://builds.apache.org/job/tapestry-trunk-freestyle/ws/tapestry-webresources/src/main/java/org/apache/tapestry5/internal/webresources/ResourceTransformerFactory.java>:25:
warning - Tag @link: reference not found: org.apache.tapestry5.webresources.services.ResourceProcessor

84 warnings
:plastic:sourcesJar UP-TO-DATE
:plastic:assemble UP-TO-DATE
:plastic:compileTestJava UP-TO-DATE
:plastic:compileTestGroovy UP-TO-DATE
:plastic:processTestResources UP-TO-DATE
:plastic:testClasses UP-TO-DATE
:plastic:test UP-TO-DATE
:plastic:check UP-TO-DATE
:plastic:build UP-TO-DATE
:plastic:uploadPublishedUploading: org/apache/tapestry/plastic/5.4-SNAPSHOT/plastic-5.4-20131101.202834-187.jar
to repository remote at https://repository.apache.org/content/repositories/snapshots
Transferring 292K from remote
Uploaded 292K
Uploading: org/apache/tapestry/plastic/5.4-SNAPSHOT/plastic-5.4-20131101.202834-187-sources.jar
to repository remote at https://repository.apache.org/content/repositories/snapshots
Transferring 320K from remote
Uploaded 320K

:quickstart:compileJava UP-TO-DATE
:quickstart:compileGroovy UP-TO-DATE
:quickstart:processFiltered UP-TO-DATE
:quickstart:processResources UP-TO-DATE
:quickstart:classes UP-TO-DATE
:quickstart:jar UP-TO-DATE
:quickstart:sourcesJar UP-TO-DATE
:quickstart:assemble UP-TO-DATE
:quickstart:compileTestJava UP-TO-DATE
:quickstart:compileTestGroovy UP-TO-DATE
:quickstart:processTestResources UP-TO-DATE
:quickstart:testClasses UP-TO-DATE
:quickstart:test UP-TO-DATE
:quickstart:check UP-TO-DATE
:quickstart:build UP-TO-DATE
:quickstart:uploadPublishedUploading: org/apache/tapestry/quickstart/5.4-SNAPSHOT/quickstart-5.4-20131101.202849-187.jar
to repository remote at https://repository.apache.org/content/repositories/snapshots
Transferring 165K from remote
Uploaded 165K
Uploading: org/apache/tapestry/quickstart/5.4-SNAPSHOT/quickstart-5.4-20131101.202849-187-sources.jar
to repository remote at https://repository.apache.org/content/repositories/snapshots
Transferring 104K from remote
Uploaded 104K

:tapestry-beanvalidator:compileCoffeeScript UP-TO-DATE
:tapestry-beanvalidator:compileJava
:tapestry-beanvalidator:compileGroovy UP-TO-DATE
:tapestry-beanvalidator:processResources UP-TO-DATE
:tapestry-beanvalidator:classes
:tapestry-beanvalidator:jar UP-TO-DATE
:tapestry-beanvalidator:sourcesJar UP-TO-DATE
:tapestry-beanvalidator:assemble UP-TO-DATE
:tapestry-beanvalidator:compileTestJava
:tapestry-beanvalidator:compileTestGroovy UP-TO-DATE
:tapestry-beanvalidator:processTestResources UP-TO-DATE
:tapestry-beanvalidator:testClasses
:tapestry-beanvalidator:test

org.apache.tapestry5.beanvalidator.integration.TapestryBeanValidationIntegrationTests.testStartup
FAILED
    java.lang.RuntimeException
        Caused by: com.thoughtworks.selenium.SeleniumException

8 tests completed, 1 failed, 7 skipped
:tapestry-beanvalidator:test FAILED

FAILURE: Build failed with an exception.

* What went wrong:
Execution failed for task ':tapestry-beanvalidator:test'.
> There were failing tests. See the report at: file://<https://builds.apache.org/job/tapestry-trunk-freestyle/ws/tapestry-beanvalidator/build/reports/tests/index.html>

* Try:
Run with --stacktrace option to get the stack trace. Run with --info or --debug option to
get more log output.

BUILD FAILED

Total time: 1 mins 42.212 secs
Build step 'Execute shell' marked build as failure
Recording test results
TestNG Reports Processing: START
Looking for TestNG results report in workspace using pattern: **/build/reports/tests/testng-results.xml
testng-results.xml was last modified before this build started. Ignoring it.
testng-results.xml was last modified before this build started. Ignoring it.
testng-results.xml was last modified before this build started. Ignoring it.
testng-results.xml was last modified before this build started. Ignoring it.
testng-results.xml was last modified before this build started. Ignoring it.
testng-results.xml was last modified before this build started. Ignoring it.
testng-results.xml was last modified before this build started. Ignoring it.
testng-results.xml was last modified before this build started. Ignoring it.
testng-results.xml was last modified before this build started. Ignoring it.
testng-results.xml was last modified before this build started. Ignoring it.
testng-results.xml was last modified before this build started. Ignoring it.
Saving reports...
Found matching files but did not find any TestNG results.
Updating TAP5-2158

---------------------------------------------------------------------
To unsubscribe, e-mail: dev-unsubscribe@tapestry.apache.org
For additional commands, e-mail: dev-help@tapestry.apache.org


Mime
View raw message