tapestry-dev mailing list archives

Site index · List index
Message view « Date » · « Thread »
Top « Date » · « Thread »
From Apache Jenkins Server <jenk...@builds.apache.org>
Subject Build failed in Jenkins: tapestry-trunk-freestyle #1193
Date Mon, 11 Nov 2013 22:45:29 GMT
See <https://builds.apache.org/job/tapestry-trunk-freestyle/1193/changes>

Changes:

[hlship] Advance version number to 5.4-alpha-26

------------------------------------------
[...truncated 24649 lines...]
	at org.eclipse.jetty.server.handler.ScopedHandler.handle(ScopedHandler.java:135)
	at org.eclipse.jetty.server.handler.HandlerWrapper.handle(HandlerWrapper.java:116)
	at org.eclipse.jetty.server.Server.handle(Server.java:369)
	at org.eclipse.jetty.server.AbstractHttpConnection.handleRequest(AbstractHttpConnection.java:486)
	at org.eclipse.jetty.server.AbstractHttpConnection.headerComplete(AbstractHttpConnection.java:933)
	at org.eclipse.jetty.server.AbstractHttpConnection$RequestHandler.headerComplete(AbstractHttpConnection.java:995)
	at org.eclipse.jetty.http.HttpParser.parseNext(HttpParser.java:644)
	at org.eclipse.jetty.http.HttpParser.parseAvailable(HttpParser.java:235)
	at org.eclipse.jetty.server.AsyncHttpConnection.handle(AsyncHttpConnection.java:82)
	at org.eclipse.jetty.io.nio.SelectChannelEndPoint.handle(SelectChannelEndPoint.java:668)
	at org.eclipse.jetty.io.nio.SelectChannelEndPoint$1.run(SelectChannelEndPoint.java:52)
	at org.eclipse.jetty.util.thread.QueuedThreadPool.runJob(QueuedThreadPool.java:608)
	at org.eclipse.jetty.util.thread.QueuedThreadPool$3.run(QueuedThreadPool.java:543)
	at java.lang.Thread.run(Thread.java:662)
Caused by: org.apache.tapestry5.ioc.internal.OperationException: Failure creating embedded
component 'passwordfield' of org.apache.tapestry5.integration.app1.components.BadPublishDuplicate:
Parameter 'value' of embedded component 'passwordfield' can not be published as a parameter
of component org.apache.tapestry5.integration.app1.components.BadPublishDuplicate, as it has
previously been published by embedded component 'textfield'. [at classpath:org/apache/tapestry5/integration/app1/components/BadPublishDuplicate.tml,
line 4]
	at org.apache.tapestry5.ioc.internal.OperationTrackerImpl.logAndRethrow(OperationTrackerImpl.java:180)
	at org.apache.tapestry5.ioc.internal.OperationTrackerImpl.invoke(OperationTrackerImpl.java:88)
	at org.apache.tapestry5.ioc.internal.PerThreadOperationTracker.invoke(PerThreadOperationTracker.java:89)
	at org.apache.tapestry5.ioc.internal.RegistryImpl.invoke(RegistryImpl.java:1112)
	at org.apache.tapestry5.internal.pageload.PageLoaderImpl.createAssembler(PageLoaderImpl.java:256)
	at org.apache.tapestry5.internal.pageload.PageLoaderImpl.getAssembler(PageLoaderImpl.java:246)
	at org.apache.tapestry5.internal.pageload.PageLoaderImpl$12.execute(PageLoaderImpl.java:965)
	at org.apache.tapestry5.internal.pageload.ComponentAssemblerImpl.runActions(ComponentAssemblerImpl.java:242)
	at org.apache.tapestry5.internal.pageload.ComponentAssemblerImpl.performAssembleRootComponent(ComponentAssemblerImpl.java:118)
	... 92 more
Caused by: org.apache.tapestry5.ioc.internal.util.TapestryException: Failure creating embedded
component 'passwordfield' of org.apache.tapestry5.integration.app1.components.BadPublishDuplicate:
Parameter 'value' of embedded component 'passwordfield' can not be published as a parameter
of component org.apache.tapestry5.integration.app1.components.BadPublishDuplicate, as it has
previously been published by embedded component 'textfield'. [at classpath:org/apache/tapestry5/integration/app1/components/BadPublishDuplicate.tml,
line 4]
	at org.apache.tapestry5.internal.pageload.ComponentAssemblerImpl.createEmbeddedAssembler(ComponentAssemblerImpl.java:346)
	at org.apache.tapestry5.internal.pageload.PageLoaderImpl.startComponent(PageLoaderImpl.java:767)
	at org.apache.tapestry5.internal.pageload.PageLoaderImpl.component(PageLoaderImpl.java:643)
	at org.apache.tapestry5.internal.pageload.PageLoaderImpl.processTemplateToken(PageLoaderImpl.java:466)
	at org.apache.tapestry5.internal.pageload.PageLoaderImpl.component(PageLoaderImpl.java:664)
	at org.apache.tapestry5.internal.pageload.PageLoaderImpl.processTemplateToken(PageLoaderImpl.java:466)
	at org.apache.tapestry5.internal.pageload.PageLoaderImpl.programAssembler(PageLoaderImpl.java:302)
	at org.apache.tapestry5.internal.pageload.PageLoaderImpl.access$1200(PageLoaderImpl.java:67)
	at org.apache.tapestry5.internal.pageload.PageLoaderImpl$4.invoke(PageLoaderImpl.java:274)
	at org.apache.tapestry5.internal.pageload.PageLoaderImpl$4.invoke(PageLoaderImpl.java:257)
	at org.apache.tapestry5.ioc.internal.OperationTrackerImpl.invoke(OperationTrackerImpl.java:80)
	... 99 more
Caused by: org.apache.tapestry5.ioc.internal.util.TapestryException: Parameter 'value' of
embedded component 'passwordfield' can not be published as a parameter of component org.apache.tapestry5.integration.app1.components.BadPublishDuplicate,
as it has previously been published by embedded component 'textfield'. [at classpath:org/apache/tapestry5/integration/app1/components/BadPublishDuplicate.tml,
line 4]
	at org.apache.tapestry5.internal.pageload.ComponentAssemblerImpl.createEmbeddedAssembler(ComponentAssemblerImpl.java:329)
	... 109 more
[INFO] TimingFilter Request time:  0.19 s -- /PublishDuplicateNameDemo
[INFO] TimingFilter Request time:  0.17 s -- /asset/meta/core/99d50999/ExceptionReport.css
[INFO] TimingFilter Request time:  0.17 s -- /asset.gz/meta/b811fd64/tapestry5/tapestry.css
[INFO] TimingFilter Request time:  0.17 s -- /asset.gz/meta/54766e7/tapestry5/bootstrap-3.0.2/css/bootstrap.css
[INFO] TimingFilter Request time:  0.00 s -- /asset.gz/meta/ae11a53b/tapestry5/tree.css
[INFO] TimingFilter Request time:  0.00 s -- /asset.gz/meta/de4a9d7a/tapestry5/tapestry-console.css
[INFO] TimingFilter Request time:  0.29 s -- /asset.gz/meta/7ea278de/tapestry5/exception-frame.css
[INFO] TimingFilter Request time:  0.00 s -- /asset.gz/meta/core/fad75cd4/ExceptionDisplay.css
[INFO] TimingFilter Request time:  0.00 s -- /asset.gz/meta/core/3cbf749c/RenderObject.css
[INFO] TimingFilter Request time:  0.00 s -- /asset.gz/stack/60d43c9e/en/core.js
[INFO] TimingFilter Request time:  0.01 s -- /asset.gz/module/t5/core/pageinit.js
[INFO] TimingFilter Request time:  0.00 s -- /asset.gz/module/underscore.js
[INFO] TimingFilter Request time:  0.00 s -- /asset.gz/module/t5/core/console.js
[INFO] TimingFilter Request time:  0.00 s -- /asset.gz/module/t5/core/dom.js
[INFO] TimingFilter Request time:  0.00 s -- /asset.gz/module/t5/core/events.js
[INFO] TimingFilter Request time:  0.00 s -- /asset.gz/module/t5/core/bootstrap.js
[INFO] TimingFilter Request time:  0.00 s -- /asset.gz/module/prototype.js
[INFO] TimingFilter Request time:  0.00 s -- /asset.gz/module/t5/core/utils.js
[INFO] TimingFilter Request time:  0.00 s -- /asset.gz/module/t5/core/exception-display.js
[INFO] SeleniumTestCase Executing public void org.apache.tapestry5.integration.app1.CoreBehaviorsTests.context_lost_on_secure_page_redirect()
[INFO] TimingFilter Request time:  0.01 s -- /securepage/mycontext
[WARN] AssetSource Classpath asset '/org/apache/tapestry5/integration/app1/pages/nested/tapestry-button.png'
should be moved to folder '/META-INF/assets/nested/'.
[WARN] AssetSource Classpath asset '/org/apache/tapestry5/integration/app1/pages/smiley.png'
should be moved under folder '/META-INF/assets/', and the relative path adjusted.
[INFO] PageLoader Loaded page 'SecurePage' (en) in 69.185 ms
[INFO] TimingFilter Request time:  0.09 s -- /securepage/mycontext
[INFO] TimingFilter Request time:  0.01 s -- /asset.gz/meta/7ea278de/tapestry5/exception-frame.css
[INFO] TimingFilter Request time:  0.00 s -- /asset.gz/meta/core/3cbf749c/RenderObject.css
[INFO] TimingFilter Request time:  0.01 s -- /asset.gz/meta/ae11a53b/tapestry5/tree.css
[INFO] TimingFilter Request time:  0.21 s -- /asset.gz/meta/54766e7/tapestry5/bootstrap-3.0.2/css/bootstrap.css
[INFO] TimingFilter Request time:  0.00 s -- /asset.gz/meta/de4a9d7a/tapestry5/tapestry-console.css
[INFO] TimingFilter Request time:  0.03 s -- /asset.gz/meta/b811fd64/tapestry5/tapestry.css
[INFO] TimingFilter Request time:  0.01 s -- /asset/app/cb5e95b6/pages/smiley.png
[INFO] TimingFilter Request time:  0.01 s -- /asset/ctx/b75144b6/images/tapestry_banner.gif
[INFO] TimingFilter Request time:  0.03 s -- /asset.gz/ctx/c0397eb1/css/app.css
[INFO] TimingFilter Request time:  0.04 s -- /asset/app/eab4e5e6/pages/nested/tapestry-button.png
[INFO] TimingFilter Request time:  0.11 s -- /asset.gz/stack/60d43c9e/en/core.js
[INFO] TimingFilter Request time:  0.00 s -- /asset.gz/module/t5/core/pageinit.js
[INFO] TimingFilter Request time:  0.00 s -- /asset.gz/module/t5/core/console.js
[INFO] TimingFilter Request time:  0.04 s -- /asset/meta/b0153c27/tapestry5/bootstrap-3.0.2/fonts/glyphicons-halflings-regular.woff
[INFO] TimingFilter Request time:  0.00 s -- /asset.gz/module/underscore.js
[INFO] TimingFilter Request time:  0.00 s -- /asset.gz/module/t5/core/dom.js
[INFO] TimingFilter Request time:  0.09 s -- /asset.gz/module/t5/core/events.js
[INFO] TimingFilter Request time:  0.00 s -- /asset.gz/module/prototype.js
[INFO] TimingFilter Request time:  0.00 s -- /asset.gz/module/t5/core/utils.js
[INFO] TimingFilter Request time:  0.13 s -- /asset.gz/module/t5/core/bootstrap.js
[INFO] TimingFilter Request time:  0.00 s -- /asset.gz/module/t5/core/zone.js
[INFO] TimingFilter Request time:  0.02 s -- /asset.gz/module/jquery.js
[INFO] TimingFilter Request time:  0.00 s -- /asset.gz/module/t5/core/forms.js
[INFO] TimingFilter Request time:  0.01 s -- /asset.gz/module/t5/core/ajax.js
[INFO] TimingFilter Request time:  0.01 s -- /asset.gz/module/jquery-library.js
[INFO] TimingFilter Request time:  0.00 s -- /asset.gz/module/bootstrap/transition.js
[INFO] TimingFilter Request time:  0.00 s -- /asset.gz/module/t5/core/exception-frame.js
[INFO] TimingFilter Request time:  0.00 s -- /asset.gz/module/bootstrap/collapse.js
[INFO] TimingFilter Request time:  0.00 s -- /asset.gz/module/bootstrap/dropdown.js
[INFO] TimingFilter Request time:  0.00 s -- /favicon.ico
[INFO] TimingFilter Request time:  0.00 s -- /favicon.ico
[INFO] SeleniumTestCase Executing public void org.apache.tapestry5.integration.app1.CoreBehaviorsTests.create_action_link_while_not_rendering()
[INFO] TimingFilter Request time:  0.06 s -- /
[INFO] TimingFilter Request time:  0.00 s -- /asset.gz/module/t5/core/pageinit.js
[INFO] TimingFilter Request time:  0.00 s -- /asset.gz/module/t5/core/dom.js
[INFO] TimingFilter Request time:  0.00 s -- /asset.gz/module/t5/core/console.js
[INFO] TimingFilter Request time:  0.00 s -- /asset.gz/module/underscore.js
[INFO] TimingFilter Request time:  0.01 s -- /asset.gz/module/t5/core/events.js
[INFO] TimingFilter Request time:  0.00 s -- /asset.gz/module/t5/core/utils.js
[INFO] TimingFilter Request time:  0.00 s -- /asset.gz/module/prototype.js
[INFO] TimingFilter Request time:  0.00 s -- /asset.gz/module/t5/core/bootstrap.js
[INFO] TimingFilter Request time:  0.00 s -- /asset.gz/module/t5/core/zone.js
[INFO] TimingFilter Request time:  0.00 s -- /asset.gz/module/jquery.js
[INFO] TimingFilter Request time:  0.00 s -- /asset.gz/module/t5/core/ajax.js
[INFO] TimingFilter Request time:  0.00 s -- /asset.gz/module/t5/core/forms.js
[INFO] TimingFilter Request time:  0.00 s -- /asset.gz/module/jquery-library.js
[INFO] TimingFilter Request time:  0.00 s -- /asset.gz/module/t5/core/exception-frame.js
[INFO] TimingFilter Request time:  0.00 s -- /asset.gz/module/bootstrap/transition.js
[INFO] TimingFilter Request time:  0.00 s -- /asset.gz/module/bootstrap/collapse.js
[INFO] TimingFilter Request time:  0.00 s -- /asset.gz/module/bootstrap/dropdown.js
[INFO] PageLoader Loaded page 'ActionViaLinkDemo' (en) in 149.653 ms
[INFO] TimingFilter Request time:  0.17 s -- /actionvialinkdemo
[INFO] TimingFilter Request time:  0.00 s -- /asset.gz/module/t5/core/pageinit.js
[INFO] TimingFilter Request time:  0.01 s -- /asset.gz/module/underscore.js
[INFO] TimingFilter Request time:  0.00 s -- /asset.gz/module/t5/core/console.js
[INFO] TimingFilter Request time:  0.00 s -- /asset.gz/module/t5/core/dom.js
[INFO] TimingFilter Request time:  0.00 s -- /asset.gz/module/t5/core/events.js
[INFO] TimingFilter Request time:  0.00 s -- /asset.gz/module/prototype.js
[INFO] TimingFilter Request time:  0.00 s -- /asset.gz/module/t5/core/utils.js
[INFO] TimingFilter Request time:  0.00 s -- /asset.gz/module/t5/core/bootstrap.js
[INFO] TimingFilter Request time:  0.00 s -- /asset.gz/module/t5/core/zone.js
[INFO] TimingFilter Request time:  0.00 s -- /asset.gz/module/jquery.js
[INFO] TimingFilter Request time:  0.00 s -- /asset.gz/module/t5/core/ajax.js
[INFO] TimingFilter Request time:  0.00 s -- /asset.gz/module/t5/core/forms.js
[INFO] TimingFilter Request time:  0.00 s -- /asset.gz/module/jquery-library.js
[INFO] TimingFilter Request time:  0.00 s -- /asset.gz/module/t5/core/exception-frame.js
[INFO] TimingFilter Request time:  0.00 s -- /asset.gz/module/bootstrap/transition.js
[INFO] TimingFilter Request time:  0.01 s -- /asset.gz/module/bootstrap/dropdown.js
[INFO] TimingFilter Request time:  0.01 s -- /asset.gz/module/bootstrap/collapse.js
[INFO] TimingFilter Request time:  0.01 s -- /actionvialinkdemo:updatemessage/from$0020getActionURL$0028$0029
[INFO] TimingFilter Request time:  0.03 s -- /actionvialinkdemo
[INFO] TimingFilter Request time:  0.00 s -- /asset.gz/module/t5/core/pageinit.js
[INFO] TimingFilter Request time:  0.00 s -- /asset.gz/module/t5/core/console.js
[INFO] TimingFilter Request time:  0.00 s -- /asset.gz/module/t5/core/events.js
[INFO] TimingFilter Request time:  0.00 s -- /asset.gz/module/underscore.js
[INFO] TimingFilter Request time:  0.00 s -- /asset.gz/module/t5/core/dom.js
[INFO] TimingFilter Request time:  0.00 s -- /asset.gz/module/t5/core/utils.js
[INFO] TimingFilter Request time:  0.00 s -- /asset.gz/module/prototype.js
[INFO] TimingFilter Request time:  0.00 s -- /asset.gz/module/t5/core/bootstrap.js
[INFO] TimingFilter Request time:  0.00 s -- /asset.gz/module/t5/core/zone.js
[INFO] TimingFilter Request time:  0.01 s -- /asset.gz/module/jquery.js
[INFO] TimingFilter Request time:  0.00 s -- /asset.gz/module/t5/core/ajax.js
[INFO] TimingFilter Request time:  0.00 s -- /asset.gz/module/t5/core/forms.js
[INFO] TimingFilter Request time:  0.00 s -- /asset.gz/module/jquery-library.js
[INFO] TimingFilter Request time:  0.00 s -- /asset.gz/module/t5/core/exception-frame.js
[INFO] TimingFilter Request time:  0.00 s -- /asset.gz/module/bootstrap/transition.js
[INFO] TimingFilter Request time:  0.00 s -- /asset.gz/module/bootstrap/collapse.js
[INFO] TimingFilter Request time:  0.00 s -- /asset.gz/module/bootstrap/dropdown.js
[INFO] SeleniumTestCase Executing public void org.apache.tapestry5.integration.app1.CoreBehaviorsTests.create_page_link_via_page_class()
[INFO] TimingFilter Request time:  0.05 s -- /
[INFO] TimingFilter Request time:  0.01 s -- /asset.gz/module/t5/core/pageinit.js
[INFO] TimingFilter Request time:  0.00 s -- /asset.gz/module/underscore.js
[INFO] TimingFilter Request time:  0.00 s -- /asset.gz/module/t5/core/dom.js
[INFO] TimingFilter Request time:  0.00 s -- /asset.gz/module/t5/core/events.js
[INFO] TimingFilter Request time:  0.00 s -- /asset.gz/module/t5/core/console.js
[INFO] TimingFilter Request time:  0.00 s -- /asset.gz/module/t5/core/utils.js
[INFO] TimingFilter Request time:  0.00 s -- /asset.gz/module/prototype.js
[INFO] TimingFilter Request time:  0.00 s -- /asset.gz/module/t5/core/bootstrap.js
[INFO] TimingFilter Request time:  0.00 s -- /asset.gz/module/t5/core/zone.js
[INFO] TimingFilter Request time:  0.06 s -- /asset.gz/module/jquery.js
[INFO] TimingFilter Request time:  0.00 s -- /asset.gz/module/t5/core/ajax.js
[INFO] TimingFilter Request time:  0.01 s -- /asset.gz/module/t5/core/forms.js
[INFO] TimingFilter Request time:  0.00 s -- /asset.gz/module/jquery-library.js
[INFO] TimingFilter Request time:  0.00 s -- /asset.gz/module/t5/core/exception-frame.js
[INFO] TimingFilter Request time:  0.00 s -- /asset.gz/module/bootstrap/transition.js
[INFO] TimingFilter Request time:  0.00 s -- /asset.gz/module/bootstrap/collapse.js
[INFO] TimingFilter Request time:  0.00 s -- /asset.gz/module/bootstrap/dropdown.js
[INFO] PageLoader Loaded page 'InjectDemo' (en) in 172.870 ms
[INFO] TimingFilter Request time:  0.24 s -- /injectdemo
[INFO] TimingFilter Request time:  0.00 s -- /asset.gz/module/t5/core/pageinit.js
[INFO] TimingFilter Request time:  0.00 s -- /asset.gz/module/underscore.js
[INFO] TimingFilter Request time:  0.00 s -- /asset.gz/module/t5/core/events.js
[INFO] TimingFilter Request time:  0.00 s -- /asset.gz/module/t5/core/dom.js
[INFO] TimingFilter Request time:  0.00 s -- /asset.gz/module/t5/core/console.js
[INFO] TimingFilter Request time:  0.00 s -- /asset.gz/module/t5/core/utils.js
[INFO] TimingFilter Request time:  0.00 s -- /asset.gz/module/prototype.js
[INFO] TimingFilter Request time:  0.01 s -- /asset.gz/module/t5/core/bootstrap.js
[INFO] TimingFilter Request time:  0.00 s -- /asset.gz/module/jquery.js
[INFO] TimingFilter Request time:  0.00 s -- /asset.gz/module/t5/core/zone.js
[INFO] TimingFilter Request time:  0.03 s -- /asset.gz/module/jquery-library.js
[INFO] TimingFilter Request time:  0.04 s -- /asset.gz/module/t5/core/ajax.js
[INFO] TimingFilter Request time:  0.04 s -- /asset.gz/module/t5/core/forms.js
[INFO] TimingFilter Request time:  0.01 s -- /asset.gz/module/bootstrap/transition.js
[INFO] TimingFilter Request time:  0.00 s -- /asset.gz/module/t5/core/exception-frame.js
[INFO] TimingFilter Request time:  0.01 s -- /asset.gz/module/bootstrap/collapse.js
[INFO] TimingFilter Request time:  0.01 s -- /asset.gz/module/bootstrap/dropdown.js
[INFO] SeleniumTestCase Executing public void org.apache.tapestry5.integration.app1.CoreBehaviorsTests.decorate_component_event_link()
[INFO] TimingFilter Request time:  0.08 s -- /
[INFO] TimingFilter Request time:  0.00 s -- /asset.gz/module/t5/core/pageinit.js
[INFO] TimingFilter Request time:  0.00 s -- /asset.gz/module/t5/core/events.js
[INFO] TimingFilter Request time:  0.00 s -- /asset.gz/module/t5/core/dom.js
[INFO] TimingFilter Request time:  0.01 s -- /asset.gz/module/underscore.js
[INFO] TimingFilter Request time:  0.00 s -- /asset.gz/module/t5/core/console.js
[INFO] TimingFilter Request time:  0.00 s -- /asset.gz/module/prototype.js
[INFO] TimingFilter Request time:  0.00 s -- /asset.gz/module/t5/core/bootstrap.js
[INFO] TimingFilter Request time:  0.00 s -- /asset.gz/module/t5/core/utils.js
[INFO] TimingFilter Request time:  0.01 s -- /asset.gz/module/t5/core/zone.js
[INFO] TimingFilter Request time:  0.00 s -- /asset.gz/module/jquery.js
[INFO] TimingFilter Request time:  0.00 s -- /asset.gz/module/t5/core/ajax.js
[INFO] TimingFilter Request time:  0.00 s -- /asset.gz/module/t5/core/forms.js
[INFO] TimingFilter Request time:  0.00 s -- /asset.gz/module/jquery-library.js
[INFO] TimingFilter Request time:  0.00 s -- /asset.gz/module/t5/core/exception-frame.js
[INFO] TimingFilter Request time:  0.01 s -- /asset.gz/module/bootstrap/transition.js
[INFO] TimingFilter Request time:  0.00 s -- /asset.gz/module/bootstrap/dropdown.js
[INFO] TimingFilter Request time:  0.00 s -- /asset.gz/module/bootstrap/collapse.js
[INFO] PageLoader Loaded page 'DecorateComponentEventLinkDemo' (en) in 119.434 ms
[INFO] TimingFilter Request time:  0.27 s -- /decoratecomponenteventlinkdemo
[INFO] TimingFilter Request time:  0.07 s -- /asset.gz/module/t5/core/pageinit.js
[INFO] TimingFilter Request time:  0.00 s -- /asset.gz/module/t5/core/console.js
[INFO] TimingFilter Request time:  0.00 s -- /asset.gz/module/t5/core/dom.js
[INFO] TimingFilter Request time:  0.00 s -- /asset.gz/module/t5/core/events.js
[INFO] TimingFilter Request time:  0.00 s -- /asset.gz/module/underscore.js
[INFO] TimingFilter Request time:  0.01 s -- /asset.gz/module/t5/core/bootstrap.js
[INFO] TimingFilter Request time:  0.00 s -- /asset.gz/module/t5/core/utils.js
[INFO] TimingFilter Request time:  0.00 s -- /asset.gz/module/prototype.js
[INFO] TimingFilter Request time:  0.01 s -- /asset.gz/module/t5/core/zone.js
[INFO] TimingFilter Request time:  0.01 s -- /asset.gz/module/jquery.js
[INFO] TimingFilter Request time:  0.01 s -- /asset.gz/module/t5/core/ajax.js
[INFO] TimingFilter Request time:  0.01 s -- /asset.gz/module/t5/core/forms.js
[INFO] TimingFilter Request time:  0.01 s -- /asset.gz/module/jquery-library.js
[INFO] TimingFilter Request time:  0.13 s -- /asset.gz/module/t5/core/exception-frame.js
[INFO] TimingFilter Request time:  0.01 s -- /asset.gz/module/bootstrap/transition.js
:tapestry-core:test FAILED

FAILURE: Build failed with an exception.

* What went wrong:
Execution failed for task ':tapestry-core:test'.
> Process 'Gradle Worker 6' finished with non-zero exit value 137

* Try:
Run with --stacktrace option to get the stack trace. Run with --info or --debug option to
get more log output.

BUILD FAILED

Total time: 13 mins 58.005 secs
Build step 'Execute shell' marked build as failure
Recording test results
TestNG Reports Processing: START
Looking for TestNG results report in workspace using pattern: **/build/reports/tests/testng-results.xml
Saving reports...
Processing '/home/hudson/hudson/jobs/tapestry-trunk-freestyle/builds/2013-11-11_22-29-51/testng/testng-results.xml'
TestNG Reports Processing: FINISH

---------------------------------------------------------------------
To unsubscribe, e-mail: dev-unsubscribe@tapestry.apache.org
For additional commands, e-mail: dev-help@tapestry.apache.org


Mime
View raw message