tapestry-dev mailing list archives

Site index · List index
Message view « Date » · « Thread »
Top « Date » · « Thread »
From Apache Jenkins Server <jenk...@builds.apache.org>
Subject Build failed in Jenkins: tapestry-trunk-freestyle #1180
Date Mon, 04 Nov 2013 18:36:10 GMT
See <https://builds.apache.org/job/tapestry-trunk-freestyle/1180/changes>

Changes:

[hlship] Add additional logging when shutting down test infrastructure

[hlship] Turn off unwanted overrides of the browser to Chrome

------------------------------------------
Started by an SCM change
Building remotely on tapestry in workspace <https://builds.apache.org/job/tapestry-trunk-freestyle/ws/>
Checkout:tapestry-trunk-freestyle / <https://builds.apache.org/job/tapestry-trunk-freestyle/ws/>
- hudson.remoting.Channel@3c8ab0d7:tapestry
Using strategy: Default
Last Built Revision: Revision d11b50bc35d64c49076dd16c589987f7e4753517 (origin/master)
Fetching changes from 1 remote Git repository
Fetching upstream changes from origin
Commencing build of Revision c1c2d0bbe1d9ace80085993e9fd2ac08209e153f (origin/master)
Checking out Revision c1c2d0bbe1d9ace80085993e9fd2ac08209e153f (origin/master)
[tapestry-trunk-freestyle] $ /bin/bash -xe /tmp/hudson2280767571656762767.sh
+ Xvfb :6 -ac -screen 0 1024x768x8
[dix] Could not init font path element /var/lib/defoma/x-ttcidfont-conf.d/dirs/TrueType, removing
from list!
Process leaked file descriptors. See http://wiki.jenkins-ci.org/display/JENKINS/Spawning+processes+from+build
for more information
[tapestry-trunk-freestyle] $ /bin/bash -xe /tmp/hudson7187414356011559246.sh
+ DISPLAY=:6.0
+ bash <https://builds.apache.org/job/tapestry-trunk-freestyle/ws/gradlew> -Dci=true
-Dfile.encoding=UTF-8 -b <https://builds.apache.org/job/tapestry-trunk-freestyle/ws/build.gradle>
continuousIntegration
:buildSrc:compileJava UP-TO-DATE
:buildSrc:compileGroovy UP-TO-DATE
:buildSrc:processResources UP-TO-DATE
:buildSrc:classes UP-TO-DATE
:buildSrc:jar UP-TO-DATE
:buildSrc:assemble UP-TO-DATE
:buildSrc:compileTestJava UP-TO-DATE
:buildSrc:compileTestGroovy UP-TO-DATE
:buildSrc:processTestResources UP-TO-DATE
:buildSrc:testClasses UP-TO-DATE
:buildSrc:test UP-TO-DATE
:buildSrc:check UP-TO-DATE
:buildSrc:build UP-TO-DATE
Creating properties on demand (a.k.a. dynamic properties) has been deprecated and is scheduled
to be removed in Gradle 2.0. Please read http://gradle.org/docs/current/dsl/org.gradle.api.plugins.ExtraPropertiesExtension.html
for information on the replacement for dynamic properties.
Deprecated dynamic property: "languageLevel" on "org.gradle.plugins.ide.idea.model.IdeaModel_Decorated@5e46b372",
value: "1.5".
Deprecated dynamic property: "jdkName" on "org.gradle.plugins.ide.idea.model.IdeaModel_Decorated@5e46b372",
value: "1.7".
Deprecated dynamic property "languageLevel" created in multiple locations.
Deprecated dynamic property "jdkName" created in multiple locations.
sources=file collection
:plastic:compileJava UP-TO-DATE
:plastic:compileGroovy UP-TO-DATE
:plastic:processResources UP-TO-DATE
:plastic:classes UP-TO-DATE
:plastic:jar UP-TO-DATE
:tapestry-core:compileCoffeeScript UP-TO-DATE
:tapestry-core:generateGrammarSource UP-TO-DATE
:tapestry-func:compileJava UP-TO-DATE
:tapestry-func:compileGroovy UP-TO-DATE
:tapestry-func:processResources UP-TO-DATE
:tapestry-func:classes UP-TO-DATE
:tapestry-func:jar UP-TO-DATE
:tapestry-runner:compileJava UP-TO-DATE
:tapestry-runner:compileGroovy UP-TO-DATE
:tapestry-runner:processResources UP-TO-DATE
:tapestry-runner:classes UP-TO-DATE
:tapestry-runner:jar UP-TO-DATE
:tapestry-test-data:compileJava UP-TO-DATE
:tapestry-test-data:compileGroovy UP-TO-DATE
:tapestry-test-data:processResources UP-TO-DATE
:tapestry-test-data:classes UP-TO-DATE
:tapestry-test-data:jar UP-TO-DATE
:tapestry-test:compileJava
:tapestry-test:compileGroovy UP-TO-DATE
:tapestry-test:processResources UP-TO-DATE
:tapestry-test:classes
:tapestry-test:jar
:tapestry5-annotations:compileJava UP-TO-DATE
:tapestry5-annotations:compileGroovy UP-TO-DATE
:tapestry5-annotations:processResources UP-TO-DATE
:tapestry5-annotations:classes UP-TO-DATE
:tapestry5-annotations:jar UP-TO-DATE
:tapestry-ioc:compileJavaNote: Some input files use or override a deprecated API.
Note: Recompile with -Xlint:deprecation for details.
Note: Some input files use unchecked or unsafe operations.
Note: Recompile with -Xlint:unchecked for details.

:tapestry-ioc:compileGroovy UP-TO-DATE
:tapestry-ioc:processResources UP-TO-DATE
:tapestry-ioc:classes
:tapestry-ioc:jar UP-TO-DATE
:tapestry-json:compileJava UP-TO-DATE
:tapestry-json:compileGroovy UP-TO-DATE
:tapestry-json:processResources UP-TO-DATE
:tapestry-json:classes UP-TO-DATE
:tapestry-json:jar UP-TO-DATE
:tapestry-core:compileJavaNote: Some input files use or override a deprecated API.
Note: Recompile with -Xlint:deprecation for details.
Note: Some input files use unchecked or unsafe operations.
Note: Recompile with -Xlint:unchecked for details.

:tapestry-core:compileGroovy UP-TO-DATE
:tapestry-core:preprocessCoffeeScript UP-TO-DATE
:tapestry-core:compileProcessedCoffeescript UP-TO-DATE
:tapestry-core:processResources UP-TO-DATE
:tapestry-core:classes
:tapestry-core:jar UP-TO-DATE
:tapestry-hibernate-core:compileJava UP-TO-DATE
:tapestry-hibernate-core:compileGroovy UP-TO-DATE
:tapestry-hibernate-core:processResources UP-TO-DATE
:tapestry-hibernate-core:classes UP-TO-DATE
:tapestry-hibernate-core:jar UP-TO-DATE
:tapestry-javadoc:compileJava UP-TO-DATE
:tapestry-javadoc:compileGroovy UP-TO-DATE
:tapestry-javadoc:processResources UP-TO-DATE
:tapestry-javadoc:classes UP-TO-DATE
:tapestry-javadoc:jar UP-TO-DATE
:aggregateJavadoc<https://builds.apache.org/job/tapestry-trunk-freestyle/ws/tapestry-core/src/main/java/org/apache/tapestry5/internal/services/DocumentLinker.java>:29:
warning - Tag @see: can't find writeInitialization(org.apache.tapestry5.dom.Element, java.util.List,
java.util.List) in org.apache.tapestry5.services.javascript.ModuleManager
<https://builds.apache.org/job/tapestry-trunk-freestyle/ws/tapestry-core/src/main/java/org/apache/tapestry5/services/ValueLabelProvider.java>:31:
warning - @return tag has no arguments.
<https://builds.apache.org/job/tapestry-trunk-freestyle/ws/tapestry-core/src/main/java/org/apache/tapestry5/internal/services/UnknownActivationContextHandler.java>:33:
warning - Tag @see:illegal character: "58" in "http://issues.apache.org/jira/browse/TAP5-2070"
<https://builds.apache.org/job/tapestry-trunk-freestyle/ws/tapestry-core/src/main/java/org/apache/tapestry5/internal/services/UnknownActivationContextHandler.java>:33:
warning - Tag @see:illegal character: "47" in "http://issues.apache.org/jira/browse/TAP5-2070"
<https://builds.apache.org/job/tapestry-trunk-freestyle/ws/tapestry-core/src/main/java/org/apache/tapestry5/internal/services/UnknownActivationContextHandler.java>:33:
warning - Tag @see:illegal character: "47" in "http://issues.apache.org/jira/browse/TAP5-2070"
<https://builds.apache.org/job/tapestry-trunk-freestyle/ws/tapestry-core/src/main/java/org/apache/tapestry5/internal/services/UnknownActivationContextHandler.java>:33:
warning - Tag @see:illegal character: "47" in "http://issues.apache.org/jira/browse/TAP5-2070"
<https://builds.apache.org/job/tapestry-trunk-freestyle/ws/tapestry-core/src/main/java/org/apache/tapestry5/internal/services/UnknownActivationContextHandler.java>:33:
warning - Tag @see:illegal character: "47" in "http://issues.apache.org/jira/browse/TAP5-2070"
<https://builds.apache.org/job/tapestry-trunk-freestyle/ws/tapestry-core/src/main/java/org/apache/tapestry5/internal/services/UnknownActivationContextHandler.java>:33:
warning - Tag @see:illegal character: "47" in "http://issues.apache.org/jira/browse/TAP5-2070"
<https://builds.apache.org/job/tapestry-trunk-freestyle/ws/tapestry-core/src/main/java/org/apache/tapestry5/internal/services/UnknownActivationContextHandler.java>:33:
warning - Tag @see:illegal character: "45" in "http://issues.apache.org/jira/browse/TAP5-2070"
<https://builds.apache.org/job/tapestry-trunk-freestyle/ws/tapestry-core/src/main/java/org/apache/tapestry5/internal/services/UnknownActivationContextHandler.java>:33:
warning - Tag @see: reference not found: http://issues.apache.org/jira/browse/TAP5-2070
<https://builds.apache.org/job/tapestry-trunk-freestyle/ws/tapestry-core/src/main/java/org/apache/tapestry5/services/assets/AssetPathConstructor.java>:64:
warning - Tag @link: reference not found: 
<https://builds.apache.org/job/tapestry-trunk-freestyle/ws/tapestry-core/src/main/java/org/apache/tapestry5/services/LibraryMapping.java>:79:
warning - Tag @link: can't find getLibraryName() in org.apache.tapestry5.services.LibraryMapping
<https://builds.apache.org/job/tapestry-trunk-freestyle/ws/tapestry-core/src/main/java/org/apache/tapestry5/model/ComponentModel.java>:224:
warning - Tag @see:illegal character: "123" in "{@link MutableComponentModel.doHandleActivationEventContext()}"
<https://builds.apache.org/job/tapestry-trunk-freestyle/ws/tapestry-core/src/main/java/org/apache/tapestry5/model/ComponentModel.java>:224:
warning - Tag @see:illegal character: "64" in "{@link MutableComponentModel.doHandleActivationEventContext()}"
<https://builds.apache.org/job/tapestry-trunk-freestyle/ws/tapestry-core/src/main/java/org/apache/tapestry5/model/ComponentModel.java>:224:
warning - Tag @link: reference not found: org.apache.tapestry5.EventConstants.ACTIVATE
<https://builds.apache.org/job/tapestry-trunk-freestyle/ws/tapestry-core/src/main/java/org/apache/tapestry5/model/ComponentModel.java>:224:
warning - Tag @link: reference not found: org.apache.tapestry5.EventConstants.ACTIVATE
<https://builds.apache.org/job/tapestry-trunk-freestyle/ws/tapestry-core/src/main/java/org/apache/tapestry5/model/ComponentModel.java>:224:
warning - Tag @see: reference not found: {@link MutableComponentModel.doHandleActivationEventContext()}
<https://builds.apache.org/job/tapestry-trunk-freestyle/ws/tapestry-core/src/main/java/org/apache/tapestry5/model/MutableComponentModel.java>:135:
warning - Tag @link: reference not found: org.apache.tapestry5.EventConstants.ACTIVATE
<https://builds.apache.org/job/tapestry-trunk-freestyle/ws/tapestry-core/src/main/java/org/apache/tapestry5/model/MutableComponentModel.java>:135:
warning - Tag @link: reference not found: org.apache.tapestry5.EventConstants.ACTIVATE
<https://builds.apache.org/job/tapestry-trunk-freestyle/ws/tapestry-core/src/main/java/org/apache/tapestry5/services/assets/AssetPathConstructor.java>:64:
warning - Tag @link: reference not found: 
<https://builds.apache.org/job/tapestry-trunk-freestyle/ws/tapestry-core/src/main/java/org/apache/tapestry5/model/MutableComponentModel.java>:135:
warning - Tag @link: reference not found: org.apache.tapestry5.EventConstants.ACTIVATE
<https://builds.apache.org/job/tapestry-trunk-freestyle/ws/tapestry-core/src/main/java/org/apache/tapestry5/model/ComponentModel.java>:224:
warning - Tag @link: reference not found: org.apache.tapestry5.EventConstants.ACTIVATE
<https://builds.apache.org/job/tapestry-trunk-freestyle/ws/tapestry-core/src/main/java/org/apache/tapestry5/model/MutableComponentModel.java>:135:
warning - Tag @link: reference not found: org.apache.tapestry5.EventConstants.ACTIVATE
<https://builds.apache.org/job/tapestry-trunk-freestyle/ws/tapestry-core/src/main/java/org/apache/tapestry5/model/ComponentModel.java>:224:
warning - Tag @link: reference not found: org.apache.tapestry5.EventConstants.ACTIVATE
<https://builds.apache.org/job/tapestry-trunk-freestyle/ws/tapestry-core/src/main/java/org/apache/tapestry5/model/ComponentModel.java>:224:
warning - Tag @link: missing '#': "MutableComponentModel.doHandleActivationEventContext()"
<https://builds.apache.org/job/tapestry-trunk-freestyle/ws/tapestry-core/src/main/java/org/apache/tapestry5/model/ComponentModel.java>:224:
warning - Tag @link: can't find MutableComponentModel.doHandleActivationEventContext() in
org.apache.tapestry5.model.ComponentModel
<https://builds.apache.org/job/tapestry-trunk-freestyle/ws/tapestry-core/src/main/java/org/apache/tapestry5/model/ComponentModel.java>:224:
warning - Tag @see: reference not found: {@link MutableComponentModel.doHandleActivationEventContext()}
<https://builds.apache.org/job/tapestry-trunk-freestyle/ws/tapestry-webresources/src/main/java/org/apache/tapestry5/internal/webresources/ResourceTransformerFactory.java>:25:
warning - Tag @link: reference not found: org.apache.tapestry5.webresources.services.ResourceProcessor
<https://builds.apache.org/job/tapestry-trunk-freestyle/ws/tapestry-webresources/src/main/java/org/apache/tapestry5/internal/webresources/ResourceTransformerFactory.java>:43:
warning - Tag @see: reference not found: org.apache.tapestry5.webresources.services.ResourceProcessorSource
<https://builds.apache.org/job/tapestry-trunk-freestyle/ws/tapestry-webresources/src/main/java/org/apache/tapestry5/internal/webresources/ResourceTransformerFactory.java>:43:
warning - Tag @see: reference not found: org.apache.tapestry5.webresources.services.ResourceProcessorSource
<https://builds.apache.org/job/tapestry-trunk-freestyle/ws/tapestry-core/src/main/java/org/apache/tapestry5/SymbolConstants.java>:481:
warning - Tag @see:illegal character: "58" in "https://issues.apache.org/jira/browse/TAP5-2182"
<https://builds.apache.org/job/tapestry-trunk-freestyle/ws/tapestry-core/src/main/java/org/apache/tapestry5/SymbolConstants.java>:481:
warning - Tag @see:illegal character: "47" in "https://issues.apache.org/jira/browse/TAP5-2182"
<https://builds.apache.org/job/tapestry-trunk-freestyle/ws/tapestry-core/src/main/java/org/apache/tapestry5/SymbolConstants.java>:481:
warning - Tag @see:illegal character: "47" in "https://issues.apache.org/jira/browse/TAP5-2182"
<https://builds.apache.org/job/tapestry-trunk-freestyle/ws/tapestry-core/src/main/java/org/apache/tapestry5/SymbolConstants.java>:481:
warning - Tag @see:illegal character: "47" in "https://issues.apache.org/jira/browse/TAP5-2182"
<https://builds.apache.org/job/tapestry-trunk-freestyle/ws/tapestry-core/src/main/java/org/apache/tapestry5/SymbolConstants.java>:481:
warning - Tag @see:illegal character: "47" in "https://issues.apache.org/jira/browse/TAP5-2182"
<https://builds.apache.org/job/tapestry-trunk-freestyle/ws/tapestry-core/src/main/java/org/apache/tapestry5/SymbolConstants.java>:481:
warning - Tag @see:illegal character: "47" in "https://issues.apache.org/jira/browse/TAP5-2182"
<https://builds.apache.org/job/tapestry-trunk-freestyle/ws/tapestry-core/src/main/java/org/apache/tapestry5/SymbolConstants.java>:481:
warning - Tag @see:illegal character: "45" in "https://issues.apache.org/jira/browse/TAP5-2182"
<https://builds.apache.org/job/tapestry-trunk-freestyle/ws/tapestry-core/src/main/java/org/apache/tapestry5/SymbolConstants.java>:461:
warning - Tag @see:illegal character: "58" in "https://issues.apache.org/jira/browse/TAP5-2182"
<https://builds.apache.org/job/tapestry-trunk-freestyle/ws/tapestry-core/src/main/java/org/apache/tapestry5/SymbolConstants.java>:461:
warning - Tag @see:illegal character: "47" in "https://issues.apache.org/jira/browse/TAP5-2182"
<https://builds.apache.org/job/tapestry-trunk-freestyle/ws/tapestry-core/src/main/java/org/apache/tapestry5/SymbolConstants.java>:461:
warning - Tag @see:illegal character: "47" in "https://issues.apache.org/jira/browse/TAP5-2182"
<https://builds.apache.org/job/tapestry-trunk-freestyle/ws/tapestry-core/src/main/java/org/apache/tapestry5/SymbolConstants.java>:461:
warning - Tag @see:illegal character: "47" in "https://issues.apache.org/jira/browse/TAP5-2182"
<https://builds.apache.org/job/tapestry-trunk-freestyle/ws/tapestry-core/src/main/java/org/apache/tapestry5/SymbolConstants.java>:461:
warning - Tag @see:illegal character: "47" in "https://issues.apache.org/jira/browse/TAP5-2182"
<https://builds.apache.org/job/tapestry-trunk-freestyle/ws/tapestry-core/src/main/java/org/apache/tapestry5/SymbolConstants.java>:461:
warning - Tag @see:illegal character: "47" in "https://issues.apache.org/jira/browse/TAP5-2182"
<https://builds.apache.org/job/tapestry-trunk-freestyle/ws/tapestry-core/src/main/java/org/apache/tapestry5/SymbolConstants.java>:461:
warning - Tag @see:illegal character: "45" in "https://issues.apache.org/jira/browse/TAP5-2182"
<https://builds.apache.org/job/tapestry-trunk-freestyle/ws/tapestry-core/src/main/java/org/apache/tapestry5/SymbolConstants.java>:450:
warning - Tag @see:illegal character: "58" in "https://issues.apache.org/jira/browse/TAP5-2182"
<https://builds.apache.org/job/tapestry-trunk-freestyle/ws/tapestry-core/src/main/java/org/apache/tapestry5/SymbolConstants.java>:450:
warning - Tag @see:illegal character: "47" in "https://issues.apache.org/jira/browse/TAP5-2182"
<https://builds.apache.org/job/tapestry-trunk-freestyle/ws/tapestry-core/src/main/java/org/apache/tapestry5/SymbolConstants.java>:450:
warning - Tag @see:illegal character: "47" in "https://issues.apache.org/jira/browse/TAP5-2182"
<https://builds.apache.org/job/tapestry-trunk-freestyle/ws/tapestry-core/src/main/java/org/apache/tapestry5/SymbolConstants.java>:450:
warning - Tag @see:illegal character: "47" in "https://issues.apache.org/jira/browse/TAP5-2182"
<https://builds.apache.org/job/tapestry-trunk-freestyle/ws/tapestry-core/src/main/java/org/apache/tapestry5/SymbolConstants.java>:450:
warning - Tag @see:illegal character: "47" in "https://issues.apache.org/jira/browse/TAP5-2182"
<https://builds.apache.org/job/tapestry-trunk-freestyle/ws/tapestry-core/src/main/java/org/apache/tapestry5/SymbolConstants.java>:450:
warning - Tag @see:illegal character: "47" in "https://issues.apache.org/jira/browse/TAP5-2182"
<https://builds.apache.org/job/tapestry-trunk-freestyle/ws/tapestry-core/src/main/java/org/apache/tapestry5/SymbolConstants.java>:450:
warning - Tag @see:illegal character: "45" in "https://issues.apache.org/jira/browse/TAP5-2182"
<https://builds.apache.org/job/tapestry-trunk-freestyle/ws/tapestry-core/src/main/java/org/apache/tapestry5/SymbolConstants.java>:472:
warning - Tag @see:illegal character: "58" in "https://issues.apache.org/jira/browse/TAP5-2182"
<https://builds.apache.org/job/tapestry-trunk-freestyle/ws/tapestry-core/src/main/java/org/apache/tapestry5/SymbolConstants.java>:472:
warning - Tag @see:illegal character: "47" in "https://issues.apache.org/jira/browse/TAP5-2182"
<https://builds.apache.org/job/tapestry-trunk-freestyle/ws/tapestry-core/src/main/java/org/apache/tapestry5/SymbolConstants.java>:472:
warning - Tag @see:illegal character: "47" in "https://issues.apache.org/jira/browse/TAP5-2182"
<https://builds.apache.org/job/tapestry-trunk-freestyle/ws/tapestry-core/src/main/java/org/apache/tapestry5/SymbolConstants.java>:472:
warning - Tag @see:illegal character: "47" in "https://issues.apache.org/jira/browse/TAP5-2182"
<https://builds.apache.org/job/tapestry-trunk-freestyle/ws/tapestry-core/src/main/java/org/apache/tapestry5/SymbolConstants.java>:472:
warning - Tag @see:illegal character: "47" in "https://issues.apache.org/jira/browse/TAP5-2182"
<https://builds.apache.org/job/tapestry-trunk-freestyle/ws/tapestry-core/src/main/java/org/apache/tapestry5/SymbolConstants.java>:472:
warning - Tag @see:illegal character: "47" in "https://issues.apache.org/jira/browse/TAP5-2182"
<https://builds.apache.org/job/tapestry-trunk-freestyle/ws/tapestry-core/src/main/java/org/apache/tapestry5/SymbolConstants.java>:472:
warning - Tag @see:illegal character: "45" in "https://issues.apache.org/jira/browse/TAP5-2182"
<https://builds.apache.org/job/tapestry-trunk-freestyle/ws/tapestry-core/src/main/java/org/apache/tapestry5/SymbolConstants.java>:438:
warning - Tag @see:illegal character: "58" in "https://issues.apache.org/jira/browse/TAP5-2182"
<https://builds.apache.org/job/tapestry-trunk-freestyle/ws/tapestry-core/src/main/java/org/apache/tapestry5/SymbolConstants.java>:438:
warning - Tag @see:illegal character: "47" in "https://issues.apache.org/jira/browse/TAP5-2182"
<https://builds.apache.org/job/tapestry-trunk-freestyle/ws/tapestry-core/src/main/java/org/apache/tapestry5/SymbolConstants.java>:438:
warning - Tag @see:illegal character: "47" in "https://issues.apache.org/jira/browse/TAP5-2182"
<https://builds.apache.org/job/tapestry-trunk-freestyle/ws/tapestry-core/src/main/java/org/apache/tapestry5/SymbolConstants.java>:438:
warning - Tag @see:illegal character: "47" in "https://issues.apache.org/jira/browse/TAP5-2182"
<https://builds.apache.org/job/tapestry-trunk-freestyle/ws/tapestry-core/src/main/java/org/apache/tapestry5/SymbolConstants.java>:438:
warning - Tag @see:illegal character: "47" in "https://issues.apache.org/jira/browse/TAP5-2182"
<https://builds.apache.org/job/tapestry-trunk-freestyle/ws/tapestry-core/src/main/java/org/apache/tapestry5/SymbolConstants.java>:438:
warning - Tag @see:illegal character: "47" in "https://issues.apache.org/jira/browse/TAP5-2182"
<https://builds.apache.org/job/tapestry-trunk-freestyle/ws/tapestry-core/src/main/java/org/apache/tapestry5/SymbolConstants.java>:438:
warning - Tag @see:illegal character: "45" in "https://issues.apache.org/jira/browse/TAP5-2182"
<https://builds.apache.org/job/tapestry-trunk-freestyle/ws/tapestry-core/src/main/java/org/apache/tapestry5/SymbolConstants.java>:427:
warning - Tag @see:illegal character: "58" in "https://issues.apache.org/jira/browse/TAP5-2169"
<https://builds.apache.org/job/tapestry-trunk-freestyle/ws/tapestry-core/src/main/java/org/apache/tapestry5/SymbolConstants.java>:427:
warning - Tag @see:illegal character: "47" in "https://issues.apache.org/jira/browse/TAP5-2169"
<https://builds.apache.org/job/tapestry-trunk-freestyle/ws/tapestry-core/src/main/java/org/apache/tapestry5/SymbolConstants.java>:427:
warning - Tag @see:illegal character: "47" in "https://issues.apache.org/jira/browse/TAP5-2169"
<https://builds.apache.org/job/tapestry-trunk-freestyle/ws/tapestry-core/src/main/java/org/apache/tapestry5/SymbolConstants.java>:427:
warning - Tag @see:illegal character: "47" in "https://issues.apache.org/jira/browse/TAP5-2169"
<https://builds.apache.org/job/tapestry-trunk-freestyle/ws/tapestry-core/src/main/java/org/apache/tapestry5/SymbolConstants.java>:427:
warning - Tag @see:illegal character: "47" in "https://issues.apache.org/jira/browse/TAP5-2169"
<https://builds.apache.org/job/tapestry-trunk-freestyle/ws/tapestry-core/src/main/java/org/apache/tapestry5/SymbolConstants.java>:427:
warning - Tag @see:illegal character: "47" in "https://issues.apache.org/jira/browse/TAP5-2169"
<https://builds.apache.org/job/tapestry-trunk-freestyle/ws/tapestry-core/src/main/java/org/apache/tapestry5/SymbolConstants.java>:427:
warning - Tag @see:illegal character: "45" in "https://issues.apache.org/jira/browse/TAP5-2169"
<https://builds.apache.org/job/tapestry-trunk-freestyle/ws/tapestry-core/src/main/java/org/apache/tapestry5/SymbolConstants.java>:427:
warning - Tag @see: reference not found: https://issues.apache.org/jira/browse/TAP5-2169
<https://builds.apache.org/job/tapestry-trunk-freestyle/ws/tapestry-core/src/main/java/org/apache/tapestry5/SymbolConstants.java>:438:
warning - Tag @see: reference not found: https://issues.apache.org/jira/browse/TAP5-2182
<https://builds.apache.org/job/tapestry-trunk-freestyle/ws/tapestry-core/src/main/java/org/apache/tapestry5/SymbolConstants.java>:450:
warning - Tag @see: reference not found: https://issues.apache.org/jira/browse/TAP5-2182
<https://builds.apache.org/job/tapestry-trunk-freestyle/ws/tapestry-core/src/main/java/org/apache/tapestry5/SymbolConstants.java>:461:
warning - Tag @linkplain: reference not found: FORM_GROUP_FORM_FIELD_WRAPPER_ELEMENT_NAME
<https://builds.apache.org/job/tapestry-trunk-freestyle/ws/tapestry-core/src/main/java/org/apache/tapestry5/SymbolConstants.java>:461:
warning - Tag @see: reference not found: https://issues.apache.org/jira/browse/TAP5-2182
<https://builds.apache.org/job/tapestry-trunk-freestyle/ws/tapestry-core/src/main/java/org/apache/tapestry5/SymbolConstants.java>:472:
warning - Tag @see: reference not found: https://issues.apache.org/jira/browse/TAP5-2182
<https://builds.apache.org/job/tapestry-trunk-freestyle/ws/tapestry-core/src/main/java/org/apache/tapestry5/SymbolConstants.java>:481:
warning - Tag @see: reference not found: https://issues.apache.org/jira/browse/TAP5-2182
<https://builds.apache.org/job/tapestry-trunk-freestyle/ws/tapestry-core/src/main/java/org/apache/tapestry5/corelib/data/SecureOption.java>:22:
warning - Tag @link: reference not found: SelectModel
<https://builds.apache.org/job/tapestry-trunk-freestyle/ws/tapestry-core/src/main/java/org/apache/tapestry5/corelib/data/SecureOption.java>:22:
warning - Tag @link: reference not found: Select
<https://builds.apache.org/job/tapestry-trunk-freestyle/ws/tapestry-core/src/main/java/org/apache/tapestry5/corelib/data/SecureOption.java>:22:
warning - Tag @link: reference not found: SelectModel
<https://builds.apache.org/job/tapestry-trunk-freestyle/ws/tapestry-core/src/main/java/org/apache/tapestry5/corelib/data/SecureOption.java>:22:
warning - Tag @link: reference not found: Select
<https://builds.apache.org/job/tapestry-trunk-freestyle/ws/tapestry-webresources/src/main/java/org/apache/tapestry5/internal/webresources/ResourceTransformerFactory.java>:25:
warning - Tag @link: reference not found: org.apache.tapestry5.webresources.services.ResourceProcessor
<https://builds.apache.org/job/tapestry-trunk-freestyle/ws/tapestry-core/src/main/java/org/apache/tapestry5/corelib/data/SecureOption.java>:22:
warning - Tag @link: reference not found: SelectModel
<https://builds.apache.org/job/tapestry-trunk-freestyle/ws/tapestry-core/src/main/java/org/apache/tapestry5/corelib/data/SecureOption.java>:22:
warning - Tag @link: reference not found: Select
<https://builds.apache.org/job/tapestry-trunk-freestyle/ws/tapestry-webresources/src/main/java/org/apache/tapestry5/internal/webresources/ResourceTransformerFactory.java>:25:
warning - Tag @link: reference not found: org.apache.tapestry5.webresources.services.ResourceProcessor
<https://builds.apache.org/job/tapestry-trunk-freestyle/ws/tapestry-webresources/src/main/java/org/apache/tapestry5/internal/webresources/ResourceTransformerFactory.java>:25:
warning - Tag @link: reference not found: org.apache.tapestry5.webresources.services.ResourceProcessor
<https://builds.apache.org/job/tapestry-trunk-freestyle/ws/tapestry-core/src/main/java/org/apache/tapestry5/model/MutableComponentModel.java>:135:
warning - Tag @link: reference not found: org.apache.tapestry5.EventConstants.ACTIVATE
<https://builds.apache.org/job/tapestry-trunk-freestyle/ws/tapestry-core/src/main/java/org/apache/tapestry5/model/ComponentModel.java>:224:
warning - Tag @link: reference not found: org.apache.tapestry5.EventConstants.ACTIVATE
<https://builds.apache.org/job/tapestry-trunk-freestyle/ws/tapestry-webresources/src/main/java/org/apache/tapestry5/internal/webresources/ResourceTransformerFactory.java>:25:
warning - Tag @link: reference not found: org.apache.tapestry5.webresources.services.ResourceProcessor
<https://builds.apache.org/job/tapestry-trunk-freestyle/ws/tapestry-core/src/main/java/org/apache/tapestry5/corelib/data/SecureOption.java>:22:
warning - Tag @link: reference not found: SelectModel
<https://builds.apache.org/job/tapestry-trunk-freestyle/ws/tapestry-core/src/main/java/org/apache/tapestry5/corelib/data/SecureOption.java>:22:
warning - Tag @link: reference not found: Select

93 warnings
:plastic:sourcesJar UP-TO-DATE
:plastic:assemble UP-TO-DATE
:plastic:compileTestJava UP-TO-DATE
:plastic:compileTestGroovy UP-TO-DATE
:plastic:processTestResources UP-TO-DATE
:plastic:testClasses UP-TO-DATE
:plastic:test UP-TO-DATE
:plastic:check UP-TO-DATE
:plastic:build UP-TO-DATE
:plastic:uploadPublishedUploading: org/apache/tapestry/plastic/5.4-SNAPSHOT/plastic-5.4-20131104.183312-192.jar
to repository remote at https://repository.apache.org/content/repositories/snapshots
Transferring 292K from remote
Uploaded 292K
 FAILED

FAILURE: Build failed with an exception.

* What went wrong:
Execution failed for task ':plastic:uploadPublished'.
> Could not publish configurations: [archives, meta, published]
   > Error deploying artifact 'org.apache.tapestry:plastic:jar': Error installing artifact's
metadata: Error while deploying metadata: Error transferring file

* Try:
Run with --stacktrace option to get the stack trace. Run with --info or --debug option to
get more log output.

BUILD FAILED

Total time: 3 mins 12.34 secs
Build step 'Execute shell' marked build as failure
Recording test results
TestNG Reports Processing: START
Looking for TestNG results report in workspace using pattern: **/build/reports/tests/testng-results.xml
testng-results.xml was last modified before this build started. Ignoring it.
testng-results.xml was last modified before this build started. Ignoring it.
testng-results.xml was last modified before this build started. Ignoring it.
testng-results.xml was last modified before this build started. Ignoring it.
testng-results.xml was last modified before this build started. Ignoring it.
testng-results.xml was last modified before this build started. Ignoring it.
testng-results.xml was last modified before this build started. Ignoring it.
testng-results.xml was last modified before this build started. Ignoring it.
testng-results.xml was last modified before this build started. Ignoring it.
testng-results.xml was last modified before this build started. Ignoring it.
testng-results.xml was last modified before this build started. Ignoring it.
Saving reports...
Found matching files but did not find any TestNG results.

---------------------------------------------------------------------
To unsubscribe, e-mail: dev-unsubscribe@tapestry.apache.org
For additional commands, e-mail: dev-help@tapestry.apache.org


Mime
View raw message