tapestry-dev mailing list archives

Site index · List index
Message view « Date » · « Thread »
Top « Date » · « Thread »
From Howard Lewis Ship <hls...@gmail.com>
Subject Re: Build failed in Jenkins: tapestry-trunk-freestyle #1181
Date Mon, 04 Nov 2013 20:23:12 GMT
Tests passed, but snapshot deploy failed.


On Mon, Nov 4, 2013 at 11:36 AM, Apache Jenkins Server <
jenkins@builds.apache.org> wrote:

> See <https://builds.apache.org/job/tapestry-trunk-freestyle/1181/changes>
>
> Changes:
>
> [hlship] Fix broken tests
>
> ------------------------------------------
> Started by an SCM change
> Building remotely on tapestry in workspace <
> https://builds.apache.org/job/tapestry-trunk-freestyle/ws/>
> Checkout:tapestry-trunk-freestyle / <
> https://builds.apache.org/job/tapestry-trunk-freestyle/ws/> -
> hudson.remoting.Channel@3c8ab0d7:tapestry
> Using strategy: Default
> Last Built Revision: Revision c1c2d0bbe1d9ace80085993e9fd2ac08209e153f
> (origin/master)
> Fetching changes from 1 remote Git repository
> Fetching upstream changes from origin
> Commencing build of Revision c685a96e17c4fdff2daef40612c75564838fc921
> (origin/master)
> Checking out Revision c685a96e17c4fdff2daef40612c75564838fc921
> (origin/master)
> [tapestry-trunk-freestyle] $ /bin/bash -xe
> /tmp/hudson7496135658420732773.sh
> + Xvfb :6 -ac -screen 0 1024x768x8
> [dix] Could not init font path element
> /var/lib/defoma/x-ttcidfont-conf.d/dirs/TrueType, removing from list!
> Process leaked file descriptors. See
> http://wiki.jenkins-ci.org/display/JENKINS/Spawning+processes+from+buildfor more information
> [tapestry-trunk-freestyle] $ /bin/bash -xe
> /tmp/hudson4794484828275717787.sh
> + DISPLAY=:6.0
> + bash <https://builds.apache.org/job/tapestry-trunk-freestyle/ws/gradlew>
> -Dci=true -Dfile.encoding=UTF-8 -b <
> https://builds.apache.org/job/tapestry-trunk-freestyle/ws/build.gradle>
> continuousIntegration
> :buildSrc:compileJava UP-TO-DATE
> :buildSrc:compileGroovy UP-TO-DATE
> :buildSrc:processResources UP-TO-DATE
> :buildSrc:classes UP-TO-DATE
> :buildSrc:jar UP-TO-DATE
> :buildSrc:assemble UP-TO-DATE
> :buildSrc:compileTestJava UP-TO-DATE
> :buildSrc:compileTestGroovy UP-TO-DATE
> :buildSrc:processTestResources UP-TO-DATE
> :buildSrc:testClasses UP-TO-DATE
> :buildSrc:test UP-TO-DATE
> :buildSrc:check UP-TO-DATE
> :buildSrc:build UP-TO-DATE
> Creating properties on demand (a.k.a. dynamic properties) has been
> deprecated and is scheduled to be removed in Gradle 2.0. Please read
> http://gradle.org/docs/current/dsl/org.gradle.api.plugins.ExtraPropertiesExtension.htmlfor
information on the replacement for dynamic properties.
> Deprecated dynamic property: "languageLevel" on
> "org.gradle.plugins.ide.idea.model.IdeaModel_Decorated@73af31b8", value:
> "1.5".
> Deprecated dynamic property: "jdkName" on
> "org.gradle.plugins.ide.idea.model.IdeaModel_Decorated@73af31b8", value:
> "1.7".
> Deprecated dynamic property "languageLevel" created in multiple locations.
> Deprecated dynamic property "jdkName" created in multiple locations.
> sources=file collection
> :plastic:compileJava UP-TO-DATE
> :plastic:compileGroovy UP-TO-DATE
> :plastic:processResources UP-TO-DATE
> :plastic:classes UP-TO-DATE
> :plastic:jar UP-TO-DATE
> :tapestry-core:compileCoffeeScript UP-TO-DATE
> :tapestry-core:generateGrammarSource UP-TO-DATE
> :tapestry-func:compileJava UP-TO-DATE
> :tapestry-func:compileGroovy UP-TO-DATE
> :tapestry-func:processResources UP-TO-DATE
> :tapestry-func:classes UP-TO-DATE
> :tapestry-func:jar UP-TO-DATE
> :tapestry-runner:compileJava UP-TO-DATE
> :tapestry-runner:compileGroovy UP-TO-DATE
> :tapestry-runner:processResources UP-TO-DATE
> :tapestry-runner:classes UP-TO-DATE
> :tapestry-runner:jar UP-TO-DATE
> :tapestry-test-data:compileJava UP-TO-DATE
> :tapestry-test-data:compileGroovy UP-TO-DATE
> :tapestry-test-data:processResources UP-TO-DATE
> :tapestry-test-data:classes UP-TO-DATE
> :tapestry-test-data:jar UP-TO-DATE
> :tapestry-test:compileJava UP-TO-DATE
> :tapestry-test:compileGroovy UP-TO-DATE
> :tapestry-test:processResources UP-TO-DATE
> :tapestry-test:classes UP-TO-DATE
> :tapestry-test:jar UP-TO-DATE
> :tapestry5-annotations:compileJava UP-TO-DATE
> :tapestry5-annotations:compileGroovy UP-TO-DATE
> :tapestry5-annotations:processResources UP-TO-DATE
> :tapestry5-annotations:classes UP-TO-DATE
> :tapestry5-annotations:jar UP-TO-DATE
> :tapestry-ioc:compileJava UP-TO-DATE
> :tapestry-ioc:compileGroovy UP-TO-DATE
> :tapestry-ioc:processResources UP-TO-DATE
> :tapestry-ioc:classes UP-TO-DATE
> :tapestry-ioc:jar UP-TO-DATE
> :tapestry-json:compileJava UP-TO-DATE
> :tapestry-json:compileGroovy UP-TO-DATE
> :tapestry-json:processResources UP-TO-DATE
> :tapestry-json:classes UP-TO-DATE
> :tapestry-json:jar UP-TO-DATE
> :tapestry-core:compileJava UP-TO-DATE
> :tapestry-core:compileGroovy UP-TO-DATE
> :tapestry-core:preprocessCoffeeScript UP-TO-DATE
> :tapestry-core:compileProcessedCoffeescript UP-TO-DATE
> :tapestry-core:processResources UP-TO-DATE
> :tapestry-core:classes UP-TO-DATE
> :tapestry-core:jar UP-TO-DATE
> :tapestry-hibernate-core:compileJava UP-TO-DATE
> :tapestry-hibernate-core:compileGroovy UP-TO-DATE
> :tapestry-hibernate-core:processResources UP-TO-DATE
> :tapestry-hibernate-core:classes UP-TO-DATE
> :tapestry-hibernate-core:jar UP-TO-DATE
> :tapestry-javadoc:compileJava UP-TO-DATE
> :tapestry-javadoc:compileGroovy UP-TO-DATE
> :tapestry-javadoc:processResources UP-TO-DATE
> :tapestry-javadoc:classes UP-TO-DATE
> :tapestry-javadoc:jar UP-TO-DATE
> :aggregateJavadoc UP-TO-DATE
> :plastic:sourcesJar UP-TO-DATE
> :plastic:assemble UP-TO-DATE
> :plastic:compileTestJava UP-TO-DATE
> :plastic:compileTestGroovy UP-TO-DATE
> :plastic:processTestResources UP-TO-DATE
> :plastic:testClasses UP-TO-DATE
> :plastic:test UP-TO-DATE
> :plastic:check UP-TO-DATE
> :plastic:build UP-TO-DATE
> :plastic:uploadPublishedUploading:
> org/apache/tapestry/plastic/5.4-SNAPSHOT/plastic-5.4-20131104.193227-192.jar
> to repository remote at
> https://repository.apache.org/content/repositories/snapshots
> Transferring 292K from remote
> Uploaded 292K
> Uploading:
> org/apache/tapestry/plastic/5.4-SNAPSHOT/plastic-5.4-20131104.193227-192-sources.jar
> to repository remote at
> https://repository.apache.org/content/repositories/snapshots
> Transferring 320K from remote
> Uploaded 320K
>
> :quickstart:compileJava UP-TO-DATE
> :quickstart:compileGroovy UP-TO-DATE
> :quickstart:processFiltered UP-TO-DATE
> :quickstart:processResources UP-TO-DATE
> :quickstart:classes UP-TO-DATE
> :quickstart:jar UP-TO-DATE
> :quickstart:sourcesJar UP-TO-DATE
> :quickstart:assemble UP-TO-DATE
> :quickstart:compileTestJava UP-TO-DATE
> :quickstart:compileTestGroovy UP-TO-DATE
> :quickstart:processTestResources UP-TO-DATE
> :quickstart:testClasses UP-TO-DATE
> :quickstart:test UP-TO-DATE
> :quickstart:check UP-TO-DATE
> :quickstart:build UP-TO-DATE
> :quickstart:uploadPublishedUploading:
> org/apache/tapestry/quickstart/5.4-SNAPSHOT/quickstart-5.4-20131104.193352-192.jar
> to repository remote at
> https://repository.apache.org/content/repositories/snapshots
> Transferring 165K from remote
> Uploaded 165K
>  FAILED
>
> FAILURE: Build failed with an exception.
>
> * What went wrong:
> Execution failed for task ':quickstart:uploadPublished'.
> > Could not publish configurations: [archives, meta, published]
>    > Error deploying artifact 'org.apache.tapestry:quickstart:jar': Error
> retrieving previous build number for artifact
> 'org.apache.tapestry:quickstart:jar:sources': repository metadata for:
> 'snapshot org.apache.tapestry:quickstart:5.4-SNAPSHOT' could not be
> retrieved from repository: remote due to an error: Error transferring file:
> Connection timed out
>
> * Try:
> Run with --stacktrace option to get the stack trace. Run with --info or
> --debug option to get more log output.
>
> BUILD FAILED
>
> Total time: 4 mins 7.071 secs
> Build step 'Execute shell' marked build as failure
> Recording test results
> TestNG Reports Processing: START
> Looking for TestNG results report in workspace using pattern:
> **/build/reports/tests/testng-results.xml
> testng-results.xml was last modified before this build started. Ignoring
> it.
> testng-results.xml was last modified before this build started. Ignoring
> it.
> testng-results.xml was last modified before this build started. Ignoring
> it.
> testng-results.xml was last modified before this build started. Ignoring
> it.
> testng-results.xml was last modified before this build started. Ignoring
> it.
> testng-results.xml was last modified before this build started. Ignoring
> it.
> testng-results.xml was last modified before this build started. Ignoring
> it.
> testng-results.xml was last modified before this build started. Ignoring
> it.
> testng-results.xml was last modified before this build started. Ignoring
> it.
> testng-results.xml was last modified before this build started. Ignoring
> it.
> testng-results.xml was last modified before this build started. Ignoring
> it.
> Saving reports...
> Found matching files but did not find any TestNG results.
>
> ---------------------------------------------------------------------
> To unsubscribe, e-mail: dev-unsubscribe@tapestry.apache.org
> For additional commands, e-mail: dev-help@tapestry.apache.org
>
>


-- 
Howard M. Lewis Ship

Creator of Apache Tapestry

The source for Tapestry training, mentoring and support. Contact me to
learn how I can get you up and productive in Tapestry fast!

(971) 678-5210
http://howardlewisship.com

Mime
  • Unnamed multipart/alternative (inline, None, 0 bytes)
View raw message