tapestry-dev mailing list archives

Site index · List index
Message view « Date » · « Thread »
Top « Date » · « Thread »
From Jochen Kemnade <jochen.kemn...@eddyson.de>
Subject Re: Build failed in Jenkins: tapestry-trunk-freestyle #1289
Date Fri, 01 Aug 2014 14:27:09 GMT
Great, thanks!

Am 01.08.2014 16:06, schrieb Howard Lewis Ship:
> Ill look at it when I get ib this morning, as well as getting you access to
> admin the build.
>
> On Tuesday, July 29, 2014, Jochen Kemnade <jochen.kemnade@eddyson.de> wrote:
>
>> The Jenkins job configuration was changed:
>>
>> https://builds.apache.org/job/tapestry-trunk-freestyle/jobConfigHistory/
>> showDiffFiles?timestamp1=2014-05-08_22-50-06&timestamp2=
>> 2014-07-18_16-28-42
>>
>> Maybe there's a relation. Unfortunately I don't have the permissions to
>> change or even view the config, not even the history.
>>
>> Can somebody please have a look?
>>
>> Jochen
>>
>> Am 28.07.2014 11:48, schrieb Jochen Kemnade:
>>
>>> Huh? Why did ubuntu2 run the build? I thought it was tied to ubuntu3?
>>>
>>> Am 28.07.2014 11:33, schrieb Apache Jenkins Server:
>>>
>>>> See <https://builds.apache.org/job/tapestry-trunk-freestyle/1289/changes
>>>>>
>>>>
>>>> Changes:
>>>>
>>>> [jochen.kemnade] TAP5-2139: rename JavascriptAggregationStrategy to
>>>> JavaScriptAggregationStrategy to match other classes' capitalization
>>>>
>>>> ------------------------------------------
>>>> [...truncated 385 lines...]
>>>> :tapestry-hibernate-core:classes
>>>> :tapestry-hibernate-core:jar
>>>> :tapestry-javadoc:compileJava
>>>> :tapestry-javadoc:compileGroovy UP-TO-DATE
>>>> :tapestry-javadoc:processResources UP-TO-DATE
>>>> :tapestry-javadoc:classes
>>>> :tapestry-javadoc:jar
>>>> :aggregateJavadoc
>>>> Download
>>>> http://repo1.maven.org/maven2/org/hibernate/hibernate-
>>>> validator/4.0.0.GA/hibernate-validator-4.0.0.GA.pom
>>>>
>>>> Download
>>>> http://repo1.maven.org/maven2/org/hibernate/hibernate-
>>>> validator-parent/4.0.0.GA/hibernate-validator-parent-4.0.0.GA.pom
>>>>
>>>> Download
>>>> http://repo1.maven.org/maven2/com/sun/xml/bind/jaxb-impl/2.
>>>> 1.3/jaxb-impl-2.1.3.pom
>>>>
>>>> Download
>>>> http://repo1.maven.org/maven2/org/hibernate/hibernate-
>>>> validator/4.0.0.GA/hibernate-validator-4.0.0.GA.jar
>>>>
>>>> Download
>>>> http://repo1.maven.org/maven2/com/sun/xml/bind/jaxb-impl/2.
>>>> 1.3/jaxb-impl-2.1.3.jar
>>>>
>>>> Download
>>>> http://repo1.maven.org/maven2/org/clojure/clojure/1.5.1/
>>>> clojure-1.5.1.pom
>>>> Download
>>>> http://repo1.maven.org/maven2/org/clojure/clojure/1.5.1/
>>>> clojure-1.5.1.jar
>>>> Download
>>>> http://repo1.maven.org/maven2/org/jboss/logging/jboss-
>>>> logging/3.1.0.GA/jboss-logging-3.1.0.GA.pom
>>>>
>>>> Download
>>>> http://repo1.maven.org/maven2/org/jboss/jboss-parent/7/
>>>> jboss-parent-7.pom
>>>> Download
>>>> http://repo1.maven.org/maven2/javax/cache/cache-api/1.0.0/
>>>> cache-api-1.0.0.pom
>>>>
>>>> Download
>>>> http://repo1.maven.org/maven2/org/jsr107/ri/cache-
>>>> annotations-ri-common/1.0.0/cache-annotations-ri-common-1.0.0.pom
>>>>
>>>> Download
>>>> http://repo1.maven.org/maven2/org/jsr107/ri/cache-
>>>> annotations-ri/1.0.0/cache-annotations-ri-1.0.0.pom
>>>>
>>>> Download
>>>> http://repo1.maven.org/maven2/org/jsr107/ri/cache-ri/1.0.0/
>>>> cache-ri-1.0.0.pom
>>>>
>>>> Download
>>>> http://repo1.maven.org/maven2/javax/cache/cache-api/1.0.0/
>>>> cache-api-1.0.0.jar
>>>>
>>>> Download
>>>> http://repo1.maven.org/maven2/org/jsr107/ri/cache-
>>>> annotations-ri-common/1.0.0/cache-annotations-ri-common-1.0.0.jar
>>>>
>>>> Download
>>>> http://repo1.maven.org/maven2/com/github/axet/kaptcha/0.0.8/
>>>> kaptcha-0.0.8.pom
>>>>
>>>> Download
>>>> http://repo1.maven.org/maven2/com/jhlabs/filters/2.0.235/
>>>> filters-2.0.235.pom
>>>>
>>>> Download
>>>> http://repo1.maven.org/maven2/com/github/axet/kaptcha/0.0.8/
>>>> kaptcha-0.0.8.jar
>>>>
>>>> Download
>>>> http://repo1.maven.org/maven2/com/jhlabs/filters/2.0.235/
>>>> filters-2.0.235.jar
>>>>
>>>> Download
>>>> http://repo1.maven.org/maven2/org/mongodb/mongo-java-driver/
>>>> 2.10.1/mongo-java-driver-2.10.1.pom
>>>>
>>>> Download
>>>> http://repo1.maven.org/maven2/org/mongodb/mongo-java-driver/
>>>> 2.10.1/mongo-java-driver-2.10.1.jar
>>>>
>>>> Download
>>>> http://repo1.maven.org/maven2/org/springframework/spring-
>>>> web/3.1.0.RELEASE/spring-web-3.1.0.RELEASE.pom
>>>>
>>>> Download
>>>> http://repo1.maven.org/maven2/org/springframework/spring-
>>>> parent/3.1.0.RELEASE/spring-parent-3.1.0.RELEASE.pom
>>>>
>>>> Download
>>>> http://repo1.maven.org/maven2/org/springframework/spring-
>>>> beans/3.1.0.RELEASE/spring-beans-3.1.0.RELEASE.pom
>>>>
>>>> Download
>>>> http://repo1.maven.org/maven2/org/springframework/spring-
>>>> context/3.1.0.RELEASE/spring-context-3.1.0.RELEASE.pom
>>>>
>>>> Download
>>>> http://repo1.maven.org/maven2/org/springframework/spring-
>>>> core/3.1.0.RELEASE/spring-core-3.1.0.RELEASE.pom
>>>>
>>>> Download
>>>> http://repo1.maven.org/maven2/org/springframework/spring-
>>>> aop/3.1.0.RELEASE/spring-aop-3.1.0.RELEASE.pom
>>>>
>>>> Download
>>>> http://repo1.maven.org/maven2/org/springframework/spring-
>>>> expression/3.1.0.RELEASE/spring-expression-3.1.0.RELEASE.pom
>>>>
>>>> Download
>>>> http://repo1.maven.org/maven2/org/springframework/spring-
>>>> asm/3.1.0.RELEASE/spring-asm-3.1.0.RELEASE.pom
>>>>
>>>> Download
>>>> http://repo1.maven.org/maven2/org/springframework/spring-
>>>> web/3.1.0.RELEASE/spring-web-3.1.0.RELEASE.jar
>>>>
>>>> Download
>>>> http://repo1.maven.org/maven2/org/springframework/spring-
>>>> beans/3.1.0.RELEASE/spring-beans-3.1.0.RELEASE.jar
>>>>
>>>> Download
>>>> http://repo1.maven.org/maven2/org/springframework/spring-
>>>> context/3.1.0.RELEASE/spring-context-3.1.0.RELEASE.jar
>>>>
>>>> Download
>>>> http://repo1.maven.org/maven2/org/springframework/spring-
>>>> core/3.1.0.RELEASE/spring-core-3.1.0.RELEASE.jar
>>>>
>>>> Download
>>>> http://repo1.maven.org/maven2/org/springframework/spring-
>>>> aop/3.1.0.RELEASE/spring-aop-3.1.0.RELEASE.jar
>>>>
>>>> Download
>>>> http://repo1.maven.org/maven2/org/springframework/spring-
>>>> expression/3.1.0.RELEASE/spring-expression-3.1.0.RELEASE.jar
>>>>
>>>> Download
>>>> http://repo1.maven.org/maven2/org/springframework/spring-
>>>> asm/3.1.0.RELEASE/spring-asm-3.1.0.RELEASE.jar
>>>>
>>>> Download
>>>> http://repo1.maven.org/maven2/commons-fileupload/commons-
>>>> fileupload/1.3.1/commons-fileupload-1.3.1.pom
>>>>
>>>> Download
>>>> http://repo1.maven.org/maven2/commons-fileupload/commons-
>>>> fileupload/1.3.1/commons-fileupload-1.3.1.jar
>>>>
>>>> Download
>>>> http://repo1.maven.org/maven2/com/github/sommeri/less4j/1.5.
>>>> 3/less4j-1.5.3.pom
>>>>
>>>> Download
>>>> http://repo1.maven.org/maven2/org/mozilla/rhino/1.7R4/rhino-1.7R4.pom
>>>> Download
>>>> http://repo1.maven.org/maven2/com/github/sommeri/less4j/1.5.
>>>> 3/less4j-1.5.3.jar
>>>>
>>>> Download
>>>> http://repo1.maven.org/maven2/org/mozilla/rhino/1.7R4/rhino-1.7R4.jar
>>>> warning:
>>>> org/jsr107/ri/annotations/AbstractCacheRemoveAllIntercep
>>>> tor.class(org/jsr107/ri/annotations:AbstractCacheRemoveAllIntercep
>>>> tor.class):
>>>> major version 51 is newer than 50, the highest major version supported
>>>> by this compiler.
>>>> It is recommended that the compiler be upgraded.
>>>> warning:
>>>> org/jsr107/ri/annotations/CacheContextSource.class(org/
>>>> jsr107/ri/annotations:CacheContextSource.class):
>>>> major version 51 is newer than 50, the highest major version supported
>>>> by this compiler.
>>>> It is recommended that the compiler be upgraded.
>>>> warning:
>>>> org/jsr107/ri/annotations/InterceptorType.class(org/
>>>> jsr107/ri/annotations:InterceptorType.class):
>>>> major version 51 is newer than 50, the highest major version supported
>>>> by this compiler.
>>>> It is recommended that the compiler be upgraded.
>>>> warning:
>>>> org/jsr107/ri/annotations/AbstractCacheInterceptor.class(org/jsr107/ri/
>>>> annotations:AbstractCacheInterceptor.class):
>>>> major version 51 is newer than 50, the highest major version supported
>>>> by this compiler.
>>>> It is recommended that the compiler be upgraded.
>>>> warning:
>>>> org/jsr107/ri/annotations/AbstractCacheRemoveEntryInterc
>>>> eptor.class(org/jsr107/ri/annotations:AbstractCacheRemoveEntryInterc
>>>> eptor.class):
>>>> major version 51 is newer than 50, the highest major version supported
>>>> by this compiler.
>>>> It is recommended that the compiler be upgraded.
>>>> warning:
>>>> org/jsr107/ri/annotations/AbstractKeyedCacheInterceptor.
>>>> class(org/jsr107/ri/annotations:AbstractKeyedCacheInterceptor.class):
>>>> major version 51 is newer than 50, the highest major version supported
>>>> by this compiler.
>>>> It is recommended that the compiler be upgraded.
>>>> warning:
>>>> org/jsr107/ri/annotations/AbstractCachePutInterceptor.
>>>> class(org/jsr107/ri/annotations:AbstractCachePutInterceptor.class):
>>>> major version 51 is newer than 50, the highest major version supported
>>>> by this compiler.
>>>> It is recommended that the compiler be upgraded.
>>>> warning:
>>>> org/jsr107/ri/annotations/AbstractInternalCacheInvocatio
>>>> nContext.class(org/jsr107/ri/annotations:AbstractInternalCacheInvocatio
>>>> nContext.class):
>>>> major version 51 is newer than 50, the highest major version supported
>>>> by this compiler.
>>>> It is recommended that the compiler be upgraded.
>>>> warning:
>>>> org/jsr107/ri/annotations/StaticCacheInvocationContext.
>>>> class(org/jsr107/ri/annotations:StaticCacheInvocationContext.class):
>>>> major version 51 is newer than 50, the highest major version supported
>>>> by this compiler.
>>>> It is recommended that the compiler be upgraded.
>>>> warning:
>>>> org/jsr107/ri/annotations/InternalCacheInvocationContext
>>>> .class(org/jsr107/ri/annotations:InternalCacheInvocationContext.class):
>>>> major version 51 is newer than 50, the highest major version supported
>>>> by this compiler.
>>>> It is recommended that the compiler be upgraded.
>>>> warning:
>>>> org/jsr107/ri/annotations/AbstractInternalCacheKeyInvoca
>>>> tionContext.class(org/jsr107/ri/annotations:
>>>> AbstractInternalCacheKeyInvocationContext.class):
>>>> major version 51 is newer than 50, the highest major version supported
>>>> by this compiler.
>>>> It is recommended that the compiler be upgraded.
>>>> warning:
>>>> org/jsr107/ri/annotations/StaticCacheKeyInvocationContex
>>>> t.class(org/jsr107/ri/annotations:StaticCacheKeyInvocationContex
>>>> t.class):
>>>> major version 51 is newer than 50, the highest major version supported
>>>> by this compiler.
>>>> It is recommended that the compiler be upgraded.
>>>> warning:
>>>> org/jsr107/ri/annotations/InternalCacheKeyInvocationCont
>>>> ext.class(org/jsr107/ri/annotations:InternalCacheKeyInvocationCont
>>>> ext.class):
>>>> major version 51 is newer than 50, the highest major version supported
>>>> by this compiler.
>>>> It is recommended that the compiler be upgraded.
>>>> warning:
>>>> org/jsr107/ri/annotations/AbstractCacheResultInterceptor
>>>> .class(org/jsr107/ri/annotations:AbstractCacheResultInterceptor.class):
>>>> major version 51 is newer than 50, the highest major version supported
>>>> by this compiler.
>>>> It is recommended that the compiler be upgraded.
>>>> warning:
>>>> org/jsr107/ri/annotations/AbstractCacheLookupUtil.class(
>>>> org/jsr107/ri/annotations:AbstractCacheLookupUtil.class):
>>>> major version 51 is newer than 50, the highest major version supported
>>>> by this compiler.
>>>> It is recommended that the compiler be upgraded.
>>>> warning:
>>>> org/jsr107/ri/annotations/DefaultCacheKeyGenerator.class(org/jsr107/ri/
>>>> annotations:DefaultCacheKeyGenerator.class):
>>>> major version 51 is newer than 50, the highest major version supported
>>>> by this compiler.
>>>> It is recommended that the compiler be upgraded.
>>>> warning:
>>>> org/jsr107/ri/annotations/DefaultCacheResolverFactory.
>>>> class(org/jsr107/ri/annotations:DefaultCacheResolverFactory.class):
>>>> major version 51 is newer than 50, the highest major version supported
>>>> by this compiler.
>>>> It is recommended that the compiler be upgraded.
>>>> <https://builds.apache.org/job/tapestry-trunk-freestyle/
>>>> ws/tapestry-core/src/main/java/org/apache/tapestry5/services/
>>>> ComponentClassResolver.java>:187:
>>>> warning - @return tag has no arguments.
>>>> <https://builds.apache.org/job/tapestry-trunk-freestyle/
>>>> ws/tapestry-core/src/main/java/org/apache/tapestry5/
>>>> services/ValueLabelProvider.java>:31:
>>>> warning - @return tag has no arguments.
>>>> <https://builds.apache.org/job/tapestry-trunk-freestyle/
>>>> ws/tapestry-core/src/main/java/org/apache/tapestry5/internal/services/
>>>> FormControlNameManager.java>:40:
>>>> warning - @return tag has no arguments.
>>>> <https://builds.apache.org/job/tapestry-trunk-freestyle/
>>>> ws/tapestry-core/src/main/java/org/apache/tapestry5/internal/services/
>>>> FormControlNameManager.java>:40:
>>>> warning - @param argument "string" is not a parameter name.
>>>> <https://builds.apache.org/job/tapestry-trunk-freestyle/
>>>> ws/tapestry-core/src/main/java/org/apache/tapestry5/internal/services/
>>>> UnknownActivationContextHandler.java>:33:
>>>> warning - Tag @see:illegal character: "58" in
>>>> "http://issues.apache.org/jira/browse/TAP5-2070"
>>>> <https://builds.apache.org/job/tapestry-trunk-freestyle/
>>>> ws/tapestry-core/src/main/java/org/apache/tapestry5/internal/services/
>>>> UnknownActivationContextHandler.java>:33:
>>>> warning - Tag @see:illegal character: "47" in
>>>> "http://issues.apache.org/jira/browse/TAP5-2070"
>>>> <https://builds.apache.org/job/tapestry-trunk-freestyle/
>>>> ws/tapestry-core/src/main/java/org/apache/tapestry5/internal/services/
>>>> UnknownActivationContextHandler.java>:33:
>>>> warning - Tag @see:illegal character: "47" in
>>>> "http://issues.apache.org/jira/browse/TAP5-2070"
>>>> <https://builds.apache.org/job/tapestry-trunk-freestyle/
>>>> ws/tapestry-core/src/main/java/org/apache/tapestry5/internal/services/
>>>> UnknownActivationContextHandler.java>:33:
>>>> warning - Tag @see:illegal character: "47" in
>>>> "http://issues.apache.org/jira/browse/TAP5-2070"
>>>> <https://builds.apache.org/job/tapestry-trunk-freestyle/
>>>> ws/tapestry-core/src/main/java/org/apache/tapestry5/internal/services/
>>>> UnknownActivationContextHandler.java>:33:
>>>> warning - Tag @see:illegal character: "47" in
>>>> "http://issues.apache.org/jira/browse/TAP5-2070"
>>>> <https://builds.apache.org/job/tapestry-trunk-freestyle/
>>>> ws/tapestry-core/src/main/java/org/apache/tapestry5/internal/services/
>>>> UnknownActivationContextHandler.java>:33:
>>>> warning - Tag @see:illegal character: "47" in
>>>> "http://issues.apache.org/jira/browse/TAP5-2070"
>>>> <https://builds.apache.org/job/tapestry-trunk-freestyle/
>>>> ws/tapestry-core/src/main/java/org/apache/tapestry5/internal/services/
>>>> UnknownActivationContextHandler.java>:33:
>>>> warning - Tag @see:illegal character: "45" in
>>>> "http://issues.apache.org/jira/browse/TAP5-2070"
>>>> <https://builds.apache.org/job/tapestry-trunk-freestyle/
>>>> ws/tapestry-core/src/main/java/org/apache/tapestry5/internal/services/
>>>> UnknownActivationContextHandler.java>:33:
>>>> warning - Tag @see: reference not found:
>>>> http://issues.apache.org/jira/browse/TAP5-2070
>>>> <https://builds.apache.org/job/tapestry-trunk-freestyle/
>>>> ws/tapestry-core/src/main/java/org/apache/tapestry5/
>>>> ComponentResources.java>:143:
>>>> warning - Tag @see: can't find getBindingGenericType() in
>>>> org.apache.tapestry5.Binding
>>>> <https://builds.apache.org/job/tapestry-trunk-freestyle/
>>>> ws/tapestry-core/src/main/java/org/apache/tapestry5/
>>>> services/ComponentOverride.java>:34:
>>>> warning - Tag @see: reference not found: ComponentClassResolver.
>>>> <https://builds.apache.org/job/tapestry-trunk-freestyle/
>>>> ws/tapestry-core/src/main/java/org/apache/tapestry5/
>>>> services/LibraryMapping.java>:80:
>>>> warning - Tag @link: can't find getLibraryName() in
>>>> org.apache.tapestry5.services.LibraryMapping
>>>> <https://builds.apache.org/job/tapestry-trunk-freestyle/
>>>> ws/tapestry-core/src/main/java/org/apache/tapestry5/services/
>>>> PartialTemplateRenderer.java>:64:
>>>> warning - @param argument "renderCommand" is not a parameter name.
>>>> <https://builds.apache.org/job/tapestry-trunk-freestyle/
>>>> ws/tapestry-core/src/main/java/org/apache/tapestry5/
>>>> model/ComponentModel.java>:224:
>>>> warning - Tag @see:illegal character: "123" in "{@link
>>>> MutableComponentModel.doHandleActivationEventContext()}"
>>>> <https://builds.apache.org/job/tapestry-trunk-freestyle/
>>>> ws/tapestry-core/src/main/java/org/apache/tapestry5/
>>>> model/ComponentModel.java>:224:
>>>> warning - Tag @see:illegal character: "64" in "{@link
>>>> MutableComponentModel.doHandleActivationEventContext()}"
>>>> <https://builds.apache.org/job/tapestry-trunk-freestyle/
>>>> ws/tapestry-core/src/main/java/org/apache/tapestry5/
>>>> model/ComponentModel.java>:224:
>>>> warning - Tag @link: reference not found:
>>>> org.apache.tapestry5.EventConstants.ACTIVATE
>>>> <https://builds.apache.org/job/tapestry-trunk-freestyle/
>>>> ws/tapestry-core/src/main/java/org/apache/tapestry5/
>>>> model/ComponentModel.java>:224:
>>>> warning - Tag @link: reference not found:
>>>> org.apache.tapestry5.EventConstants.ACTIVATE
>>>> <https://builds.apache.org/job/tapestry-trunk-freestyle/
>>>> ws/tapestry-core/src/main/java/org/apache/tapestry5/
>>>> model/ComponentModel.java>:224:
>>>> warning - Tag @see: reference not found: {@link
>>>> MutableComponentModel.doHandleActivationEventContext()}
>>>> <https://builds.apache.org/job/tapestry-trunk-freestyle/
>>>> ws/tapestry-core/src/main/java/org/apache/tapestry5/
>>>> model/MutableComponentModel.java>:135:
>>>> warning - Tag @link: reference not found:
>>>> org.apache.tapestry5.EventConstants.ACTIVATE
>>>> <https://builds.apache.org/job/tapestry-trunk-freestyle/
>>>> ws/tapestry-core/src/main/java/org/apache/tapestry5/
>>>> model/MutableComponentModel.java>:135:
>>>> warning - Tag @link: reference not found:
>>>> org.apache.tapestry5.EventConstants.ACTIVATE
>>>> <https://builds.apache.org/job/tapestry-trunk-freestyle/
>>>> ws/tapestry-core/src/main/java/org/apache/tapestry5/
>>>> model/MutableComponentModel.java>:135:
>>>> warning - Tag @link: reference not found:
>>>> org.apache.tapestry5.EventConstants.ACTIVATE
>>>> <https://builds.apache.org/job/tapestry-trunk-freestyle/
>>>> ws/tapestry-core/src/main/java/org/apache/tapestry5/
>>>> model/ComponentModel.java>:224:
>>>> warning - Tag @link: reference not found:
>>>> org.apache.tapestry5.EventConstants.ACTIVATE
>>>> <https://builds.apache.org/job/tapestry-trunk-freestyle/
>>>> ws/tapestry-core/src/main/java/org/apache/tapestry5/
>>>> model/MutableComponentModel.java>:135:
>>>> warning - Tag @link: reference not found:
>>>> org.apache.tapestry5.EventConstants.ACTIVATE
>>>> <https://builds.apache.org/job/tapestry-trunk-freestyle/
>>>> ws/tapestry-core/src/main/java/org/apache/tapestry5/
>>>> model/ComponentModel.java>:224:
>>>> warning - Tag @link: reference not found:
>>>> org.apache.tapestry5.EventConstants.ACTIVATE
>>>> <https://builds.apache.org/job/tapestry-trunk-freestyle/
>>>> ws/tapestry-core/src/main/java/org/apache/tapestry5/
>>>> model/ComponentModel.java>:224:
>>>> warning - Tag @link: missing '#':
>>>> "MutableComponentModel.doHandleActivationEventContext()"
>>>> <https://builds.apache.org/job/tapestry-trunk-freestyle/
>>>> ws/tapestry-core/src/main/java/org/apache/tapestry5/
>>>> model/ComponentModel.java>:224:
>>>> warning - Tag @link: can't find
>>>> MutableComponentModel.doHandleActivationEventContext() in
>>>> org.apache.tapestry5.model.ComponentModel
>>>> <https://builds.apache.org/job/tapestry-trunk-freestyle/
>>>> ws/tapestry-core/src/main/java/org/apache/tapestry5/
>>>> model/ComponentModel.java>:224:
>>>> warning - Tag @see: reference not found: {@link
>>>> MutableComponentModel.doHandleActivationEventContext()}
>>>> <https://builds.apache.org/job/tapestry-trunk-freestyle/
>>>> ws/plastic/src/main/java/org/apache/tapestry5/plastic/
>>>> PlasticManager.java>:229:
>>>> warning - Tag @see: can't find createProxyTransformation(Class) in
>>>> org.apache.tapestry5.plastic.PlasticManager
>>>> warning:
>>>> org/jsr107/ri/annotations/AbstractCacheLookupUtil$
>>>> ParameterDetails.class(org/jsr107/ri/annotations:
>>>> AbstractCacheLookupUtil$ParameterDetails.class):
>>>> major version 51 is newer than 50, the highest major version supported
>>>> by this compiler.
>>>> It is recommended that the compiler be upgraded.
>>>> warning:
>>>> org/jsr107/ri/annotations/AbstractCacheLookupUtil$
>>>> MethodKey.class(org/jsr107/ri/annotations:AbstractCacheLookupUtil$
>>>> MethodKey.class):
>>>> major version 51 is newer than 50, the highest major version supported
>>>> by this compiler.
>>>> It is recommended that the compiler be upgraded.
>>>> warning:
>>>> org/jsr107/ri/annotations/CachePutMethodDetails.class(
>>>> org/jsr107/ri/annotations:CachePutMethodDetails.class):
>>>> major version 51 is newer than 50, the highest major version supported
>>>> by this compiler.
>>>> It is recommended that the compiler be upgraded.
>>>> warning:
>>>> org/jsr107/ri/annotations/StaticCacheResultInvocationCon
>>>> text.class(org/jsr107/ri/annotations:StaticCacheResultInvocationCon
>>>> text.class):
>>>> major version 51 is newer than 50, the highest major version supported
>>>> by this compiler.
>>>> It is recommended that the compiler be upgraded.
>>>> warning:
>>>> org/jsr107/ri/annotations/DefaultGeneratedCacheKey.class(org/jsr107/ri/
>>>> annotations:DefaultGeneratedCacheKey.class):
>>>> major version 51 is newer than 50, the highest major version supported
>>>> by this compiler.
>>>> It is recommended that the compiler be upgraded.
>>>> warning:
>>>> org/jsr107/ri/annotations/DefaultCacheResolver.class(
>>>> org/jsr107/ri/annotations:DefaultCacheResolver.class):
>>>> major version 51 is newer than 50, the highest major version supported
>>>> by this compiler.
>>>> It is recommended that the compiler be upgraded.
>>>> warning:
>>>> org/jsr107/ri/annotations/ClassFilter.class(org/jsr107/
>>>> ri/annotations:ClassFilter.class):
>>>> major version 51 is newer than 50, the highest major version supported
>>>> by this compiler.
>>>> It is recommended that the compiler be upgraded.
>>>> warning:
>>>> org/jsr107/ri/annotations/CacheResultMethodDetails.class(org/jsr107/ri/
>>>> annotations:CacheResultMethodDetails.class):
>>>> major version 51 is newer than 50, the highest major version supported
>>>> by this compiler.
>>>> It is recommended that the compiler be upgraded.
>>>> warning:
>>>> org/jsr107/ri/annotations/CacheRemoveEntryMethodDetails.
>>>> class(org/jsr107/ri/annotations:CacheRemoveEntryMethodDetails.class):
>>>> major version 51 is newer than 50, the highest major version supported
>>>> by this compiler.
>>>> It is recommended that the compiler be upgraded.
>>>> warning:
>>>> org/jsr107/ri/annotations/CacheRemoveAllMethodDetails.
>>>> class(org/jsr107/ri/annotations:CacheRemoveAllMethodDetails.class):
>>>> major version 51 is newer than 50, the highest major version supported
>>>> by this compiler.
>>>> It is recommended that the compiler be upgraded.
>>>> warning:
>>>> org/jsr107/ri/annotations/CacheParameterDetails.class(
>>>> org/jsr107/ri/annotations:CacheParameterDetails.class):
>>>> major version 51 is newer than 50, the highest major version supported
>>>> by this compiler.
>>>> It is recommended that the compiler be upgraded.
>>>> warning:
>>>> org/jsr107/ri/annotations/CacheMethodDetailsImpl.class(
>>>> org/jsr107/ri/annotations:CacheMethodDetailsImpl.class):
>>>> major version 51 is newer than 50, the highest major version supported
>>>> by this compiler.
>>>> It is recommended that the compiler be upgraded.
>>>> warning:
>>>> org/jsr107/ri/annotations/CacheInvocationParameterImpl.
>>>> class(org/jsr107/ri/annotations:CacheInvocationParameterImpl.class):
>>>> major version 51 is newer than 50, the highest major version supported
>>>> by this compiler.
>>>> It is recommended that the compiler be upgraded.
>>>> warning:
>>>> org/jsr107/ri/annotations/AbstractStaticCacheInvocationC
>>>> ontext.class(org/jsr107/ri/annotations:AbstractStaticCacheInvocationC
>>>> ontext.class):
>>>> major version 51 is newer than 50, the highest major version supported
>>>> by this compiler.
>>>> It is recommended that the compiler be upgraded.
>>>> <https://builds.apache.org/job/tapestry-trunk-freestyle/
>>>> ws/tapestry-webresources/src/main/java/org/apache/tapestry5/internal/
>>>> webresources/ResourceTransformerFactory.java>:25:
>>>> warning - Tag @link: reference not found:
>>>> org.apache.tapestry5.webresources.services.ResourceProcessor
>>>> <https://builds.apache.org/job/tapestry-trunk-freestyle/
>>>> ws/tapestry-webresources/src/main/java/org/apache/tapestry5/internal/
>>>> webresources/ResourceTransformerFactory.java>:43:
>>>> warning - Tag @see: reference not found:
>>>> org.apache.tapestry5.webresources.services.ResourceProcessorSource
>>>> <https://builds.apache.org/job/tapestry-trunk-freestyle/
>>>> ws/tapestry-webresources/src/main/java/org/apache/tapestry5/internal/
>>>> webresources/ResourceTransformerFactory.java>:43:
>>>> warning - Tag @see: reference not found:
>>>> org.apache.tapestry5.webresources.services.ResourceProcessorSource
>>>> <https://builds.apache.org/job/tapestry-trunk-freestyle/
>>>> ws/tapestry-core/src/main/java/org/apache/tapestry5/SymbolConstants.java
>>>>> :475:
>>>> warning - Tag @see:illegal character: "58" in
>>>> "https://issues.apache.org/jira/browse/TAP5-2182"
>>>> <https://builds.apache.org/job/tapestry-trunk-freestyle/
>>>> ws/tapestry-core/src/main/java/org/apache/tapestry5/SymbolConstants.java
>>>>> :475:
>>>> warning - Tag @see:illegal character: "47" in
>>>> "https://issues.apache.org/jira/browse/TAP5-2182"
>>>> <https://builds.apache.org/job/tapestry-trunk-freestyle/
>>>> ws/tapestry-core/src/main/java/org/apache/tapestry5/SymbolConstants.java
>>>>> :475:
>>>> warning - Tag @see:illegal character: "47" in
>>>> "https://issues.apache.org/jira/browse/TAP5-2182"
>>>> <https://builds.apache.org/job/tapestry-trunk-freestyle/
>>>> ws/tapestry-core/src/main/java/org/apache/tapestry5/SymbolConstants.java
>>>>> :475:
>>>> warning - Tag @see:illegal character: "47" in
>>>> "https://issues.apache.org/jira/browse/TAP5-2182"
>>>> <https://builds.apache.org/job/tapestry-trunk-freestyle/
>>>> ws/tapestry-core/src/main/java/org/apache/tapestry5/SymbolConstants.java
>>>>> :475:
>>>> warning - Tag @see:illegal character: "47" in
>>>> "https://issues.apache.org/jira/browse/TAP5-2182"
>>>> <https://builds.apache.org/job/tapestry-trunk-freestyle/
>>>> ws/tapestry-core/src/main/java/org/apache/tapestry5/SymbolConstants.java
>>>>> :475:
>>>> warning - Tag @see:illegal character: "47" in
>>>> "https://issues.apache.org/jira/browse/TAP5-2182"
>>>> <https://builds.apache.org/job/tapestry-trunk-freestyle/
>>>> ws/tapestry-core/src/main/java/org/apache/tapestry5/SymbolConstants.java
>>>>> :475:
>>>> warning - Tag @see:illegal character: "45" in
>>>> "https://issues.apache.org/jira/browse/TAP5-2182"
>>>> <https://builds.apache.org/job/tapestry-trunk-freestyle/
>>>> ws/tapestry-core/src/main/java/org/apache/tapestry5/SymbolConstants.java
>>>>> :455:
>>>> warning - Tag @see:illegal character: "58" in
>>>> "https://issues.apache.org/jira/browse/TAP5-2182"
>>>> <https://builds.apache.org/job/tapestry-trunk-freestyle/
>>>> ws/tapestry-core/src/main/java/org/apache/tapestry5/SymbolConstants.java
>>>>> :455:
>>>> warning - Tag @see:illegal character: "47" in
>>>> "https://issues.apache.org/jira/browse/TAP5-2182"
>>>> <https://builds.apache.org/job/tapestry-trunk-freestyle/
>>>> ws/tapestry-core/src/main/java/org/apache/tapestry5/SymbolConstants.java
>>>>> :455:
>>>> warning - Tag @see:illegal character: "47" in
>>>> "https://issues.apache.org/jira/browse/TAP5-2182"
>>>> <https://builds.apache.org/job/tapestry-trunk-freestyle/
>>>> ws/tapestry-core/src/main/java/org/apache/tapestry5/SymbolConstants.java
>>>>> :455:
>>>> warning - Tag @see:illegal character: "47" in
>>>> "https://issues.apache.org/jira/browse/TAP5-2182"
>>>> <https://builds.apache.org/job/tapestry-trunk-freestyle/
>>>> ws/tapestry-core/src/main/java/org/apache/tapestry5/SymbolConstants.java
>>>>> :455:
>>>> warning - Tag @see:illegal character: "47" in
>>>> "https://issues.apache.org/jira/browse/TAP5-2182"
>>>> <https://builds.apache.org/job/tapestry-trunk-freestyle/
>>>> ws/tapestry-core/src/main/java/org/apache/tapestry5/SymbolConstants.java
>>>>> :455:
>>>> warning - Tag @see:illegal character: "47" in
>>>> "https://issues.apache.org/jira/browse/TAP5-2182"
>>>> <https://builds.apache.org/job/tapestry-trunk-freestyle/
>>>> ws/tapestry-core/src/main/java/org/apache/tapestry5/SymbolConstants.java
>>>>> :455:
>>>> warning - Tag @see:illegal character: "45" in
>>>> "https://issues.apache.org/jira/browse/TAP5-2182"
>>>> <https://builds.apache.org/job/tapestry-trunk-freestyle/
>>>> ws/tapestry-core/src/main/java/org/apache/tapestry5/SymbolConstants.java
>>>>> :444:
>>>> warning - Tag @see:illegal character: "58" in
>>>> "https://issues.apache.org/jira/browse/TAP5-2182"
>>>> <https://builds.apache.org/job/tapestry-trunk-freestyle/
>>>> ws/tapestry-core/src/main/java/org/apache/tapestry5/SymbolConstants.java
>>>>> :444:
>>>> warning - Tag @see:illegal character: "47" in
>>>> "https://issues.apache.org/jira/browse/TAP5-2182"
>>>> <https://builds.apache.org/job/tapestry-trunk-freestyle/
>>>> ws/tapestry-core/src/main/java/org/apache/tapestry5/SymbolConstants.java
>>>>> :444:
>>>> warning - Tag @see:illegal character: "47" in
>>>> "https://issues.apache.org/jira/browse/TAP5-2182"
>>>> <https://builds.apache.org/job/tapestry-trunk-freestyle/
>>>> ws/tapestry-core/src/main/java/org/apache/tapestry5/SymbolConstants.java
>>>>> :444:
>>>> warning - Tag @see:illegal character: "47" in
>>>> "https://issues.apache.org/jira/browse/TAP5-2182"
>>>> <https://builds.apache.org/job/tapestry-trunk-freestyle/
>>>> ws/tapestry-core/src/main/java/org/apache/tapestry5/SymbolConstants.java
>>>>> :444:
>>>> warning - Tag @see:illegal character: "47" in
>>>> "https://issues.apache.org/jira/browse/TAP5-2182"
>>>> <https://builds.apache.org/job/tapestry-trunk-freestyle/
>>>> ws/tapestry-core/src/main/java/org/apache/tapestry5/SymbolConstants.java
>>>>> :444:
>>>> warning - Tag @see:illegal character: "47" in
>>>> "https://issues.apache.org/jira/browse/TAP5-2182"
>>>> <https://builds.apache.org/job/tapestry-trunk-freestyle/
>>>> ws/tapestry-core/src/main/java/org/apache/tapestry5/SymbolConstants.java
>>>>> :444:
>>>> warning - Tag @see:illegal character: "45" in
>>>> "https://issues.apache.org/jira/browse/TAP5-2182"
>>>> <https://builds.apache.org/job/tapestry-trunk-freestyle/
>>>> ws/tapestry-core/src/main/java/org/apache/tapestry5/SymbolConstants.java
>>>>> :466:
>>>> warning - Tag @see:illegal character: "58" in
>>>> "https://issues.apache.org/jira/browse/TAP5-2182"
>>>> <https://builds.apache.org/job/tapestry-trunk-freestyle/
>>>> ws/tapestry-core/src/main/java/org/apache/tapestry5/SymbolConstants.java
>>>>> :466:
>>>> warning - Tag @see:illegal character: "47" in
>>>> "https://issues.apache.org/jira/browse/TAP5-2182"
>>>> <https://builds.apache.org/job/tapestry-trunk-freestyle/
>>>> ws/tapestry-core/src/main/java/org/apache/tapestry5/SymbolConstants.java
>>>>> :466:
>>>> warning - Tag @see:illegal character: "47" in
>>>> "https://issues.apache.org/jira/browse/TAP5-2182"
>>>> <https://builds.apache.org/job/tapestry-trunk-freestyle/
>>>> ws/tapestry-core/src/main/java/org/apache/tapestry5/SymbolConstants.java
>>>>> :466:
>>>> warning - Tag @see:illegal character: "47" in
>>>> "https://issues.apache.org/jira/browse/TAP5-2182"
>>>> <https://builds.apache.org/job/tapestry-trunk-freestyle/
>>>> ws/tapestry-core/src/main/java/org/apache/tapestry5/SymbolConstants.java
>>>>> :466:
>>>> warning - Tag @see:illegal character: "47" in
>>>> "https://issues.apache.org/jira/browse/TAP5-2182"
>>>> <https://builds.apache.org/job/tapestry-trunk-freestyle/
>>>> ws/tapestry-core/src/main/java/org/apache/tapestry5/SymbolConstants.java
>>>>> :466:
>>>> warning - Tag @see:illegal character: "47" in
>>>> "https://issues.apache.org/jira/browse/TAP5-2182"
>>>> <https://builds.apache.org/job/tapestry-trunk-freestyle/
>>>> ws/tapestry-core/src/main/java/org/apache/tapestry5/SymbolConstants.java
>>>>> :466:
>>>> warning - Tag @see:illegal character: "45" in
>>>> "https://issues.apache.org/jira/browse/TAP5-2182"
>>>> <https://builds.apache.org/job/tapestry-trunk-freestyle/
>>>> ws/tapestry-core/src/main/java/org/apache/tapestry5/SymbolConstants.java
>>>>> :432:
>>>> warning - Tag @see:illegal character: "58" in
>>>> "https://issues.apache.org/jira/browse/TAP5-2182"
>>>> <https://builds.apache.org/job/tapestry-trunk-freestyle/
>>>> ws/tapestry-core/src/main/java/org/apache/tapestry5/SymbolConstants.java
>>>>> :432:
>>>> warning - Tag @see:illegal character: "47" in
>>>> "https://issues.apache.org/jira/browse/TAP5-2182"
>>>> <https://builds.apache.org/job/tapestry-trunk-freestyle/
>>>> ws/tapestry-core/src/main/java/org/apache/tapestry5/SymbolConstants.java
>>>>> :432:
>>>> warning - Tag @see:illegal character: "47" in
>>>> "https://issues.apache.org/jira/browse/TAP5-2182"
>>>> <https://builds.apache.org/job/tapestry-trunk-freestyle/
>>>> ws/tapestry-core/src/main/java/org/apache/tapestry5/SymbolConstants.java
>>>>> :432:
>>>> warning - Tag @see:illegal character: "47" in
>>>> "https://issues.apache.org/jira/browse/TAP5-2182"
>>>> <https://builds.apache.org/job/tapestry-trunk-freestyle/
>>>> ws/tapestry-core/src/main/java/org/apache/tapestry5/SymbolConstants.java
>>>>> :432:
>>>> warning - Tag @see:illegal character: "47" in
>>>> "https://issues.apache.org/jira/browse/TAP5-2182"
>>>> <https://builds.apache.org/job/tapestry-trunk-freestyle/
>>>> ws/tapestry-core/src/main/java/org/apache/tapestry5/SymbolConstants.java
>>>>> :432:
>>>> warning - Tag @see:illegal character: "47" in
>>>> "https://issues.apache.org/jira/browse/TAP5-2182"
>>>> <https://builds.apache.org/job/tapestry-trunk-freestyle/
>>>> ws/tapestry-core/src/main/java/org/apache/tapestry5/SymbolConstants.java
>>>>> :432:
>>>> warning - Tag @see:illegal character: "45" in
>>>> "https://issues.apache.org/jira/browse/TAP5-2182"
>>>> <https://builds.apache.org/job/tapestry-trunk-freestyle/
>>>> ws/tapestry-core/src/main/java/org/apache/tapestry5/SymbolConstants.java
>>>>> :421:
>>>> warning - Tag @see:illegal character: "58" in
>>>> "https://issues.apache.org/jira/browse/TAP5-2169"
>>>> <https://builds.apache.org/job/tapestry-trunk-freestyle/
>>>> ws/tapestry-core/src/main/java/org/apache/tapestry5/SymbolConstants.java
>>>>> :421:
>>>> warning - Tag @see:illegal character: "47" in
>>>> "https://issues.apache.org/jira/browse/TAP5-2169"
>>>> <https://builds.apache.org/job/tapestry-trunk-freestyle/
>>>> ws/tapestry-core/src/main/java/org/apache/tapestry5/SymbolConstants.java
>>>>> :421:
>>>> warning - Tag @see:illegal character: "47" in
>>>> "https://issues.apache.org/jira/browse/TAP5-2169"
>>>> <https://builds.apache.org/job/tapestry-trunk-freestyle/
>>>> ws/tapestry-core/src/main/java/org/apache/tapestry5/SymbolConstants.java
>>>>> :421:
>>>> warning - Tag @see:illegal character: "47" in
>>>> "https://issues.apache.org/jira/browse/TAP5-2169"
>>>> <https://builds.apache.org/job/tapestry-trunk-freestyle/
>>>> ws/tapestry-core/src/main/java/org/apache/tapestry5/SymbolConstants.java
>>>>> :421:
>>>> warning - Tag @see:illegal character: "47" in
>>>> "https://issues.apache.org/jira/browse/TAP5-2169"
>>>> <https://builds.apache.org/job/tapestry-trunk-freestyle/
>>>> ws/tapestry-core/src/main/java/org/apache/tapestry5/SymbolConstants.java
>>>>> :421:
>>>> warning - Tag @see:illegal character: "47" in
>>>> "https://issues.apache.org/jira/browse/TAP5-2169"
>>>> <https://builds.apache.org/job/tapestry-trunk-freestyle/
>>>> ws/tapestry-core/src/main/java/org/apache/tapestry5/SymbolConstants.java
>>>>> :421:
>>>> warning - Tag @see:illegal character: "45" in
>>>> "https://issues.apache.org/jira/browse/TAP5-2169"
>>>> <https://builds.apache.org/job/tapestry-trunk-freestyle/
>>>> ws/tapestry-core/src/main/java/org/apache/tapestry5/SymbolConstants.java
>>>>> :421:
>>>> warning - Tag @see: reference not found:
>>>> https://issues.apache.org/jira/browse/TAP5-2169
>>>> <https://builds.apache.org/job/tapestry-trunk-freestyle/
>>>> ws/tapestry-core/src/main/java/org/apache/tapestry5/SymbolConstants.java
>>>>> :432:
>>>> warning - Tag @see: reference not found:
>>>> https://issues.apache.org/jira/browse/TAP5-2182
>>>> <https://builds.apache.org/job/tapestry-trunk-freestyle/
>>>> ws/tapestry-core/src/main/java/org/apache/tapestry5/SymbolConstants.java
>>>>> :444:
>>>> warning - Tag @see: reference not found:
>>>> https://issues.apache.org/jira/browse/TAP5-2182
>>>> <https://builds.apache.org/job/tapestry-trunk-freestyle/
>>>> ws/tapestry-core/src/main/java/org/apache/tapestry5/SymbolConstants.java
>>>>> :455:
>>>> warning - Tag @see: reference not found:
>>>> https://issues.apache.org/jira/browse/TAP5-2182
>>>> <https://builds.apache.org/job/tapestry-trunk-freestyle/
>>>> ws/tapestry-core/src/main/java/org/apache/tapestry5/SymbolConstants.java
>>>>> :466:
>>>> warning - Tag @see: reference not found:
>>>> https://issues.apache.org/jira/browse/TAP5-2182
>>>> <https://builds.apache.org/job/tapestry-trunk-freestyle/
>>>> ws/tapestry-core/src/main/java/org/apache/tapestry5/SymbolConstants.java
>>>>> :475:
>>>> warning - Tag @see: reference not found:
>>>> https://issues.apache.org/jira/browse/TAP5-2182
>>>> <https://builds.apache.org/job/tapestry-trunk-freestyle/
>>>> ws/tapestry-core/src/main/java/org/apache/tapestry5/SymbolConstants.java
>>>>> :493:
>>>> warning - Tag @see: reference not found:
>>>> org.apache.tapestry5.services.exceptions.ExceptionReporter
>>>> <https://builds.apache.org/job/tapestry-trunk-freestyle/
>>>> ws/tapestry-ioc/src/main/java/org/apache/tapestry5/ioc/
>>>> ServiceBindingOptions.java>:94:
>>>> warning - @param argument "<T>" is not a type parameter name.
>>>> <https://builds.apache.org/job/tapestry-trunk-freestyle/
>>>> ws/tapestry-core/src/main/java/org/apache/tapestry5/
>>>> corelib/data/SecureOption.java>:22:
>>>> warning - Tag @link: reference not found: SelectModel
>>>> <https://builds.apache.org/job/tapestry-trunk-freestyle/
>>>> ws/tapestry-core/src/main/java/org/apache/tapestry5/
>>>> corelib/data/SecureOption.java>:22:
>>>> warning - Tag @link: reference not found: Select
>>>> <https://builds.apache.org/job/tapestry-trunk-freestyle/
>>>> ws/tapestry-core/src/main/java/org/apache/tapestry5/
>>>> corelib/data/SecureOption.java>:22:
>>>> warning - Tag @link: reference not found: SelectModel
>>>> <https://builds.apache.org/job/tapestry-trunk-freestyle/
>>>> ws/tapestry-core/src/main/java/org/apache/tapestry5/
>>>> corelib/data/SecureOption.java>:22:
>>>> warning - Tag @link: reference not found: Select
>>>> <https://builds.apache.org/job/tapestry-trunk-freestyle/
>>>> ws/tapestry-webresources/src/main/java/org/apache/tapestry5/internal/
>>>> webresources/ResourceTransformerFactory.java>:25:
>>>> warning - Tag @link: reference not found:
>>>> org.apache.tapestry5.webresources.services.ResourceProcessor
>>>> <https://builds.apache.org/job/tapestry-trunk-freestyle/
>>>> ws/tapestry-core/src/main/java/org/apache/tapestry5/
>>>> corelib/data/SecureOption.java>:22:
>>>> warning - Tag @link: reference not found: SelectModel
>>>> <https://builds.apache.org/job/tapestry-trunk-freestyle/
>>>> ws/tapestry-core/src/main/java/org/apache/tapestry5/
>>>> corelib/data/SecureOption.java>:22:
>>>> warning - Tag @link: reference not found: Select
>>>> <https://builds.apache.org/job/tapestry-trunk-freestyle/
>>>> ws/tapestry-webresources/src/main/java/org/apache/tapestry5/internal/
>>>> webresources/ResourceTransformerFactory.java>:25:
>>>> warning - Tag @link: reference not found:
>>>> org.apache.tapestry5.webresources.services.ResourceProcessor
>>>> <https://builds.apache.org/job/tapestry-trunk-freestyle/
>>>> ws/tapestry-webresources/src/main/java/org/apache/tapestry5/internal/
>>>> webresources/ResourceTransformerFactory.java>:25:
>>>> warning - Tag @link: reference not found:
>>>> org.apache.tapestry5.webresources.services.ResourceProcessor
>>>> <https://builds.apache.org/job/tapestry-trunk-freestyle/
>>>> ws/tapestry-core/src/main/java/org/apache/tapestry5/
>>>> model/MutableComponentModel.java>:135:
>>>> warning - Tag @link: reference not found:
>>>> org.apache.tapestry5.EventConstants.ACTIVATE
>>>> <https://builds.apache.org/job/tapestry-trunk-freestyle/
>>>> ws/tapestry-core/src/main/java/org/apache/tapestry5/
>>>> model/ComponentModel.java>:224:
>>>> warning - Tag @link: reference not found:
>>>> org.apache.tapestry5.EventConstants.ACTIVATE
>>>> <https://builds.apache.org/job/tapestry-trunk-freestyle/
>>>> ws/tapestry-webresources/src/main/java/org/apache/tapestry5/internal/
>>>> webresources/ResourceTransformerFactory.java>:25:
>>>> warning - Tag @link: reference not found:
>>>> org.apache.tapestry5.webresources.services.ResourceProcessor
>>>> <https://builds.apache.org/job/tapestry-trunk-freestyle/
>>>> ws/tapestry-core/src/main/java/org/apache/tapestry5/
>>>> corelib/data/SecureOption.java>:22:
>>>> warning - Tag @link: reference not found: SelectModel
>>>> <https://builds.apache.org/job/tapestry-trunk-freestyle/
>>>> ws/tapestry-core/src/main/java/org/apache/tapestry5/
>>>> corelib/data/SecureOption.java>:22:
>>>> warning - Tag @link: reference not found: Select
>>>> 129 warnings
>>>> :plastic:sourcesJar
>>>> :plastic:assemble
>>>> :plastic:compileTestJava
>>>> Download
>>>> http://repo1.maven.org/maven2/org/codehaus/groovy/groovy-
>>>> all/2.0.6/groovy-all-2.0.6.pom
>>>>
>>>> Download
>>>> http://repo1.maven.org/maven2/org/spockframework/spock-core/
>>>> 0.7-groovy-2.0/spock-core-0.7-groovy-2.0.pom
>>>>
>>>> Download
>>>> http://repo1.maven.org/maven2/org/codehaus/groovy/groovy-
>>>> all/2.0.6/groovy-all-2.0.6.jar
>>>>
>>>> Download
>>>> http://repo1.maven.org/maven2/org/spockframework/spock-core/
>>>> 0.7-groovy-2.0/spock-core-0.7-groovy-2.0.jar
>>>>
>>>> :plastic:compileTestGroovy
>>>> :plastic:processTestResources UP-TO-DATE
>>>> :plastic:testClasses
>>>> :plastic:test
>>>> Download
>>>> http://repo1.maven.org/maven2/org/slf4j/slf4j-log4j12/1.7.7/
>>>> slf4j-log4j12-1.7.7.pom
>>>>
>>>> Download
>>>> http://repo1.maven.org/maven2/org/slf4j/slf4j-log4j12/1.7.7/
>>>> slf4j-log4j12-1.7.7.jar
>>>>
>>>> :plastic:check
>>>> :plastic:build
>>>> :plastic:uploadPublished FAILED
>>>>
>>>> FAILURE: Build failed with an exception.
>>>>
>>>> * Where:
>>>> Build file
>>>> '<https://builds.apache.org/job/tapestry-trunk-freestyle/ws/build.gradle
>>>> '>
>>>> line: 238
>>>>
>>>> * What went wrong:
>>>> Execution failed for task ':plastic:uploadPublished'.
>>>>
>>>>> Missing upload credentials. Set 'snapshotDeployUserName' and
>>>>> 'snapshotDeployPassword' root project properties.
>>>>>
>>>>
>>>> * Try:
>>>> Run with --stacktrace option to get the stack trace. Run with --info
>>>> or --debug option to get more log output.
>>>>
>>>> BUILD FAILED
>>>>
>>>> Total time: 2 mins 57.485 secs
>>>> Build step 'Execute shell' marked build as failure
>>>> Recording test results
>>>> TestNG Reports Processing: START
>>>> Looking for TestNG results report in workspace using pattern:
>>>> **/build/reports/tests/testng-results.xml
>>>> Did not find any matching files.
>>>> Updating TAP5-2139
>>>>
>>>> ---------------------------------------------------------------------
>>>> To unsubscribe, e-mail: dev-unsubscribe@tapestry.apache.org
>>>> For additional commands, e-mail: dev-help@tapestry.apache.org
>>>>
>>>>
>>>>
>>>
>>
>>
>>
>> ---------------------------------------------------------------------
>> To unsubscribe, e-mail: dev-unsubscribe@tapestry.apache.org
>> For additional commands, e-mail: dev-help@tapestry.apache.org
>>
>>
>




---------------------------------------------------------------------
To unsubscribe, e-mail: dev-unsubscribe@tapestry.apache.org
For additional commands, e-mail: dev-help@tapestry.apache.org


Mime
View raw message