tapestry-dev mailing list archives

Site index · List index
Message view « Date » · « Thread »
Top « Date » · « Thread »
From Jochen Kemnade <jochen.kemn...@eddyson.de>
Subject Re: Build failed in Jenkins: tapestry-trunk-freestyle #1376
Date Wed, 21 Jan 2015 16:19:01 GMT
Am 20.01.2015 um 10:30 schrieb Apache Jenkins Server:
> Tapestry Bean Validatior Integration Tests > org.apache.tapestry5.beanvalidator.integration.TapestryBeanValidationIntegrationTests.beaneditform_validation
FAILED
>      java.lang.AssertionError at TapestryBeanValidationIntegrationTests.java:93
>
> Tapestry Bean Validatior Integration Tests > org.apache.tapestry5.beanvalidator.integration.TapestryBeanValidationIntegrationTests.beaneditor_validation
FAILED
>      java.lang.AssertionError at TapestryBeanValidationIntegrationTests.java:251

Anyone got an idea why these fail?

Somehow the validation messages get mixed up, the message for the 
password field is shown for both the user name and the password field 
(see attached screenshot).



Mime
View raw message