tapestry-dev mailing list archives

Site index · List index
Message view « Date » · « Thread »
Top « Date » · « Thread »
From Apache Jenkins Server <jenk...@builds.apache.org>
Subject Build failed in Jenkins: tapestry-trunk-freestyle #1385
Date Mon, 16 Feb 2015 15:58:30 GMT
See <https://builds.apache.org/job/tapestry-trunk-freestyle/1385/changes>

Changes:

[jochen.kemnade] upgrade commons-codec to 1.10 - part 2

[jochen.kemnade] Revert "Reset conduit states with only one access to PerthreadMap", I committed
that by accident while reviewing

------------------------------------------
[...truncated 534 lines...]
It is recommended that the compiler be upgraded.
warning: org/jsr107/ri/annotations/AbstractStaticCacheInvocationContext.class(org/jsr107/ri/annotations:AbstractStaticCacheInvocationContext.class):
major version 51 is newer than 50, the highest major version supported by this compiler.
It is recommended that the compiler be upgraded.
warning: org/jsr107/ri/annotations/CachePutMethodDetails.class(org/jsr107/ri/annotations:CachePutMethodDetails.class):
major version 51 is newer than 50, the highest major version supported by this compiler.
It is recommended that the compiler be upgraded.
warning: org/jsr107/ri/annotations/CacheResultMethodDetails.class(org/jsr107/ri/annotations:CacheResultMethodDetails.class):
major version 51 is newer than 50, the highest major version supported by this compiler.
It is recommended that the compiler be upgraded.
warning: org/jsr107/ri/annotations/CacheRemoveEntryMethodDetails.class(org/jsr107/ri/annotations:CacheRemoveEntryMethodDetails.class):
major version 51 is newer than 50, the highest major version supported by this compiler.
It is recommended that the compiler be upgraded.
21 warnings

:tapestry-ioc-jcache:compileGroovy UP-TO-DATE
:tapestry-ioc-jcache:processResources UP-TO-DATE
:tapestry-ioc-jcache:classes
:tapestry-ioc-jcache:jar
:tapestry-ioc-jcache:sourcesJar
:tapestry-ioc-jcache:assemble
:tapestry-ioc-jcache:compileTestJavawarning: manager/BlogManager.class(manager:BlogManager.class):
major version 51 is newer than 50, the highest major version supported by this compiler.
It is recommended that the compiler be upgraded.
warning: manager/CacheNameOnEachMethodBlogManagerImpl.class(manager:CacheNameOnEachMethodBlogManagerImpl.class):
major version 51 is newer than 50, the highest major version supported by this compiler.
It is recommended that the compiler be upgraded.
warning: domain/Blog.class(domain:Blog.class): major version 51 is newer than 50, the highest
major version supported by this compiler.
It is recommended that the compiler be upgraded.
warning: javax/cache/annotation/BeanProvider.class(javax/cache/annotation:BeanProvider.class):
major version 51 is newer than 50, the highest major version supported by this compiler.
It is recommended that the compiler be upgraded.
warning: manager/ClassLevelCacheConfigBlogManagerImpl.class(manager:ClassLevelCacheConfigBlogManagerImpl.class):
major version 51 is newer than 50, the highest major version supported by this compiler.
It is recommended that the compiler be upgraded.
warning: manager/UsingDefaultCacheNameBlogManagerImpl.class(manager:UsingDefaultCacheNameBlogManagerImpl.class):
major version 51 is newer than 50, the highest major version supported by this compiler.
It is recommended that the compiler be upgraded.
6 warnings

:tapestry-ioc-jcache:compileTestGroovy UP-TO-DATE
:tapestry-ioc-jcache:processTestResources
:tapestry-ioc-jcache:testClasses
:tapestry-ioc-jcache:test
:tapestry-ioc-jcache:check
:tapestry-ioc-jcache:build
:tapestry-ioc-junit:compileJava
:tapestry-ioc-junit:compileGroovy UP-TO-DATE
:tapestry-ioc-junit:processResources UP-TO-DATE
:tapestry-ioc-junit:classes
:tapestry-ioc-junit:jar
:tapestry-ioc-junit:sourcesJar
:tapestry-ioc-junit:assemble
:tapestry-ioc-junit:compileTestJava
:tapestry-ioc-junit:compileTestGroovy UP-TO-DATE
:tapestry-ioc-junit:processTestResources UP-TO-DATE
:tapestry-ioc-junit:testClasses
:tapestry-ioc-junit:test
:tapestry-ioc-junit:check
:tapestry-ioc-junit:build
:tapestry-javadoc:sourcesJar
:tapestry-javadoc:assemble
:tapestry-javadoc:compileTestJava UP-TO-DATE
:tapestry-javadoc:compileTestGroovy
:tapestry-javadoc:processTestResources UP-TO-DATE
:tapestry-javadoc:testClasses
:tapestry-javadoc:test
:tapestry-javadoc:check
:tapestry-javadoc:build
:tapestry-jmx:compileJava
:tapestry-jmx:compileGroovy UP-TO-DATE
:tapestry-jmx:processResources UP-TO-DATE
:tapestry-jmx:classes
:tapestry-jmx:jar
:tapestry-jmx:sourcesJar
:tapestry-jmx:assemble
:tapestry-jmx:compileTestJava
:tapestry-jmx:compileTestGroovy UP-TO-DATE
:tapestry-jmx:processTestResources
:tapestry-jmx:testClasses
:tapestry-jmx:test
:tapestry-jmx:check
:tapestry-jmx:build
:tapestry-jpa:compileJavaNote: Some input files use or override a deprecated API.
Note: Recompile with -Xlint:deprecation for details.
Note: Some input files use unchecked or unsafe operations.
Note: Recompile with -Xlint:unchecked for details.

:tapestry-jpa:compileGroovy UP-TO-DATE
:tapestry-jpa:processResources UP-TO-DATE
:tapestry-jpa:classes
:tapestry-jpa:jar
:tapestry-jpa:sourcesJar
:tapestry-jpa:assemble
:tapestry-jpa:compileTestJavaNote: /x1/jenkins/jenkins-slave/workspace/tapestry-trunk-freestyle/tapestry-jpa/src/test/java/org/apache/tapestry5/internal/jpa/JpaTransactionAdvisorImplTest.java
uses or overrides a deprecated API.
Note: Recompile with -Xlint:deprecation for details.
Note: Some input files use unchecked or unsafe operations.
Note: Recompile with -Xlint:unchecked for details.

:tapestry-jpa:compileTestGroovy UP-TO-DATE
:tapestry-jpa:processTestResources
:tapestry-jpa:testClasses
:tapestry-jpa:test
:tapestry-jpa:check
:tapestry-jpa:build
:tapestry-json:sourcesJar
:tapestry-json:assemble
:tapestry-json:compileTestJava UP-TO-DATE
:tapestry-json:compileTestGroovy
:tapestry-json:processTestResources UP-TO-DATE
:tapestry-json:testClasses
:tapestry-json:test
:tapestry-json:check
:tapestry-json:build
:tapestry-kaptcha:compileJava
:tapestry-kaptcha:compileGroovy UP-TO-DATE
:tapestry-kaptcha:processResources
:tapestry-kaptcha:classes
:tapestry-kaptcha:jar
:tapestry-kaptcha:sourcesJar
:tapestry-kaptcha:assemble
:tapestry-kaptcha:compileTestJava
:tapestry-kaptcha:compileTestGroovy UP-TO-DATE
:tapestry-kaptcha:processTestResources
:tapestry-kaptcha:testClasses
:tapestry-kaptcha:test
:tapestry-kaptcha:check
:tapestry-kaptcha:build
:tapestry-mongodb:compileJavaNote: Some input files use or override a deprecated API.
Note: Recompile with -Xlint:deprecation for details.
Note: /x1/jenkins/jenkins-slave/workspace/tapestry-trunk-freestyle/tapestry-mongodb/src/main/java/org/apache/tapestry5/mongodb/modules/MongodbModule.java
uses unchecked or unsafe operations.
Note: Recompile with -Xlint:unchecked for details.

:tapestry-mongodb:compileGroovy UP-TO-DATE
:tapestry-mongodb:processResources UP-TO-DATE
:tapestry-mongodb:classes
:tapestry-mongodb:jar
:tapestry-mongodb:sourcesJar
:tapestry-mongodb:assemble
:tapestry-mongodb:compileTestJava
:tapestry-mongodb:compileTestGroovy
:tapestry-mongodb:processTestResources UP-TO-DATE
:tapestry-mongodb:testClasses
:tapestry-mongodb:test
:tapestry-mongodb:check
:tapestry-mongodb:build
:tapestry-runner:sourcesJar
:tapestry-runner:assemble
:tapestry-runner:compileTestJava UP-TO-DATE
:tapestry-runner:compileTestGroovy UP-TO-DATE
:tapestry-runner:processTestResources UP-TO-DATE
:tapestry-runner:testClasses UP-TO-DATE
:tapestry-runner:test UP-TO-DATE
:tapestry-runner:check UP-TO-DATE
:tapestry-runner:build
:tapestry-spring:compileJavaNote: Some input files use unchecked or unsafe operations.
Note: Recompile with -Xlint:unchecked for details.

:tapestry-spring:compileGroovy UP-TO-DATE
:tapestry-spring:processResources UP-TO-DATE
:tapestry-spring:classes
:tapestry-spring:jar
:tapestry-spring:sourcesJar
:tapestry-spring:assemble
:tapestry-spring:compileTestJava
:tapestry-spring:compileTestGroovy UP-TO-DATE
:tapestry-spring:processTestResources
:tapestry-spring:testClasses
:tapestry-spring:test
:tapestry-spring:check
:tapestry-spring:build
:tapestry-test:sourcesJar
:tapestry-test:assemble
:tapestry-test:compileTestJava
:tapestry-test:compileTestGroovy UP-TO-DATE
:tapestry-test:processTestResources UP-TO-DATE
:tapestry-test:testClasses
:tapestry-test:test
:tapestry-test:check
:tapestry-test:build
:tapestry-test-constants:sourcesJar
:tapestry-test-constants:assemble
:tapestry-test-constants:compileTestJava UP-TO-DATE
:tapestry-test-constants:compileTestGroovy UP-TO-DATE
:tapestry-test-constants:processTestResources UP-TO-DATE
:tapestry-test-constants:testClasses UP-TO-DATE
:tapestry-test-constants:test UP-TO-DATE
:tapestry-test-constants:check UP-TO-DATE
:tapestry-test-constants:build
:tapestry-test-data:sourcesJar
:tapestry-test-data:assemble
:tapestry-test-data:compileTestJava UP-TO-DATE
:tapestry-test-data:compileTestGroovy UP-TO-DATE
:tapestry-test-data:processTestResources UP-TO-DATE
:tapestry-test-data:testClasses UP-TO-DATE
:tapestry-test-data:test UP-TO-DATE
:tapestry-test-data:check UP-TO-DATE
:tapestry-test-data:build
:tapestry-upload:compileJavaNote: Some input files use or override a deprecated API.
Note: Recompile with -Xlint:deprecation for details.
Note: /x1/jenkins/jenkins-slave/workspace/tapestry-trunk-freestyle/tapestry-upload/src/main/java/org/apache/tapestry5/upload/internal/services/MultipartDecoderImpl.java
uses unchecked or unsafe operations.
Note: Recompile with -Xlint:unchecked for details.

:tapestry-upload:compileGroovy UP-TO-DATE
:tapestry-upload:processResources
:tapestry-upload:classes
:tapestry-upload:jar
:tapestry-upload:sourcesJar
:tapestry-upload:assemble
:tapestry-upload:compileTestJavaNote: Some input files use or override a deprecated API.
Note: Recompile with -Xlint:deprecation for details.
Note: /x1/jenkins/jenkins-slave/workspace/tapestry-trunk-freestyle/tapestry-upload/src/test/java/org/apache/tapestry5/upload/components/UploadTest.java
uses unchecked or unsafe operations.
Note: Recompile with -Xlint:unchecked for details.

:tapestry-upload:compileTestGroovy UP-TO-DATE
:tapestry-upload:processTestResources
:tapestry-upload:testClasses
:tapestry-upload:test
:tapestry-upload:check
:tapestry-upload:build
:tapestry-webresources:compileJavaNote: /x1/jenkins/jenkins-slave/workspace/tapestry-trunk-freestyle/tapestry-webresources/src/main/java/com/yahoo/platform/yui/compressor/CssCompressor.java
uses unchecked or unsafe operations.
Note: Recompile with -Xlint:unchecked for details.

:tapestry-webresources:compileGroovy UP-TO-DATE
:tapestry-webresources:processResources
:tapestry-webresources:classes
:tapestry-webresources:jar
:tapestry-webresources:sourcesJar
:tapestry-webresources:assemble
:tapestry-webresources:compileTestJava
:tapestry-webresources:compileTestGroovy
:tapestry-webresources:processTestResources
:tapestry-webresources:testClasses
:tapestry-webresources:test

t5.webresources.tests.WebResourcesSpec > Less compilation FAILED
    org.openqa.selenium.WebDriverException at WebResourcesSpec.groovy:60

2 tests completed, 1 failed
:tapestry-webresources:test FAILED

FAILURE: Build failed with an exception.

* What went wrong:
Execution failed for task ':tapestry-webresources:test'.
> There were failing tests. See the report at: file:///x1/jenkins/jenkins-slave/workspace/tapestry-trunk-freestyle/tapestry-webresources/build/reports/tests/index.html

* Try:
Run with --stacktrace option to get the stack trace. Run with --info or --debug option to
get more log output.

BUILD FAILED

Total time: 14 mins 23.456 secs
Build step 'Execute shell' marked build as failure
Recording test results
TestNG Reports Processing: START
Looking for TestNG results report in workspace using pattern: **/build/reports/tests/testng-results.xml
Did not find any matching files.

---------------------------------------------------------------------
To unsubscribe, e-mail: dev-unsubscribe@tapestry.apache.org
For additional commands, e-mail: dev-help@tapestry.apache.org


Mime
View raw message