tapestry-dev mailing list archives

Site index · List index
Message view « Date » · « Thread »
Top « Date » · « Thread »
From Kalle Korhonen <kalle.o.korho...@gmail.com>
Subject Re: [SUCCESS] Switch to release candidate
Date Tue, 04 Aug 2015 16:53:08 GMT
On Tue, Aug 4, 2015 at 1:03 AM, Jochen Kemnade <jochen.kemnade@eddyson.de>
wrote:

> Am 04.08.2015 um 05:29 schrieb Kalle Korhonen:
>
>> There's a few tests failing, at least for me,
>>
> Which one?


The two tests failed for me on Monday were:

Tapestry Core > Core Integration Tests >
org.apache.tapestry5.integration.app1.ZoneTests.multi_zone_update_using_string_in_loop
FAILED
    java.lang.AssertionError at ZoneTests.java:265

Tapestry Core > Core Integration Tests >
org.apache.tapestry5.integration.app1.FormTests.datefield_clickoutside_closes
FAILED
    java.lang.AssertionError at FormTests.java:387


> and I see Jochen trying to improve things.
>
> Well, I've given up, I think they are running Firefox 39 on hemera and
> we'd need a new Selenium version, but we can't upgrade to 2.47+ because
> they dropped support for Java 6. I guess we won't be able to run the UI
> tests for 5.4 anymore, which is a shame.
> Of course, we could use a dedicated build machine, but someone would need
> to provide one. I tried to run the build on my Pi, but that's much too slow.


Indeed it's a shame. Could we do CI builds on Travis instead, does anybody
know if they have FF available? We run all of Tynamo's builds on it and
it's great but then again, we use plain htmlunit based tests.

Kalle

Mime
  • Unnamed multipart/alternative (inline, None, 0 bytes)
View raw message