tapestry-dev mailing list archives

Site index · List index
Message view « Date » · « Thread »
Top « Date » · « Thread »
From Apache Jenkins Server <jenk...@builds.apache.org>
Subject Build failed in Jenkins: tapestry-trunk-freestyle #1541
Date Fri, 11 Dec 2015 23:22:43 GMT
See <https://builds.apache.org/job/tapestry-trunk-freestyle/1541/changes>

Changes:

[jochen.kemnade] TAP5-2238: don't redirect to a stack in the wrong locale

------------------------------------------
[...truncated 532 lines...]
:tapestry-upload:testClasses
:tapestry-upload:test
:tapestry-webresources:compileJavaNote: /x1/jenkins/jenkins-slave/workspace/tapestry-trunk-freestyle/tapestry-webresources/src/main/java/com/yahoo/platform/yui/compressor/CssCompressor.java
uses unchecked or unsafe operations.
Note: Recompile with -Xlint:unchecked for details.

:tapestry-webresources:compileGroovy UP-TO-DATE
:tapestry-webresources:processResources
:tapestry-webresources:classes
:tapestry-webresources:compileTestJava
:tapestry-webresources:compileTestGroovy
:tapestry-webresources:processTestResources
:tapestry-webresources:testClasses
:tapestry-webresources:test
:tapestry5-annotations:compileTestJava UP-TO-DATE
:tapestry5-annotations:compileTestGroovy UP-TO-DATE
:tapestry5-annotations:processTestResources UP-TO-DATE
:tapestry5-annotations:testClasses UP-TO-DATE
:tapestry5-annotations:test UP-TO-DATE
:combinedJacocoReport
[ant:jacocoReport] Classes in bundle 'tapestry-trunk-freestyle' do no match with execution
data. For report generation the same class files must be used as at runtime.
[ant:jacocoReport] Execution data for class org/apache/tapestry5/corelib/components/EventLink
does not match.
[ant:jacocoReport] Execution data for class org/apache/tapestry5/corelib/components/BeanEditor$Prepare
does not match.
[ant:jacocoReport] Execution data for class org/apache/tapestry5/corelib/components/PropertyEditor$1
does not match.
[ant:jacocoReport] Execution data for class org/apache/tapestry5/corelib/components/AjaxFormLoop
does not match.
[ant:jacocoReport] Execution data for class org/apache/tapestry5/corelib/base/AbstractPropertyOutput$1
does not match.
[ant:jacocoReport] Execution data for class org/apache/tapestry5/corelib/pages/ExceptionReport
does not match.
[ant:jacocoReport] Execution data for class org/apache/tapestry5/corelib/components/Label
does not match.
[ant:jacocoReport] Execution data for class org/apache/tapestry5/corelib/components/Tree does
not match.
[ant:jacocoReport] Execution data for class org/apache/tapestry5/corelib/mixins/NotEmpty does
not match.
[ant:jacocoReport] Execution data for class org/apache/tapestry5/corelib/mixins/DiscardBody
does not match.
[ant:jacocoReport] Execution data for class org/apache/tapestry5/corelib/pages/T5Dashboard
does not match.
[ant:jacocoReport] Execution data for class org/apache/tapestry5/kaptcha/components/KaptchaImage
does not match.
[ant:jacocoReport] Execution data for class org/apache/tapestry5/corelib/base/AbstractTextField
does not match.
[ant:jacocoReport] Execution data for class org/apache/tapestry5/corelib/components/Tree$RenderNodes$1
does not match.
[ant:jacocoReport] Execution data for class org/apache/tapestry5/corelib/mixins/FormFieldFocus
does not match.
[ant:jacocoReport] Execution data for class org/apache/tapestry5/corelib/components/FormFragment$1
does not match.
[ant:jacocoReport] Execution data for class org/apache/tapestry5/corelib/components/Grid$CachingDataSource
does not match.
[ant:jacocoReport] Execution data for class org/apache/tapestry5/corelib/components/ActionLink
does not match.
[ant:jacocoReport] Execution data for class org/apache/tapestry5/corelib/components/RenderObject
does not match.
[ant:jacocoReport] Execution data for class org/apache/tapestry5/corelib/mixins/FormGroup
does not match.
[ant:jacocoReport] Execution data for class org/apache/tapestry5/corelib/components/FormFragment
does not match.
[ant:jacocoReport] Execution data for class org/apache/tapestry5/corelib/components/Tree$4
does not match.
[ant:jacocoReport] Execution data for class org/apache/tapestry5/corelib/components/Tree$1
does not match.
[ant:jacocoReport] Execution data for class org/apache/tapestry5/corelib/pages/HibernateStatistics
does not match.
[ant:jacocoReport] Execution data for class org/apache/tapestry5/corelib/components/Tree$3
does not match.
[ant:jacocoReport] Execution data for class org/apache/tapestry5/corelib/components/Tree$2
does not match.
[ant:jacocoReport] Execution data for class org/apache/tapestry5/corelib/pages/PropertyEditBlocks
does not match.
[ant:jacocoReport] Execution data for class org/apache/tapestry5/corelib/components/Loop$RestoreStateFromStoredClientValue
does not match.
[ant:jacocoReport] Execution data for class org/apache/tapestry5/corelib/components/PropertyDisplay
does not match.
[ant:jacocoReport] Execution data for class org/apache/tapestry5/kaptcha/pages/KaptchaEditBlocks
does not match.
[ant:jacocoReport] Execution data for class org/apache/tapestry5/corelib/components/AjaxFormLoop$SyncValue
does not match.
[ant:jacocoReport] Execution data for class org/apache/tapestry5/corelib/components/Radio
does not match.
[ant:jacocoReport] Execution data for class org/apache/tapestry5/corelib/components/GridRows$SetupForRowByIndex
does not match.
[ant:jacocoReport] Execution data for class org/apache/tapestry5/corelib/pages/ExceptionReport$ThreadInfo
does not match.
[ant:jacocoReport] Execution data for class org/apache/tapestry5/corelib/components/Alerts
does not match.
[ant:jacocoReport] Execution data for class org/apache/tapestry5/corelib/components/GridPager
does not match.
[ant:jacocoReport] Execution data for class org/apache/tapestry5/corelib/components/BeanDisplay
does not match.
[ant:jacocoReport] Execution data for class org/apache/tapestry5/corelib/components/Grid$1
does not match.
[ant:jacocoReport] Execution data for class org/apache/tapestry5/corelib/components/Grid$2
does not match.
[ant:jacocoReport] Execution data for class org/apache/tapestry5/corelib/components/TimeInterval
does not match.
[ant:jacocoReport] Execution data for class org/apache/tapestry5/corelib/base/BaseClientElement
does not match.
[ant:jacocoReport] Execution data for class org/apache/tapestry5/corelib/pages/ExceptionReport$1
does not match.
[ant:jacocoReport] Execution data for class org/apache/tapestry5/corelib/components/Submit$ProcessSubmission
does not match.
[ant:jacocoReport] Execution data for class org/apache/tapestry5/corelib/components/AjaxFormLoop$10
does not match.
[ant:jacocoReport] Execution data for class org/apache/tapestry5/corelib/components/Delegate
does not match.
[ant:jacocoReport] Execution data for class org/apache/tapestry5/corelib/base/AbstractTextField$1
does not match.
[ant:jacocoReport] Execution data for class org/apache/tapestry5/corelib/pages/ServiceStatus
does not match.
[ant:jacocoReport] Execution data for class org/apache/tapestry5/corelib/components/AjaxFormLoop$6
does not match.
[ant:jacocoReport] Execution data for class org/apache/tapestry5/corelib/components/AjaxFormLoop$7
does not match.
[ant:jacocoReport] Execution data for class org/apache/tapestry5/corelib/components/AjaxFormLoop$8
does not match.
[ant:jacocoReport] Execution data for class org/apache/tapestry5/corelib/components/AjaxFormLoop$9
does not match.
[ant:jacocoReport] Execution data for class org/apache/tapestry5/corelib/components/AjaxFormLoop$1
does not match.
[ant:jacocoReport] Execution data for class org/apache/tapestry5/corelib/components/AjaxFormLoop$3
does not match.
[ant:jacocoReport] Execution data for class org/apache/tapestry5/corelib/components/AjaxFormLoop$2
does not match.
[ant:jacocoReport] Execution data for class org/apache/tapestry5/corelib/components/AjaxFormLoop$5
does not match.
[ant:jacocoReport] Execution data for class org/apache/tapestry5/corelib/components/AjaxFormLoop$4
does not match.
[ant:jacocoReport] Execution data for class org/apache/tapestry5/corelib/mixins/ZoneRefresh
does not match.
[ant:jacocoReport] Execution data for class org/apache/tapestry5/kaptcha/components/KaptchaField
does not match.
[ant:jacocoReport] Execution data for class org/apache/tapestry5/corelib/components/SubmitNotifier
does not match.
[ant:jacocoReport] Execution data for class org/apache/tapestry5/corelib/pages/PropertyDisplayBlocks
does not match.
[ant:jacocoReport] Execution data for class org/apache/tapestry5/corelib/components/Grid$DefaultGridSortModel
does not match.
[ant:jacocoReport] Execution data for class org/apache/tapestry5/corelib/components/Trigger
does not match.
[ant:jacocoReport] Execution data for class org/apache/tapestry5/corelib/mixins/RenderNotification
does not match.
[ant:jacocoReport] Execution data for class org/apache/tapestry5/corelib/base/AbstractConditional
does not match.
[ant:jacocoReport] Execution data for class org/apache/tapestry5/corelib/components/Glyphicon
does not match.
[ant:jacocoReport] Execution data for class org/apache/tapestry5/corelib/components/Hidden$ProcessSubmission
does not match.
[ant:jacocoReport] Execution data for class org/apache/tapestry5/corelib/components/GridCell
does not match.
[ant:jacocoReport] Execution data for class org/apache/tapestry5/corelib/components/PropertyEditor$SetupEnvironment
does not match.
[ant:jacocoReport] Execution data for class org/apache/tapestry5/corelib/components/TextArea
does not match.
[ant:jacocoReport] Execution data for class org/apache/tapestry5/corelib/mixins/TriggerFragment
does not match.
[ant:jacocoReport] Execution data for class org/apache/tapestry5/corelib/components/Loop$RestoreState
does not match.
[ant:jacocoReport] Execution data for class org/apache/tapestry5/corelib/components/LinkSubmit$ProcessSubmission
does not match.
[ant:jacocoReport] Execution data for class org/apache/tapestry5/corelib/components/ExceptionDisplay
does not match.
[ant:jacocoReport] Execution data for class org/apache/tapestry5/corelib/components/GridColumns$1
does not match.
[ant:jacocoReport] Execution data for class org/apache/tapestry5/corelib/components/Error
does not match.
[ant:jacocoReport] Execution data for class org/apache/tapestry5/corelib/components/RemoveRowLink
does not match.
[ant:jacocoReport] Execution data for class org/apache/tapestry5/corelib/mixins/OverrideFieldFocus
does not match.
[ant:jacocoReport] Execution data for class org/apache/tapestry5/corelib/components/If does
not match.
[ant:jacocoReport] Execution data for class org/apache/tapestry5/corelib/components/Checkbox
does not match.
[ant:jacocoReport] Execution data for class org/apache/tapestry5/corelib/components/RadioGroup$1
does not match.
[ant:jacocoReport] Execution data for class org/apache/tapestry5/corelib/components/RadioGroup$2
does not match.
[ant:jacocoReport] Execution data for class org/apache/tapestry5/corelib/components/PasswordField
does not match.
[ant:jacocoReport] Execution data for class org/apache/tapestry5/corelib/components/Errors
does not match.
[ant:jacocoReport] Execution data for class org/apache/tapestry5/corelib/components/RadioGroup$Setup
does not match.
[ant:jacocoReport] Execution data for class org/apache/tapestry5/corelib/mixins/RenderDisabled
does not match.
[ant:jacocoReport] Execution data for class org/apache/tapestry5/corelib/components/Checklist$RenderCheckbox
does not match.
[ant:jacocoReport] Execution data for class org/apache/tapestry5/corelib/components/Checklist
does not match.
[ant:jacocoReport] Execution data for class org/apache/tapestry5/corelib/components/SubmitNotifier$TriggerEvent
does not match.
[ant:jacocoReport] Execution data for class org/apache/tapestry5/corelib/components/DevTool
does not match.
[ant:jacocoReport] Execution data for class org/apache/tapestry5/corelib/base/AbstractComponentEventLink
does not match.
[ant:jacocoReport] Execution data for class org/apache/tapestry5/corelib/components/LinkSubmit$1
does not match.
[ant:jacocoReport] Execution data for class org/apache/tapestry5/corelib/components/LinkSubmit
does not match.
[ant:jacocoReport] Execution data for class org/apache/tapestry5/corelib/components/Grid does
not match.
[ant:jacocoReport] Execution data for class org/apache/tapestry5/corelib/components/LocalDate
does not match.
[ant:jacocoReport] Execution data for class org/apache/tapestry5/corelib/components/TextField
does not match.
[ant:jacocoReport] Execution data for class org/apache/tapestry5/corelib/mixins/Autocomplete
does not match.
[ant:jacocoReport] Execution data for class org/apache/tapestry5/corelib/components/ProgressiveDisplay
does not match.
[ant:jacocoReport] Execution data for class org/apache/tapestry5/corelib/mixins/RenderClientId
does not match.
[ant:jacocoReport] Execution data for class org/apache/tapestry5/corelib/components/RadioGroup
does not match.
[ant:jacocoReport] Execution data for class org/apache/tapestry5/corelib/components/Tree$RenderNodes
does not match.
[ant:jacocoReport] Execution data for class org/apache/tapestry5/corelib/components/GridColumns
does not match.
[ant:jacocoReport] Execution data for class org/apache/tapestry5/kaptcha/components/KaptchaImage$1
does not match.
[ant:jacocoReport] Execution data for class org/apache/tapestry5/corelib/components/AddRowLink
does not match.
[ant:jacocoReport] Execution data for class org/apache/tapestry5/corelib/components/Palette
does not match.
[ant:jacocoReport] Execution data for class org/apache/tapestry5/corelib/components/Dynamic$1
does not match.
[ant:jacocoReport] Execution data for class org/apache/tapestry5/corelib/components/BeanEditForm
does not match.
[ant:jacocoReport] Execution data for class org/apache/tapestry5/corelib/mixins/RenderInformals
does not match.
[ant:jacocoReport] Execution data for class org/apache/tapestry5/corelib/pages/PropertyDisplayBlocks$1
does not match.
[ant:jacocoReport] Execution data for class org/apache/tapestry5/corelib/components/Palette$1
does not match.
[ant:jacocoReport] Execution data for class org/apache/tapestry5/corelib/components/Unless
does not match.
[ant:jacocoReport] Execution data for class org/apache/tapestry5/corelib/components/Dynamic
does not match.
[ant:jacocoReport] Execution data for class org/apache/tapestry5/corelib/components/GridRows$1
does not match.
[ant:jacocoReport] Execution data for class org/apache/tapestry5/corelib/components/GridRows
does not match.
[ant:jacocoReport] Execution data for class org/apache/tapestry5/corelib/pages/ExceptionReport$ActionLink
does not match.
[ant:jacocoReport] Execution data for class org/apache/tapestry5/corelib/base/AbstractField$Setup
does not match.
[ant:jacocoReport] Execution data for class org/apache/tapestry5/corelib/components/Zone does
not match.
[ant:jacocoReport] Execution data for class org/apache/tapestry5/corelib/components/Checklist$1
does not match.
[ant:jacocoReport] Execution data for class org/apache/tapestry5/corelib/components/Zone$1
does not match.
[ant:jacocoReport] Execution data for class org/apache/tapestry5/corelib/mixins/Confirm does
not match.
[ant:jacocoReport] Execution data for class org/apache/tapestry5/corelib/components/DateField
does not match.
[ant:jacocoReport] Execution data for class org/apache/tapestry5/corelib/components/Tree$4$2
does not match.
[ant:jacocoReport] Execution data for class org/apache/tapestry5/corelib/components/Tree$4$1
does not match.
[ant:jacocoReport] Execution data for class org/apache/tapestry5/corelib/base/AbstractInternalPage
does not match.
:beanmodel:sourcesJar
:beanmodel:assemble
:beanmodel:check UP-TO-DATE
:beanmodel:build
:commons:sourcesJar
:commons:assemble
:commons:check UP-TO-DATE
:commons:build
:plastic:sourcesJar
:plastic:assemble
:plastic:check
:plastic:build
:quickstart:compileJava UP-TO-DATE
:quickstart:compileGroovy UP-TO-DATE
:quickstart:processFiltered
:quickstart:processResources
:quickstart:classes
:quickstart:jar
:quickstart:sourcesJar
:quickstart:assemble
:quickstart:compileTestJava UP-TO-DATE
:quickstart:compileTestGroovy UP-TO-DATE
:quickstart:processTestResources UP-TO-DATE
:quickstart:testClasses UP-TO-DATE
:quickstart:test UP-TO-DATE
:quickstart:check UP-TO-DATE
:quickstart:build
:tapestry-beanvalidator:jar
:tapestry-beanvalidator:sourcesJar
:tapestry-beanvalidator:assemble
:tapestry-beanvalidator:check
:tapestry-beanvalidator:build
:tapestry-clojure:jar
:tapestry-clojure:sourcesJar
:tapestry-clojure:assemble
:tapestry-clojure:check
:tapestry-clojure:build
:tapestry-core:sourcesJar
:tapestry-core:assemble
:tapestry-core:check
:tapestry-core:build
:tapestry-core:testWithPrototype
100 tests executed
200 tests executed
300 tests executed
400 tests executed
500 tests executed
600 tests executed
700 tests executed
800 tests executed
900 tests executed
1000 tests executed
1100 tests executed

org.apache.tapestry5.integration.app1.BypassActivationTests.testStartup FAILED
    java.net.BindException: Selenium is already running on port 4444. Or some other service
is.
1200 tests executed
1300 tests executed
1400 tests executed

org.apache.tapestry5.integration.app3.AdditionalIntegrationTests.testStartup FAILED
    MultiException[java.net.BindException: Address already in use, java.net.BindException:
Address already in use]
1500 tests executed

org.apache.tapestry5.integration.reload.ReloadTests.testStartup FAILED
    MultiException[java.net.BindException: Address already in use, java.net.BindException:
Address already in use]

org.apache.tapestry5.integration.linktrans.LinkTransformerIntegrationTest.testStartup FAILED
    MultiException[java.net.BindException: Address already in use, java.net.BindException:
Address already in use]

org.apache.tapestry5.integration.app5.SkinningTests.testStartup FAILED
    MultiException[java.net.BindException: Address already in use, java.net.BindException:
Address already in use]

org.apache.tapestry5.integration.symbolparam.GridSymbolDemoTests.testStartup FAILED
    MultiException[java.net.BindException: Address already in use, java.net.BindException:
Address already in use]

org.apache.tapestry5.integration.appfolder.AppFolderTests.testStartup FAILED
    MultiException[java.net.BindException: Address already in use, java.net.BindException:
Address already in use]

org.apache.tapestry5.integration.activationctx.ActivationContextIntegrationTests.testStartup
FAILED
    MultiException[java.net.BindException: Address already in use, java.net.BindException:
Address already in use]

org.apache.tapestry5.integration.activationctx2.ActivationContextIntegrationTests2.testStartup
FAILED
    MultiException[java.net.BindException: Address already in use, java.net.BindException:
Address already in use]

1542 tests completed, 9 failed, 350 skipped
:tapestry-core:testWithPrototype FAILED

FAILURE: Build failed with an exception.

* What went wrong:
Execution failed for task ':tapestry-core:testWithPrototype'.
> There were failing tests. See the report at: file:///x1/jenkins/jenkins-slave/workspace/tapestry-trunk-freestyle/tapestry-core/build/reports/tests/index.html

* Try:
Run with --stacktrace option to get the stack trace. Run with --info or --debug option to
get more log output.

BUILD FAILED

Total time: 35 mins 55.06 secs
Build step 'Execute shell' marked build as failure
Recording test results
TestNG Reports Processing: START
Looking for TestNG results report in workspace using pattern: **/build/reports/tests/testng-results.xml
Did not find any matching files.
Updating TAP5-2238

---------------------------------------------------------------------
To unsubscribe, e-mail: dev-unsubscribe@tapestry.apache.org
For additional commands, e-mail: dev-help@tapestry.apache.org


Mime
View raw message