tapestry-dev mailing list archives

Site index · List index
Message view « Date » · « Thread »
Top « Date » · « Thread »
From Apache Jenkins Server <jenk...@builds.apache.org>
Subject Build failed in Jenkins: tapestry-trunk-freestyle #1550
Date Mon, 11 Jan 2016 10:30:01 GMT
See <https://builds.apache.org/job/tapestry-trunk-freestyle/1550/changes>

Changes:

[jochen.kemnade] TAP5-2526: detect more concurrent modifications

[jochen.kemnade] TAP5-2520, TAP5-2526: synchronize access to the cache because

------------------------------------------
Started by an SCM change
[EnvInject] - Loading node environment variables.
Building remotely on ubuntu3 (Ubuntu ubuntu legacy-ubuntu) in workspace <https://builds.apache.org/job/tapestry-trunk-freestyle/ws/>
 > git rev-parse --is-inside-work-tree # timeout=10
Fetching changes from the remote Git repository
 > git config remote.origin.url https://git-wip-us.apache.org/repos/asf/tapestry-5.git
# timeout=10
Fetching upstream changes from https://git-wip-us.apache.org/repos/asf/tapestry-5.git
 > git --version # timeout=10
 > git -c core.askpass=true fetch --tags --progress https://git-wip-us.apache.org/repos/asf/tapestry-5.git
+refs/heads/*:refs/remotes/origin/*
 > git rev-parse refs/remotes/origin/master^{commit} # timeout=10
 > git rev-parse refs/remotes/origin/origin/master^{commit} # timeout=10
Checking out Revision e2a092b6c56f1f12accff5d5f3df37dd53259798 (refs/remotes/origin/master)
 > git config core.sparsecheckout # timeout=10
 > git checkout -f e2a092b6c56f1f12accff5d5f3df37dd53259798
 > git rev-list 69d92296ba8647116ad767a629b3d32e4cc88b62 # timeout=10
[tapestry-trunk-freestyle] $ /bin/bash -xe /tmp/hudson1276933180716216702.sh
+ Xvfb :6 -ac -screen 0 1024x768x8
[tapestry-trunk-freestyle] $ /bin/bash -xe /tmp/hudson2747617950544500248.sh
+ DISPLAY=:6.0
+ bash <https://builds.apache.org/job/tapestry-trunk-freestyle/ws/gradlew> -Dci=true
-Dfile.encoding=UTF-8 -b <https://builds.apache.org/job/tapestry-trunk-freestyle/ws/build.gradle>
clean continuousIntegration
To honour the JVM settings for this build a new JVM will be forked. Please consider using
the daemon: https://docs.gradle.org/2.10/userguide/gradle_daemon.html.
:buildSrc:compileJava UP-TO-DATE
:buildSrc:compileGroovy UP-TO-DATE
:buildSrc:processResources UP-TO-DATE
:buildSrc:classes UP-TO-DATE
:buildSrc:jar UP-TO-DATE
:buildSrc:assemble UP-TO-DATE
:buildSrc:compileTestJava UP-TO-DATE
:buildSrc:compileTestGroovy UP-TO-DATE
:buildSrc:processTestResources UP-TO-DATE
:buildSrc:testClasses UP-TO-DATE
:buildSrc:test UP-TO-DATE
:buildSrc:check UP-TO-DATE
:buildSrc:build UP-TO-DATE
The 'sonar' plugin has been deprecated and is scheduled to be removed in Gradle 3.0. please
use the official plugin from SonarQube (http://docs.sonarqube.org/display/SONAR/Analyzing+with+Gradle).
:clean
:beanmodel:clean
:commons:clean
:plastic:clean
:quickstart:clean
:tapestry-beanvalidator:clean
:tapestry-clojure:clean
:tapestry-core:clean
:tapestry-func:clean
:tapestry-hibernate:clean
:tapestry-hibernate-core:clean
:tapestry-internal-test:clean
:tapestry-ioc:clean
:tapestry-ioc-jcache:clean
:tapestry-ioc-junit:clean
:tapestry-javadoc:clean
:tapestry-jmx:clean
:tapestry-jpa:clean
:tapestry-json:clean
:tapestry-kaptcha:clean
:tapestry-mongodb:clean
:tapestry-runner:clean
:tapestry-spring:clean
:tapestry-test:clean
:tapestry-test-constants:clean
:tapestry-test-data:clean
:tapestry-upload:clean
:tapestry-webresources:clean
:tapestry5-annotations:clean
:beanmodel:generateGrammarSource
:plastic:compileJavaNote: Some input files use or override a deprecated API.
Note: Recompile with -Xlint:deprecation for details.
Note: Some input files use unchecked or unsafe operations.
Note: Recompile with -Xlint:unchecked for details.

:plastic:compileGroovy UP-TO-DATE
:plastic:processResources UP-TO-DATE
:plastic:classes
:plastic:jar
:tapestry-func:compileJava
:tapestry-func:compileGroovy UP-TO-DATE
:tapestry-func:processResources UP-TO-DATE
:tapestry-func:classes
:tapestry-func:jar
:tapestry5-annotations:compileJava
:tapestry5-annotations:compileGroovy UP-TO-DATE
:tapestry5-annotations:processResources UP-TO-DATE
:tapestry5-annotations:classes
:tapestry5-annotations:jar
:commons:compileJavaNote: /x1/jenkins/jenkins-slave/workspace/tapestry-trunk-freestyle/commons/src/main/java/org/apache/tapestry5/internal/services/DefaultDataTypeAnalyzer.java
uses or overrides a deprecated API.
Note: Recompile with -Xlint:deprecation for details.
Note: Some input files use unchecked or unsafe operations.
Note: Recompile with -Xlint:unchecked for details.

:commons:compileGroovy UP-TO-DATE
:commons:processResources UP-TO-DATE
:commons:classes
:commons:jar
:beanmodel:compileJavaNote: /x1/jenkins/jenkins-slave/workspace/tapestry-trunk-freestyle/beanmodel/src/main/java/org/apache/tapestry5/internal/services/BeanModelSourceImpl.java
uses or overrides a deprecated API.
Note: Recompile with -Xlint:deprecation for details.
Note: Some input files use unchecked or unsafe operations.
Note: Recompile with -Xlint:unchecked for details.

:beanmodel:compileGroovy UP-TO-DATE
:beanmodel:processResources UP-TO-DATE
:beanmodel:classes
:beanmodel:jar
:tapestry-core:compileCoffeeScript
:tapestry-test-constants:compileJava
:tapestry-test-constants:compileGroovy UP-TO-DATE
:tapestry-test-constants:processResources UP-TO-DATE
:tapestry-test-constants:classes
:tapestry-test-constants:jar
:tapestry-runner:compileJavaNote: /x1/jenkins/jenkins-slave/workspace/tapestry-trunk-freestyle/tapestry-runner/src/main/java/org/apache/tapestry5/test/Jetty7Runner.java
uses or overrides a deprecated API.
Note: Recompile with -Xlint:deprecation for details.

:tapestry-runner:compileGroovy UP-TO-DATE
:tapestry-runner:processResources UP-TO-DATE
:tapestry-runner:classes
:tapestry-runner:jar
:tapestry-test-data:compileJava
:tapestry-test-data:compileGroovy UP-TO-DATE
:tapestry-test-data:processResources
:tapestry-test-data:classes
:tapestry-test-data:jar
:tapestry-test:compileJavaNote: Some input files use or override a deprecated API.
Note: Recompile with -Xlint:deprecation for details.

:tapestry-test:compileGroovy UP-TO-DATE
:tapestry-test:processResources UP-TO-DATE
:tapestry-test:classes
:tapestry-test:jar
:tapestry-ioc:compileJavaNote: Some input files use or override a deprecated API.
Note: Recompile with -Xlint:deprecation for details.
Note: Some input files use unchecked or unsafe operations.
Note: Recompile with -Xlint:unchecked for details.

:tapestry-ioc:compileGroovy UP-TO-DATE
:tapestry-ioc:processResources
:tapestry-ioc:classes
:tapestry-ioc:jar
:tapestry-json:compileJava
:tapestry-json:compileGroovy UP-TO-DATE
:tapestry-json:processResources UP-TO-DATE
:tapestry-json:classes
:tapestry-json:jar
:tapestry-core:compileJava/x1/jenkins/jenkins-slave/workspace/tapestry-trunk-freestyle/tapestry-core/src/main/java/org/apache/tapestry5/internal/services/assets/JavaScriptStackAssemblerImpl.java:55:
incompatible types
found   : java.util.Map<java.lang.String,java.lang.Object>
required: java.util.Map<java.lang.String,org.apache.tapestry5.services.assets.StreamableResource>
    private final Map<String, StreamableResource> cache = Collections.synchronizedMap(CollectionFactory.newCaseInsensitiveMap());
                                                                                     ^
Note: Some input files use or override a deprecated API.
Note: Recompile with -Xlint:deprecation for details.
Note: Some input files use unchecked or unsafe operations.
Note: Recompile with -Xlint:unchecked for details.
1 error
 FAILED

FAILURE: Build failed with an exception.

* What went wrong:
Execution failed for task ':tapestry-core:compileJava'.
> Compilation failed; see the compiler error output for details.

* Try:
Run with --stacktrace option to get the stack trace. Run with --info or --debug option to
get more log output.

BUILD FAILED

Total time: 30.187 secs
Build step 'Execute shell' marked build as failure
Recording test results
ERROR: Publisher 'Publish JUnit test result report' failed: No test report files were found.
Configuration error?
TestNG Reports Processing: START
Looking for TestNG results report in workspace using pattern: **/build/reports/tests/testng-results.xml
Did not find any matching files.
Updating TAP5-2526
Updating TAP5-2520

---------------------------------------------------------------------
To unsubscribe, e-mail: dev-unsubscribe@tapestry.apache.org
For additional commands, e-mail: dev-help@tapestry.apache.org


Mime
View raw message