tapestry-dev mailing list archives

Site index · List index
Message view « Date » · « Thread »
Top « Date » · « Thread »
From Jochen Kemnade <jochen.kemn...@eddyson.de>
Subject Re: Build failed in Jenkins: tapestry-trunk-freestyle #1574
Date Tue, 19 Apr 2016 13:45:56 GMT
We should really untie the build from the ubuntu3 node.
Thiago, can you please have a look or grant me access to Jenkins?
https://wiki.apache.org/general/Jenkins#How_do_I_get_an_account

Jochen

----- On Apr 19, 2016, at 3:30 PM, Apache Jenkins Server jenkins@builds.apache.org wrote:

> See <https://builds.apache.org/job/tapestry-trunk-freestyle/1574/changes>
> 
> Changes:
> 
> [jkemnade] remove obsolete dependency
> 
> [jkemnade] upgrade closure compiler
> 
> ------------------------------------------
> Started by an SCM change
> [EnvInject] - Loading node environment variables.
> Building remotely on ubuntu3 (Ubuntu ubuntu legacy-ubuntu) in workspace
> <https://builds.apache.org/job/tapestry-trunk-freestyle/ws/>
> > git rev-parse --is-inside-work-tree # timeout=10
> Fetching changes from the remote Git repository
> > git config remote.origin.url
> > https://git-wip-us.apache.org/repos/asf/tapestry-5.git # timeout=10
> Fetching upstream changes from
> https://git-wip-us.apache.org/repos/asf/tapestry-5.git
> > git --version # timeout=10
> > git -c core.askpass=true fetch --tags --progress
> > https://git-wip-us.apache.org/repos/asf/tapestry-5.git
> > +refs/heads/*:refs/remotes/origin/*
> > git rev-parse refs/remotes/origin/master^{commit} # timeout=10
> > git rev-parse refs/remotes/origin/origin/master^{commit} # timeout=10
> Checking out Revision bdea53ea9fe0eb6cc552e06613f4a9c2afb9ad41
> (refs/remotes/origin/master)
> > git config core.sparsecheckout # timeout=10
> > git checkout -f bdea53ea9fe0eb6cc552e06613f4a9c2afb9ad41
> > git rev-list d241e49023dd0516d30417a670e04886fc10dd6c # timeout=10
> [tapestry-trunk-freestyle] $ /bin/bash -xe /tmp/hudson7773927947923136247.sh
> + Xvfb :6 -ac -screen 0 1024x768x8
> [dix] Could not init font path element /usr/share/fonts/X11/cyrillic, removing
> from list!
> [dix] Could not init font path element /usr/share/fonts/X11/100dpi/:unscaled,
> removing from list!
> [dix] Could not init font path element /usr/share/fonts/X11/75dpi/:unscaled,
> removing from list!
> [dix] Could not init font path element /usr/share/fonts/X11/100dpi, removing
> from list!
> [dix] Could not init font path element /usr/share/fonts/X11/75dpi, removing from
> list!
> [dix] Could not init font path element
> /var/lib/defoma/x-ttcidfont-conf.d/dirs/TrueType, removing from list!
> [tapestry-trunk-freestyle] $ /bin/bash -xe /tmp/hudson7050658748946795679.sh
> + DISPLAY=:6.0
> + bash <https://builds.apache.org/job/tapestry-trunk-freestyle/ws/gradlew>
> -Dci=true -Dfile.encoding=UTF-8 -b
> <https://builds.apache.org/job/tapestry-trunk-freestyle/ws/build.gradle> clean
> continuousIntegration
> To honour the JVM settings for this build a new JVM will be forked. Please
> consider using the daemon:
> https://docs.gradle.org/2.12/userguide/gradle_daemon.html.
> :buildSrc:compileJava UP-TO-DATE
> :buildSrc:compileGroovy UP-TO-DATE
> :buildSrc:processResources UP-TO-DATE
> :buildSrc:classes UP-TO-DATE
> :buildSrc:jar UP-TO-DATE
> :buildSrc:assemble UP-TO-DATE
> :buildSrc:compileTestJava UP-TO-DATE
> :buildSrc:compileTestGroovy UP-TO-DATE
> :buildSrc:processTestResources UP-TO-DATE
> :buildSrc:testClasses UP-TO-DATE
> :buildSrc:test UP-TO-DATE
> :buildSrc:check UP-TO-DATE
> :buildSrc:build UP-TO-DATE
> The 'sonar' plugin has been deprecated and is scheduled to be removed in Gradle
> 3.0. please use the official plugin from SonarQube
> (http://docs.sonarqube.org/display/SONAR/Analyzing+with+Gradle).
> :clean UP-TO-DATE
> :beanmodel:clean
> :commons:clean UP-TO-DATE
> :plastic:clean
> :quickstart:clean
> :tapestry-beanvalidator:clean
> :tapestry-clojure:clean
> :tapestry-core:clean
> :tapestry-func:clean
> :tapestry-hibernate:clean
> :tapestry-hibernate-core:clean
> :tapestry-internal-test:clean
> :tapestry-ioc:clean
> :tapestry-ioc-jcache:clean
> :tapestry-ioc-junit:clean
> :tapestry-javadoc:clean
> :tapestry-jmx:clean
> :tapestry-jpa:clean
> :tapestry-json:clean
> :tapestry-kaptcha:clean
> :tapestry-mongodb:clean
> :tapestry-runner:clean
> :tapestry-spring:clean
> :tapestry-test:clean
> :tapestry-test-constants:clean
> :tapestry-test-data:clean
> :tapestry-upload:clean
> :tapestry-webresources:clean
> :tapestry5-annotations:clean
> :beanmodel:generateGrammarSource
> :plastic:compileJava FAILED
> 
> FAILURE: Build failed with an exception.
> 
> * What went wrong:
> Execution failed for task ':plastic:compileJava'.
>> invalid source release: 1.8
> 
> * Try:
> Run with --stacktrace option to get the stack trace. Run with --info or --debug
> option to get more log output.
> 
> BUILD FAILED
> 
> Total time: 21.219 secs
> Build step 'Execute shell' marked build as failure
> Recording test results
> ERROR: Step ?Publish JUnit test result report? failed: No test report files were
> found. Configuration error?
> TestNG Reports Processing: START
> Looking for TestNG results report in workspace using pattern:
> **/build/reports/tests/testng-results.xml
> Did not find any matching files.
> 
> ---------------------------------------------------------------------
> To unsubscribe, e-mail: dev-unsubscribe@tapestry.apache.org
> For additional commands, e-mail: dev-help@tapestry.apache.org

---------------------------------------------------------------------
To unsubscribe, e-mail: dev-unsubscribe@tapestry.apache.org
For additional commands, e-mail: dev-help@tapestry.apache.org


Mime
View raw message