tapestry-dev mailing list archives

Site index · List index
Message view « Date » · « Thread »
Top « Date » · « Thread »
From Apache Jenkins Server <jenk...@builds.apache.org>
Subject Build failed in Jenkins: tapestry-trunk-freestyle #1640
Date Tue, 10 Oct 2017 07:25:38 GMT
See <https://builds.apache.org/job/tapestry-trunk-freestyle/1640/display/redirect?page=changes>

Changes:

[jochen.kemnade] update source levels

[jochen.kemnade] upgrade Gradle wrapper

------------------------------------------
Started by an SCM change
[EnvInject] - Loading node environment variables.
Building remotely on qnode3 (ubuntu xenial) in workspace <https://builds.apache.org/job/tapestry-trunk-freestyle/ws/>
 > git rev-parse --is-inside-work-tree # timeout=10
Fetching changes from the remote Git repository
 > git config remote.origin.url https://git-wip-us.apache.org/repos/asf/tapestry-5.git
# timeout=10
Fetching upstream changes from https://git-wip-us.apache.org/repos/asf/tapestry-5.git
 > git --version # timeout=10
 > git fetch --tags --progress https://git-wip-us.apache.org/repos/asf/tapestry-5.git +refs/heads/*:refs/remotes/origin/*
 > git rev-parse refs/remotes/origin/master^{commit} # timeout=10
 > git rev-parse refs/remotes/origin/origin/master^{commit} # timeout=10
Checking out Revision d528181bb55d0e9322f1a632a12e773306b7ecbe (refs/remotes/origin/master)
Commit message: "upgrade Gradle wrapper"
 > git config core.sparsecheckout # timeout=10
 > git checkout -f d528181bb55d0e9322f1a632a12e773306b7ecbe
 > git rev-list 7d2c4da4070ae94fdc5106c997ef31c4ca020efe # timeout=10
[tapestry-trunk-freestyle] $ /bin/bash -xe /tmp/jenkins1869964897066809080.sh
+ Xvfb :6 -ac -screen 0 1024x768x8
Process leaked file descriptors. See https://jenkins.io/redirect/troubleshooting/process-leaked-file-descriptors
for more information
[tapestry-trunk-freestyle] $ /bin/bash -xe /tmp/jenkins4301723745842632847.sh
+ DISPLAY=:6.0
+ bash <https://builds.apache.org/job/tapestry-trunk-freestyle/ws/gradlew> -Dci=true
-Dfile.encoding=UTF-8 -b <https://builds.apache.org/job/tapestry-trunk-freestyle/ws/build.gradle>
clean continuousIntegration
Generating JAR file 'gradle-api-4.2.jar'

FAILURE: Build failed with an exception.

* What went wrong:
java.io.IOException: No space left on device
> No space left on device

* Try:
Run with --stacktrace option to get the stack trace. Run with --info or --debug option to
get more log output.

* Get more help at https://help.gradle.org

BUILD FAILED in 10s
Build step 'Execute shell' marked build as failure
Recording test results
ERROR: Step ‘Publish JUnit test result report’ failed: No test report files were found.
Configuration error?
TestNG Reports Processing: START
Looking for TestNG results report in workspace using pattern: **/build/reports/tests/testng-results.xml
Did not find any matching files.
Not sending mail to unregistered user jochen.kemnade@eddyson.de

---------------------------------------------------------------------
To unsubscribe, e-mail: dev-unsubscribe@tapestry.apache.org
For additional commands, e-mail: dev-help@tapestry.apache.org


Mime
View raw message