tez-dev mailing list archives

Site index · List index
Message view « Date » · « Thread »
Top « Date » · « Thread »
From Apache Jenkins Server <jenk...@builds.apache.org>
Subject Build failed in Jenkins: Tez-Build #58
Date Sat, 22 Jun 2013 00:13:18 GMT
See <https://builds.apache.org/job/Tez-Build/58/changes>

Changes:

[hitesh] TEZ-183. Fix Vertex/Task/TaskAttempt toString to use better formatting. (hitesh)

[mliddell] TEZ-196: change TezConfiguration names from DAG* to TEZ*

------------------------------------------
[...truncated 7454 lines...]
[INFO] Installing <https://builds.apache.org/job/Tez-Build/ws/tez-mapreduce-examples/target/tez-mapreduce-examples-0.2.0-SNAPSHOT.jar>
to /home/jenkins/.m2/repository/org/apache/tez/tez-mapreduce-examples/0.2.0-SNAPSHOT/tez-mapreduce-examples-0.2.0-SNAPSHOT.jar
[INFO] Installing <https://builds.apache.org/job/Tez-Build/ws/tez-mapreduce-examples/pom.xml>
to /home/jenkins/.m2/repository/org/apache/tez/tez-mapreduce-examples/0.2.0-SNAPSHOT/tez-mapreduce-examples-0.2.0-SNAPSHOT.pom
[INFO] Installing <https://builds.apache.org/job/Tez-Build/ws/tez-mapreduce-examples/target/tez-mapreduce-examples-0.2.0-SNAPSHOT-tests.jar>
to /home/jenkins/.m2/repository/org/apache/tez/tez-mapreduce-examples/0.2.0-SNAPSHOT/tez-mapreduce-examples-0.2.0-SNAPSHOT-tests.jar
[INFO] 
[INFO] --- maven-deploy-plugin:2.7:deploy (default-deploy) @ tez-mapreduce-examples ---
Downloading: https://repository.apache.org/content/repositories/snapshots/org/apache/tez/tez-mapreduce-examples/0.2.0-SNAPSHOT/maven-metadata.xml
998 B          
        
Downloaded: https://repository.apache.org/content/repositories/snapshots/org/apache/tez/tez-mapreduce-examples/0.2.0-SNAPSHOT/maven-metadata.xml
(998 B at 3.7 KB/sec)
Uploading: https://repository.apache.org/content/repositories/snapshots/org/apache/tez/tez-mapreduce-examples/0.2.0-SNAPSHOT/tez-mapreduce-examples-0.2.0-20130622.001304-10.jar
2/138 KB   
4/138 KB   
6/138 KB   
8/138 KB   
10/138 KB   
12/138 KB   
14/138 KB   
16/138 KB   
18/138 KB   
20/138 KB   
22/138 KB   
24/138 KB   
26/138 KB   
28/138 KB   
30/138 KB   
32/138 KB   
34/138 KB   
36/138 KB   
38/138 KB   
40/138 KB   
42/138 KB   
44/138 KB   
46/138 KB   
48/138 KB   
50/138 KB   
52/138 KB   
54/138 KB   
56/138 KB   
58/138 KB   
60/138 KB   
62/138 KB   
64/138 KB   
66/138 KB   
68/138 KB   
70/138 KB   
72/138 KB   
74/138 KB   
76/138 KB   
78/138 KB   
80/138 KB   
82/138 KB   
84/138 KB   
86/138 KB   
88/138 KB   
90/138 KB   
92/138 KB   
94/138 KB   
96/138 KB   
98/138 KB   
100/138 KB   
102/138 KB   
104/138 KB   
106/138 KB   
108/138 KB   
110/138 KB   
112/138 KB   
114/138 KB   
116/138 KB   
118/138 KB   
120/138 KB   
122/138 KB   
124/138 KB   
126/138 KB   
128/138 KB   
130/138 KB   
132/138 KB   
134/138 KB   
136/138 KB   
138/138 KB   
             
Uploaded: https://repository.apache.org/content/repositories/snapshots/org/apache/tez/tez-mapreduce-examples/0.2.0-SNAPSHOT/tez-mapreduce-examples-0.2.0-20130622.001304-10.jar
(138 KB at 360.1 KB/sec)
Uploading: https://repository.apache.org/content/repositories/snapshots/org/apache/tez/tez-mapreduce-examples/0.2.0-SNAPSHOT/tez-mapreduce-examples-0.2.0-20130622.001304-10.pom
2/4 KB       
4/4 KB   
         
Uploaded: https://repository.apache.org/content/repositories/snapshots/org/apache/tez/tez-mapreduce-examples/0.2.0-SNAPSHOT/tez-mapreduce-examples-0.2.0-20130622.001304-10.pom
(4 KB at 11.2 KB/sec)
Downloading: https://repository.apache.org/content/repositories/snapshots/org/apache/tez/tez-mapreduce-examples/maven-metadata.xml
296 B    
        
Downloaded: https://repository.apache.org/content/repositories/snapshots/org/apache/tez/tez-mapreduce-examples/maven-metadata.xml
(296 B at 1.5 KB/sec)
Uploading: https://repository.apache.org/content/repositories/snapshots/org/apache/tez/tez-mapreduce-examples/0.2.0-SNAPSHOT/maven-metadata.xml
1001/1001 B   
              
Uploaded: https://repository.apache.org/content/repositories/snapshots/org/apache/tez/tez-mapreduce-examples/0.2.0-SNAPSHOT/maven-metadata.xml
(1001 B at 1.3 KB/sec)
Uploading: https://repository.apache.org/content/repositories/snapshots/org/apache/tez/tez-mapreduce-examples/maven-metadata.xml
296/296 B     
            
Uploaded: https://repository.apache.org/content/repositories/snapshots/org/apache/tez/tez-mapreduce-examples/maven-metadata.xml
(296 B at 0.7 KB/sec)
Uploading: https://repository.apache.org/content/repositories/snapshots/org/apache/tez/tez-mapreduce-examples/0.2.0-SNAPSHOT/tez-mapreduce-examples-0.2.0-20130622.001304-10-tests.jar
2/5 KB      
4/5 KB   
5/5 KB   
         
Uploaded: https://repository.apache.org/content/repositories/snapshots/org/apache/tez/tez-mapreduce-examples/0.2.0-SNAPSHOT/tez-mapreduce-examples-0.2.0-20130622.001304-10-tests.jar
(5 KB at 12.6 KB/sec)
Uploading: https://repository.apache.org/content/repositories/snapshots/org/apache/tez/tez-mapreduce-examples/0.2.0-SNAPSHOT/maven-metadata.xml
1002/1002 B   
              
Uploaded: https://repository.apache.org/content/repositories/snapshots/org/apache/tez/tez-mapreduce-examples/0.2.0-SNAPSHOT/maven-metadata.xml
(1002 B at 3.0 KB/sec)
[INFO] 
[INFO] --- maven-resources-plugin:2.5:resources (default-resources) @ tez-mapreduce-examples
---
[debug] execute contextualize
[WARNING] Using platform encoding (ISO-8859-1 actually) to copy filtered resources, i.e. build
is platform dependent!
[INFO] skip non existing resourceDirectory <https://builds.apache.org/job/Tez-Build/ws/tez-mapreduce-examples/src/main/resources>
[INFO] 
[INFO] --- maven-compiler-plugin:2.3.2:compile (default-compile) @ tez-mapreduce-examples
---
[INFO] Nothing to compile - all classes are up to date
[INFO] 
[INFO] --- maven-resources-plugin:2.5:testResources (default-testResources) @ tez-mapreduce-examples
---
[debug] execute contextualize
[WARNING] Using platform encoding (ISO-8859-1 actually) to copy filtered resources, i.e. build
is platform dependent!
[INFO] skip non existing resourceDirectory <https://builds.apache.org/job/Tez-Build/ws/tez-mapreduce-examples/src/test/resources>
[INFO] 
[INFO] --- maven-compiler-plugin:2.3.2:testCompile (default-testCompile) @ tez-mapreduce-examples
---
[INFO] Nothing to compile - all classes are up to date
[INFO] 
[INFO] --- maven-surefire-plugin:2.14.1:test (default-test) @ tez-mapreduce-examples ---
[INFO] Skipping execution of surefire because it has already been run for this configuration
[INFO] 
[INFO] --- maven-jar-plugin:2.3.1:jar (default-jar) @ tez-mapreduce-examples ---
[INFO] Building jar: <https://builds.apache.org/job/Tez-Build/ws/tez-mapreduce-examples/target/tez-mapreduce-examples-0.2.0-SNAPSHOT.jar>
[INFO] 
[INFO] --- maven-jar-plugin:2.3.1:test-jar (default) @ tez-mapreduce-examples ---
[INFO] Building jar: <https://builds.apache.org/job/Tez-Build/ws/tez-mapreduce-examples/target/tez-mapreduce-examples-0.2.0-SNAPSHOT-tests.jar>
[INFO]                                                                         
[INFO] ------------------------------------------------------------------------
[INFO] Building tez-mapreduce-tests 0.2.0-SNAPSHOT
[INFO] ------------------------------------------------------------------------
[INFO] 
[INFO] --- maven-clean-plugin:2.4.1:clean (default-clean) @ tez-mapreduce-tests ---
[INFO] 
[INFO] --- maven-resources-plugin:2.5:resources (default-resources) @ tez-mapreduce-tests
---
[debug] execute contextualize
[WARNING] Using platform encoding (ISO-8859-1 actually) to copy filtered resources, i.e. build
is platform dependent!
[INFO] skip non existing resourceDirectory <https://builds.apache.org/job/Tez-Build/ws/tez-mapreduce-tests/src/main/resources>
[INFO] 
[INFO] --- maven-compiler-plugin:2.3.2:compile (default-compile) @ tez-mapreduce-tests ---
[INFO] No sources to compile
[INFO] 
[INFO] --- maven-resources-plugin:2.5:testResources (default-testResources) @ tez-mapreduce-tests
---
[debug] execute contextualize
[WARNING] Using platform encoding (ISO-8859-1 actually) to copy filtered resources, i.e. build
is platform dependent!
[INFO] skip non existing resourceDirectory <https://builds.apache.org/job/Tez-Build/ws/tez-mapreduce-tests/src/test/resources>
[INFO] 
[INFO] --- maven-compiler-plugin:2.3.2:testCompile (default-testCompile) @ tez-mapreduce-tests
---
[WARNING] File encoding has not been set, using platform encoding ISO-8859-1, i.e. build is
platform dependent!
[INFO] Compiling 3 source files to <https://builds.apache.org/job/Tez-Build/ws/tez-mapreduce-tests/target/test-classes>
[INFO] 
[INFO] --- maven-surefire-plugin:2.14.1:test (default-test) @ tez-mapreduce-tests ---
[INFO] Surefire report directory: <https://builds.apache.org/job/Tez-Build/ws/tez-mapreduce-tests/target/surefire-reports>

-------------------------------------------------------
 T E S T S
-------------------------------------------------------

-------------------------------------------------------
 T E S T S
-------------------------------------------------------
Running org.apache.tez.mapreduce.TestMRRJobsDAGApi
Tests run: 1, Failures: 0, Errors: 1, Skipped: 0, Time elapsed: 3.788 sec <<< FAILURE!
org.apache.tez.mapreduce.TestMRRJobsDAGApi  Time elapsed: 3.788 sec  <<< ERROR!
org.apache.hadoop.yarn.exceptions.YarnRuntimeException: java.lang.RuntimeException: java.lang.RuntimeException:
java.lang.ClassNotFoundException: Class org.apache.hadoop.yarn.server.resourcemanager.resource.DefaultResourceCalculator
not found
	at org.apache.hadoop.conf.Configuration.getClassByName(Configuration.java:1625)
	at org.apache.hadoop.conf.Configuration.getClass(Configuration.java:1719)
	at org.apache.hadoop.conf.Configuration.getClass(Configuration.java:1745)
	at org.apache.hadoop.yarn.server.resourcemanager.scheduler.capacity.CapacitySchedulerConfiguration.getResourceCalculator(CapacitySchedulerConfiguration.java:333)
	at org.apache.hadoop.yarn.server.resourcemanager.scheduler.capacity.CapacityScheduler.reinitialize(CapacityScheduler.java:257)
	at org.apache.hadoop.yarn.server.resourcemanager.ResourceManager.serviceInit(ResourceManager.java:235)
	at org.apache.hadoop.service.AbstractService.init(AbstractService.java:163)
	at org.apache.hadoop.yarn.server.MiniYARNCluster$ResourceManagerWrapper.serviceStart(MiniYARNCluster.java:201)
	at org.apache.hadoop.service.AbstractService.start(AbstractService.java:193)
	at org.apache.hadoop.service.CompositeService.serviceStart(CompositeService.java:101)
	at org.apache.tez.mapreduce.MiniMRRTezCluster.serviceStart(MiniMRRTezCluster.java:128)
	at org.apache.hadoop.service.AbstractService.start(AbstractService.java:193)
	at org.apache.tez.mapreduce.TestMRRJobsDAGApi.setup(TestMRRJobsDAGApi.java:140)

Running org.apache.tez.mapreduce.TestMRRJobs
Tests run: 1, Failures: 0, Errors: 1, Skipped: 0, Time elapsed: 3.694 sec <<< FAILURE!
org.apache.tez.mapreduce.TestMRRJobs  Time elapsed: 3.693 sec  <<< ERROR!
org.apache.hadoop.yarn.exceptions.YarnRuntimeException: java.lang.RuntimeException: java.lang.RuntimeException:
java.lang.ClassNotFoundException: Class org.apache.hadoop.yarn.server.resourcemanager.resource.DefaultResourceCalculator
not found
	at org.apache.hadoop.conf.Configuration.getClassByName(Configuration.java:1625)
	at org.apache.hadoop.conf.Configuration.getClass(Configuration.java:1719)
	at org.apache.hadoop.conf.Configuration.getClass(Configuration.java:1745)
	at org.apache.hadoop.yarn.server.resourcemanager.scheduler.capacity.CapacitySchedulerConfiguration.getResourceCalculator(CapacitySchedulerConfiguration.java:333)
	at org.apache.hadoop.yarn.server.resourcemanager.scheduler.capacity.CapacityScheduler.reinitialize(CapacityScheduler.java:257)
	at org.apache.hadoop.yarn.server.resourcemanager.ResourceManager.serviceInit(ResourceManager.java:235)
	at org.apache.hadoop.service.AbstractService.init(AbstractService.java:163)
	at org.apache.hadoop.yarn.server.MiniYARNCluster$ResourceManagerWrapper.serviceStart(MiniYARNCluster.java:201)
	at org.apache.hadoop.service.AbstractService.start(AbstractService.java:193)
	at org.apache.hadoop.service.CompositeService.serviceStart(CompositeService.java:101)
	at org.apache.tez.mapreduce.MiniMRRTezCluster.serviceStart(MiniMRRTezCluster.java:128)
	at org.apache.hadoop.service.AbstractService.start(AbstractService.java:193)
	at org.apache.tez.mapreduce.TestMRRJobs.setup(TestMRRJobs.java:105)


Results :

Tests in error: 
  TestMRRJobsDAGApi.setup:140 » YarnRuntime java.lang.RuntimeException: java.lan...
  TestMRRJobs.setup:105 » YarnRuntime java.lang.RuntimeException: java.lang.Runt...

Tests run: 2, Failures: 0, Errors: 2, Skipped: 0

[INFO] ------------------------------------------------------------------------
[INFO] Reactor Summary:
[INFO] 
[INFO] tez ............................................... SUCCESS [3.835s]
[INFO] tez-dag-api ....................................... SUCCESS [23.382s]
[INFO] tez-common ........................................ SUCCESS [5.523s]
[INFO] tez-engine-api .................................... SUCCESS [3.161s]
[INFO] tez-engine ........................................ SUCCESS [6.326s]
[INFO] tez-mapreduce ..................................... SUCCESS [22.572s]
[INFO] tez-yarn-client ................................... SUCCESS [3.750s]
[INFO] tez-dag ........................................... SUCCESS [22.414s]
[INFO] tez-mapreduce-examples ............................ SUCCESS [7.011s]
[INFO] tez-mapreduce-tests ............................... FAILURE [8.870s]
[INFO] tez-dist .......................................... SKIPPED
[INFO] ------------------------------------------------------------------------
[INFO] BUILD FAILURE
[INFO] ------------------------------------------------------------------------
[INFO] Total time: 1:47.177s
[INFO] Finished at: Sat Jun 22 00:13:16 UTC 2013
[INFO] Final Memory: 123M/255M
[INFO] ------------------------------------------------------------------------
[ERROR] Failed to execute goal org.apache.maven.plugins:maven-surefire-plugin:2.14.1:test
(default-test) on project tez-mapreduce-tests: There are test failures.
[ERROR] 
[ERROR] Please refer to <https://builds.apache.org/job/Tez-Build/ws/tez-mapreduce-tests/target/surefire-reports>
for the individual test results.
[ERROR] -> [Help 1]
[ERROR] 
[ERROR] To see the full stack trace of the errors, re-run Maven with the -e switch.
[ERROR] Re-run Maven using the -X switch to enable full debug logging.
[ERROR] 
[ERROR] For more information about the errors and possible solutions, please read the following
articles:
[ERROR] [Help 1] http://cwiki.apache.org/confluence/display/MAVEN/MojoFailureException
[ERROR] 
[ERROR] After correcting the problems, you can resume the build with the command
[ERROR]   mvn <goals> -rf :tez-mapreduce-tests
Build step 'Execute shell' marked build as failure
Archiving artifacts
Recording test results

Mime
View raw message