tez-dev mailing list archives

Site index · List index
Message view « Date » · « Thread »
Top « Date » · « Thread »
From Apache Jenkins Server <jenk...@builds.apache.org>
Subject Build failed in Jenkins: Tez-Build #22
Date Mon, 10 Jun 2013 08:01:28 GMT
See <https://builds.apache.org/job/Tez-Build/22/changes>

Changes:

[bikas] TEZ-158. Fix TezExceptions by separating checked and unchecked exceptions (bikas)

------------------------------------------
Started by an SCM change
Building remotely on hadoop1 in workspace <https://builds.apache.org/job/Tez-Build/ws/>
Checkout:Tez-Build / <https://builds.apache.org/job/Tez-Build/ws/> - hudson.remoting.Channel@617f4391:hadoop1
Using strategy: Default
Last Built Revision: Revision 81f43ef93d1350ad7d4d94e71b722862b19602c2 (origin/master)
Fetching changes from 1 remote Git repository
Fetching upstream changes from https://git-wip-us.apache.org/repos/asf/incubator-tez.git
Commencing build of Revision bd6dd721cd09129a6e95c27caf0fb9987d8c9d42 (origin/master)
Checking out Revision bd6dd721cd09129a6e95c27caf0fb9987d8c9d42 (origin/master)
[Tez-Build] $ /bin/bash -x /tmp/hudson7696678682120658057.sh
+ export JAVA_HOME=/home/hudson/tools/java/latest
+ JAVA_HOME=/home/hudson/tools/java/latest
+ export MAVEN_HOME=/home/hudson/tools/maven/latest
+ MAVEN_HOME=/home/hudson/tools/maven/latest
+ export PATH=/home/hudson/tools/java/latest/bin:/home/hudson/tools/maven/latest/bin:/home/hudson/tools/java/latest1.6/bin:/home/hudson/tools/java/latest1.6/bin:/usr/local/sbin:/usr/local/bin:/usr/sbin:/usr/bin:/sbin:/bin:/usr/games
+ PATH=/home/hudson/tools/java/latest/bin:/home/hudson/tools/maven/latest/bin:/home/hudson/tools/java/latest1.6/bin:/home/hudson/tools/java/latest1.6/bin:/usr/local/sbin:/usr/local/bin:/usr/sbin:/usr/bin:/sbin:/bin:/usr/games
+ env
BUILD_URL=https://builds.apache.org/job/Tez-Build/22/
HUDSON_SERVER_COOKIE=f4ebd1e6b0d976e8
SHELL=/bin/sh
SSH_CLIENT=140.211.11.8 48934 22
BUILD_TAG=jenkins-Tez-Build-22
WORKSPACE=<https://builds.apache.org/job/Tez-Build/ws/>
JOB_URL=https://builds.apache.org/job/Tez-Build/
USER=jenkins
LD_LIBRARY_PATH=/home/jenkins/tools/java/jdk1.6.0_27/jre/lib/i386/server:/home/jenkins/tools/java/jdk1.6.0_27/jre/lib/i386:/home/jenkins/tools/java/jdk1.6.0_27/jre/../lib/i386
NLSPATH=/usr/dt/lib/nls/msg/%L/%N.cat
GIT_COMMIT=bd6dd721cd09129a6e95c27caf0fb9987d8c9d42
JENKINS_HOME=/home/hudson/hudson
MAVEN_HOME=/home/hudson/tools/maven/latest
PATH=/home/hudson/tools/java/latest/bin:/home/hudson/tools/maven/latest/bin:/home/hudson/tools/java/latest1.6/bin:/home/hudson/tools/java/latest1.6/bin:/usr/local/sbin:/usr/local/bin:/usr/sbin:/usr/bin:/sbin:/bin:/usr/games
MAIL=/var/mail/jenkins
PWD=<https://builds.apache.org/job/Tez-Build/ws/>
JAVA_HOME=/home/hudson/tools/java/latest
HUDSON_URL=https://builds.apache.org/
LANG=en_US
JOB_NAME=Tez-Build
XFILESEARCHPATH=/usr/dt/app-defaults/%L/Dt
JENKINS_URL=https://builds.apache.org/
BUILD_ID=2013-06-10_08-01-22
SHLVL=1
HOME=/home/jenkins
GIT_BRANCH=master
JENKINS_SERVER_COOKIE=f4ebd1e6b0d976e8
EXECUTOR_NUMBER=0
NODE_LABELS=Hadoop Hcat Hdfs Pig hadoop1
LOGNAME=jenkins
HUDSON_HOME=/home/hudson/hudson
SSH_CONNECTION=140.211.11.8 48934 67.195.138.24 22
NODE_NAME=hadoop1
BUILD_NUMBER=22
HUDSON_COOKIE=6f991006-2ac3-4894-b946-c165479b2d2a
_=/usr/bin/env
+ export MAVEN_OPTS=-Xmx2048m
+ MAVEN_OPTS=-Xmx2048m
+ /home/hudson/tools/maven/latest/bin/mvn clean package -Pdist -Dmaven.test.failure.ignore=true
-Dtar
[INFO] Scanning for projects...
[INFO] ------------------------------------------------------------------------
[INFO] Reactor Build Order:
[INFO] 
[INFO] tez
[INFO] tez-dag-api
[INFO] tez-common
[INFO] tez-engine-api
[INFO] tez-engine
[INFO] tez-mapreduce
[INFO] tez-yarn-client
[INFO] tez-dag
[INFO] tez-mapreduce-examples
[INFO] tez-mapreduce-tests
[INFO] tez-dist
[INFO]                                                                         
[INFO] ------------------------------------------------------------------------
[INFO] Building tez 0.2.0-SNAPSHOT
[INFO] ------------------------------------------------------------------------
[INFO] 
[INFO] --- maven-clean-plugin:2.4.1:clean (default-clean) @ tez ---
[INFO]                                                                         
[INFO] ------------------------------------------------------------------------
[INFO] Building tez-dag-api 0.2.0-SNAPSHOT
[INFO] ------------------------------------------------------------------------
[WARNING] The POM for org.apache.hadoop:hadoop-maven-plugins:jar:3.0.0-SNAPSHOT is missing,
no dependency information available
[INFO] ------------------------------------------------------------------------
[INFO] Reactor Summary:
[INFO] 
[INFO] tez ............................................... SUCCESS [0.158s]
[INFO] tez-dag-api ....................................... FAILURE [0.010s]
[INFO] tez-common ........................................ SKIPPED
[INFO] tez-engine-api .................................... SKIPPED
[INFO] tez-engine ........................................ SKIPPED
[INFO] tez-mapreduce ..................................... SKIPPED
[INFO] tez-yarn-client ................................... SKIPPED
[INFO] tez-dag ........................................... SKIPPED
[INFO] tez-mapreduce-examples ............................ SKIPPED
[INFO] tez-mapreduce-tests ............................... SKIPPED
[INFO] tez-dist .......................................... SKIPPED
[INFO] ------------------------------------------------------------------------
[INFO] BUILD FAILURE
[INFO] ------------------------------------------------------------------------
[INFO] Total time: 0.457s
[INFO] Finished at: Mon Jun 10 08:01:27 UTC 2013
[INFO] Final Memory: 3M/77M
[INFO] ------------------------------------------------------------------------
[WARNING] The requested profile "dist" could not be activated because it does not exist.
[ERROR] Plugin org.apache.hadoop:hadoop-maven-plugins:3.0.0-SNAPSHOT or one of its dependencies
could not be resolved: Failed to read artifact descriptor for org.apache.hadoop:hadoop-maven-plugins:jar:3.0.0-SNAPSHOT:
Failure to find org.apache.hadoop:hadoop-maven-plugins:pom:3.0.0-SNAPSHOT in https://maven.atlassian.com/repository/public
was cached in the local repository, resolution will not be reattempted until the update interval
of maven2-repository.atlassian has elapsed or updates are forced -> [Help 1]
[ERROR] 
[ERROR] To see the full stack trace of the errors, re-run Maven with the -e switch.
[ERROR] Re-run Maven using the -X switch to enable full debug logging.
[ERROR] 
[ERROR] For more information about the errors and possible solutions, please read the following
articles:
[ERROR] [Help 1] http://cwiki.apache.org/confluence/display/MAVEN/PluginResolutionException
Build step 'Execute shell' marked build as failure
Archiving artifacts
Recording test results

Mime
View raw message