tez-dev mailing list archives

Site index · List index
Message view « Date » · « Thread »
Top « Date » · « Thread »
From Apache Jenkins Server <jenk...@builds.apache.org>
Subject Build failed in Jenkins: Tez-Build #47
Date Tue, 18 Jun 2013 08:01:46 GMT
See <https://builds.apache.org/job/Tez-Build/47/changes>

Changes:

[sseth] Fix build break caused by multiple YARN changes -  YARN-840, YARN-841,

------------------------------------------
Started by an SCM change
Building remotely on hadoop2 in workspace <https://builds.apache.org/job/Tez-Build/ws/>
Checkout:Tez-Build / <https://builds.apache.org/job/Tez-Build/ws/> - hudson.remoting.Channel@4930757e:hadoop2
Using strategy: Default
Last Built Revision: Revision 911e884aeb8a6d3772c1999a5d83fddb83fd7806 (origin/master)
Fetching changes from 1 remote Git repository
Fetching upstream changes from http://git-wip-us.apache.org/repos/asf/incubator-tez.git
Commencing build of Revision c35702d6f9fe8707752189303b9eef0b9e821643 (origin/master)
Checking out Revision c35702d6f9fe8707752189303b9eef0b9e821643 (origin/master)
[Tez-Build] $ /bin/bash -x /tmp/hudson2094689455141884133.sh
+ export JAVA_HOME=/home/hudson/tools/java/latest
+ JAVA_HOME=/home/hudson/tools/java/latest
+ export MAVEN_HOME=/home/hudson/tools/maven/latest
+ MAVEN_HOME=/home/hudson/tools/maven/latest
+ export PATH=/home/hudson/tools/java/latest/bin:/home/hudson/tools/maven/latest/bin:/home/hudson/tools/java/latest1.6/bin:/home/hudson/tools/java/latest1.6/bin:/usr/local/sbin:/usr/local/bin:/usr/sbin:/usr/bin:/sbin:/bin:/usr/games
+ PATH=/home/hudson/tools/java/latest/bin:/home/hudson/tools/maven/latest/bin:/home/hudson/tools/java/latest1.6/bin:/home/hudson/tools/java/latest1.6/bin:/usr/local/sbin:/usr/local/bin:/usr/sbin:/usr/bin:/sbin:/bin:/usr/games
+ env
BUILD_URL=https://builds.apache.org/job/Tez-Build/47/
HUDSON_SERVER_COOKIE=f4ebd1e6b0d976e8
SHELL=/bin/bash
SSH_CLIENT=140.211.11.8 40555 22
BUILD_TAG=jenkins-Tez-Build-47
WORKSPACE=<https://builds.apache.org/job/Tez-Build/ws/>
JOB_URL=https://builds.apache.org/job/Tez-Build/
USER=jenkins
LD_LIBRARY_PATH=/home/jenkins/tools/java/jdk1.6.0_26/jre/lib/i386/server:/home/jenkins/tools/java/jdk1.6.0_26/jre/lib/i386:/home/jenkins/tools/java/jdk1.6.0_26/jre/../lib/i386
NLSPATH=/usr/dt/lib/nls/msg/%L/%N.cat
GIT_COMMIT=c35702d6f9fe8707752189303b9eef0b9e821643
JENKINS_HOME=/home/hudson/hudson
MAVEN_HOME=/home/hudson/tools/maven/latest
PATH=/home/hudson/tools/java/latest/bin:/home/hudson/tools/maven/latest/bin:/home/hudson/tools/java/latest1.6/bin:/home/hudson/tools/java/latest1.6/bin:/usr/local/sbin:/usr/local/bin:/usr/sbin:/usr/bin:/sbin:/bin:/usr/games
MAIL=/var/mail/jenkins
PWD=<https://builds.apache.org/job/Tez-Build/ws/>
JAVA_HOME=/home/hudson/tools/java/latest
HUDSON_URL=https://builds.apache.org/
LANG=en_US
JOB_NAME=Tez-Build
XFILESEARCHPATH=/usr/dt/app-defaults/%L/Dt
JENKINS_URL=https://builds.apache.org/
BUILD_ID=2013-06-18_08-01-25
HOME=/home/jenkins
SHLVL=2
GIT_BRANCH=origin/master
JENKINS_SERVER_COOKIE=f4ebd1e6b0d976e8
EXECUTOR_NUMBER=0
NODE_LABELS=Hadoop Hadoop2 Hdfs Mapreduce Pig hadoop2
LOGNAME=jenkins
HUDSON_HOME=/home/hudson/hudson
SSH_CONNECTION=140.211.11.8 40555 67.195.138.30 22
NODE_NAME=hadoop2
BUILD_NUMBER=47
HUDSON_COOKIE=97be25a4-62cd-4e11-9140-932aa2d1686f
_=/usr/bin/env
+ export MAVEN_OPTS=-Xmx2048m
+ MAVEN_OPTS=-Xmx2048m
+ /home/hudson/tools/maven/latest/bin/mvn clean test deploy package -Dtar
[INFO] Scanning for projects...
[INFO] ------------------------------------------------------------------------
[INFO] Reactor Build Order:
[INFO] 
[INFO] tez
[INFO] tez-dag-api
[INFO] tez-common
[INFO] tez-engine-api
[INFO] tez-engine
[INFO] tez-mapreduce
[INFO] tez-yarn-client
[INFO] tez-dag
[INFO] tez-mapreduce-examples
[INFO] tez-mapreduce-tests
[INFO] tez-dist
[INFO]                                                                         
[INFO] ------------------------------------------------------------------------
[INFO] Building tez 0.2.0-SNAPSHOT
[INFO] ------------------------------------------------------------------------
[INFO] 
[INFO] --- maven-clean-plugin:2.4.1:clean (default-clean) @ tez ---
[INFO] 
[INFO] --- maven-install-plugin:2.3.1:install (default-install) @ tez ---
[INFO] Installing <https://builds.apache.org/job/Tez-Build/ws/pom.xml> to /home/jenkins/.m2/repository/org/apache/tez/tez/0.2.0-SNAPSHOT/tez-0.2.0-SNAPSHOT.pom
[INFO] 
[INFO] --- maven-deploy-plugin:2.5:deploy (default-deploy) @ tez ---
Downloading: https://repository.apache.org/content/repositories/snapshots/org/apache/tez/tez/0.2.0-SNAPSHOT/maven-metadata.xml
596 B   
        
Downloaded: https://repository.apache.org/content/repositories/snapshots/org/apache/tez/tez/0.2.0-SNAPSHOT/maven-metadata.xml
(596 B at 0.5 KB/sec)
Uploading: https://repository.apache.org/content/repositories/snapshots/org/apache/tez/tez/0.2.0-SNAPSHOT/tez-0.2.0-20130618.080131-14.pom
4 KB    
8 KB   
12 KB   
15 KB   
        
Uploaded: https://repository.apache.org/content/repositories/snapshots/org/apache/tez/tez/0.2.0-SNAPSHOT/tez-0.2.0-20130618.080131-14.pom
(15 KB at 18.2 KB/sec)
Downloading: https://repository.apache.org/content/repositories/snapshots/org/apache/tez/tez/maven-metadata.xml
277 B   
        
Downloaded: https://repository.apache.org/content/repositories/snapshots/org/apache/tez/tez/maven-metadata.xml
(277 B at 1.2 KB/sec)
Uploading: https://repository.apache.org/content/repositories/snapshots/org/apache/tez/tez/0.2.0-SNAPSHOT/maven-metadata.xml
596 B   
        
Uploaded: https://repository.apache.org/content/repositories/snapshots/org/apache/tez/tez/0.2.0-SNAPSHOT/maven-metadata.xml
(596 B at 1.5 KB/sec)
Uploading: https://repository.apache.org/content/repositories/snapshots/org/apache/tez/tez/maven-metadata.xml
277 B   
        
Uploaded: https://repository.apache.org/content/repositories/snapshots/org/apache/tez/tez/maven-metadata.xml
(277 B at 0.6 KB/sec)
[INFO]                                                                         
[INFO] ------------------------------------------------------------------------
[INFO] Building tez-dag-api 0.2.0-SNAPSHOT
[INFO] ------------------------------------------------------------------------
[INFO] 
[INFO] --- maven-clean-plugin:2.4.1:clean (default-clean) @ tez-dag-api ---
[INFO] Deleting <https://builds.apache.org/job/Tez-Build/ws/tez-dag-api/target>
[INFO] 
[INFO] --- hadoop-maven-plugins:3.0.0-SNAPSHOT:protoc (compile-protoc) @ tez-dag-api ---
[INFO] 
[INFO] --- maven-resources-plugin:2.4.3:resources (default-resources) @ tez-dag-api ---
[WARNING] Using platform encoding (ISO-8859-1 actually) to copy filtered resources, i.e. build
is platform dependent!
[INFO] skip non existing resourceDirectory <https://builds.apache.org/job/Tez-Build/ws/tez-dag-api/src/main/resources>
[INFO] 
[INFO] --- maven-compiler-plugin:2.3.2:compile (default-compile) @ tez-dag-api ---
[WARNING] File encoding has not been set, using platform encoding ISO-8859-1, i.e. build is
platform dependent!
[INFO] Compiling 22 source files to <https://builds.apache.org/job/Tez-Build/ws/tez-dag-api/target/classes>
[INFO] -------------------------------------------------------------
[ERROR] COMPILATION ERROR : 
[INFO] -------------------------------------------------------------
[ERROR] <https://builds.apache.org/job/Tez-Build/ws/tez-dag-api/src/main/java/org/apache/tez/dag/api/client/rpc/DAGClientRPCImpl.java>:[32,40]
package org.apache.hadoop.yarn.client.api does not exist
[ERROR] <https://builds.apache.org/job/Tez-Build/ws/tez-dag-api/src/main/java/org/apache/tez/dag/api/client/rpc/DAGClientRPCImpl.java>:[33,45]
package org.apache.hadoop.yarn.client.api.impl does not exist
[ERROR] <https://builds.apache.org/job/Tez-Build/ws/tez-dag-api/src/main/java/org/apache/tez/dag/api/client/rpc/DAGClientRPCImpl.java>:[54,10]
cannot find symbol
symbol  : class YarnClient
location: class org.apache.tez.dag.api.client.rpc.DAGClientRPCImpl
[ERROR] <https://builds.apache.org/job/Tez-Build/ws/tez-dag-api/src/main/java/org/apache/tez/client/TezClient.java>:[57,40]
package org.apache.hadoop.yarn.client.api does not exist
[ERROR] <https://builds.apache.org/job/Tez-Build/ws/tez-dag-api/src/main/java/org/apache/tez/client/TezClient.java>:[58,45]
package org.apache.hadoop.yarn.client.api.impl does not exist
[ERROR] <https://builds.apache.org/job/Tez-Build/ws/tez-dag-api/src/main/java/org/apache/tez/client/TezClient.java>:[85,10]
cannot find symbol
symbol  : class YarnClient
location: class org.apache.tez.client.TezClient
[ERROR] <https://builds.apache.org/job/Tez-Build/ws/tez-dag-api/src/main/java/org/apache/tez/dag/api/client/rpc/DAGClientRPCImpl.java>:[62,21]
cannot find symbol
symbol  : class YarnClientImpl
location: class org.apache.tez.dag.api.client.rpc.DAGClientRPCImpl
[ERROR] <https://builds.apache.org/job/Tez-Build/ws/tez-dag-api/src/main/java/org/apache/tez/client/TezClient.java>:[89,21]
cannot find symbol
symbol  : class YarnClientImpl
location: class org.apache.tez.client.TezClient
[INFO] 8 errors 
[INFO] -------------------------------------------------------------
[INFO] ------------------------------------------------------------------------
[INFO] Reactor Summary:
[INFO] 
[INFO] tez ............................................... SUCCESS [3.471s]
[INFO] tez-dag-api ....................................... FAILURE [3.986s]
[INFO] tez-common ........................................ SKIPPED
[INFO] tez-engine-api .................................... SKIPPED
[INFO] tez-engine ........................................ SKIPPED
[INFO] tez-mapreduce ..................................... SKIPPED
[INFO] tez-yarn-client ................................... SKIPPED
[INFO] tez-dag ........................................... SKIPPED
[INFO] tez-mapreduce-examples ............................ SKIPPED
[INFO] tez-mapreduce-tests ............................... SKIPPED
[INFO] tez-dist .......................................... SKIPPED
[INFO] ------------------------------------------------------------------------
[INFO] BUILD FAILURE
[INFO] ------------------------------------------------------------------------
[INFO] Total time: 7.759s
[INFO] Finished at: Tue Jun 18 08:01:36 UTC 2013
[INFO] Final Memory: 16M/129M
[INFO] ------------------------------------------------------------------------
[ERROR] Failed to execute goal org.apache.maven.plugins:maven-compiler-plugin:2.3.2:compile
(default-compile) on project tez-dag-api: Compilation failure: Compilation failure:
[ERROR] <https://builds.apache.org/job/Tez-Build/ws/tez-dag-api/src/main/java/org/apache/tez/dag/api/client/rpc/DAGClientRPCImpl.java>:[32,40]
package org.apache.hadoop.yarn.client.api does not exist
[ERROR] <https://builds.apache.org/job/Tez-Build/ws/tez-dag-api/src/main/java/org/apache/tez/dag/api/client/rpc/DAGClientRPCImpl.java>:[33,45]
package org.apache.hadoop.yarn.client.api.impl does not exist
[ERROR] <https://builds.apache.org/job/Tez-Build/ws/tez-dag-api/src/main/java/org/apache/tez/dag/api/client/rpc/DAGClientRPCImpl.java>:[54,10]
cannot find symbol
[ERROR] symbol  : class YarnClient
[ERROR] location: class org.apache.tez.dag.api.client.rpc.DAGClientRPCImpl
[ERROR] <https://builds.apache.org/job/Tez-Build/ws/tez-dag-api/src/main/java/org/apache/tez/client/TezClient.java>:[57,40]
package org.apache.hadoop.yarn.client.api does not exist
[ERROR] <https://builds.apache.org/job/Tez-Build/ws/tez-dag-api/src/main/java/org/apache/tez/client/TezClient.java>:[58,45]
package org.apache.hadoop.yarn.client.api.impl does not exist
[ERROR] <https://builds.apache.org/job/Tez-Build/ws/tez-dag-api/src/main/java/org/apache/tez/client/TezClient.java>:[85,10]
cannot find symbol
[ERROR] symbol  : class YarnClient
[ERROR] location: class org.apache.tez.client.TezClient
[ERROR] <https://builds.apache.org/job/Tez-Build/ws/tez-dag-api/src/main/java/org/apache/tez/dag/api/client/rpc/DAGClientRPCImpl.java>:[62,21]
cannot find symbol
[ERROR] symbol  : class YarnClientImpl
[ERROR] location: class org.apache.tez.dag.api.client.rpc.DAGClientRPCImpl
[ERROR] <https://builds.apache.org/job/Tez-Build/ws/tez-dag-api/src/main/java/org/apache/tez/client/TezClient.java>:[89,21]
cannot find symbol
[ERROR] symbol  : class YarnClientImpl
[ERROR] location: class org.apache.tez.client.TezClient
[ERROR] -> [Help 1]
[ERROR] 
[ERROR] To see the full stack trace of the errors, re-run Maven with the -e switch.
[ERROR] Re-run Maven using the -X switch to enable full debug logging.
[ERROR] 
[ERROR] For more information about the errors and possible solutions, please read the following
articles:
[ERROR] [Help 1] http://cwiki.apache.org/confluence/display/MAVEN/MojoFailureException
[ERROR] 
[ERROR] After correcting the problems, you can resume the build with the command
[ERROR]   mvn <goals> -rf :tez-dag-api
Build step 'Execute shell' marked build as failure
Archiving artifacts
Recording test results

Mime
View raw message