tez-dev mailing list archives

Site index · List index
Message view « Date » · « Thread »
Top « Date » · « Thread »
From Apache Jenkins Server <jenk...@builds.apache.org>
Subject Build failed in Jenkins: Tez-Build #21
Date Mon, 10 Jun 2013 05:01:25 GMT
See <https://builds.apache.org/job/Tez-Build/21/changes>

Changes:

[sseth] TEZ-198. Allow setting a per vertex/stage user payload in the DAG API. Part of TEZ-182.

[sseth] TEZ-191. Add helper APIs to convert a MR task configuration to Tez

------------------------------------------
[...truncated 4 lines...]
Last Built Revision: Revision ca1e53e891941c79f85f6bd478318ef92407962c (origin/master)
Fetching changes from 1 remote Git repository
Fetching upstream changes from https://git-wip-us.apache.org/repos/asf/incubator-tez.git
Commencing build of Revision 81f43ef93d1350ad7d4d94e71b722862b19602c2 (origin/master)
Checking out Revision 81f43ef93d1350ad7d4d94e71b722862b19602c2 (origin/master)
[Tez-Build] $ /bin/bash -x /tmp/hudson4231559017779547832.sh
+ export JAVA_HOME=/home/hudson/tools/java/latest
+ JAVA_HOME=/home/hudson/tools/java/latest
+ export MAVEN_HOME=/home/hudson/tools/maven/latest
+ MAVEN_HOME=/home/hudson/tools/maven/latest
+ export PATH=/home/hudson/tools/java/latest/bin:/home/hudson/tools/maven/latest/bin:/home/hudson/tools/java/latest1.6/bin:/home/hudson/tools/java/latest1.6/bin:/usr/local/sbin:/usr/local/bin:/usr/sbin:/usr/bin:/sbin:/bin:/usr/games
+ PATH=/home/hudson/tools/java/latest/bin:/home/hudson/tools/maven/latest/bin:/home/hudson/tools/java/latest1.6/bin:/home/hudson/tools/java/latest1.6/bin:/usr/local/sbin:/usr/local/bin:/usr/sbin:/usr/bin:/sbin:/bin:/usr/games
+ env
BUILD_URL=https://builds.apache.org/job/Tez-Build/21/
HUDSON_SERVER_COOKIE=f4ebd1e6b0d976e8
SHELL=/bin/sh
SSH_CLIENT=140.211.11.8 48934 22
BUILD_TAG=jenkins-Tez-Build-21
WORKSPACE=<https://builds.apache.org/job/Tez-Build/ws/>
JOB_URL=https://builds.apache.org/job/Tez-Build/
USER=jenkins
LD_LIBRARY_PATH=/home/jenkins/tools/java/jdk1.6.0_27/jre/lib/i386/server:/home/jenkins/tools/java/jdk1.6.0_27/jre/lib/i386:/home/jenkins/tools/java/jdk1.6.0_27/jre/../lib/i386
NLSPATH=/usr/dt/lib/nls/msg/%L/%N.cat
GIT_COMMIT=81f43ef93d1350ad7d4d94e71b722862b19602c2
JENKINS_HOME=/home/hudson/hudson
MAVEN_HOME=/home/hudson/tools/maven/latest
PATH=/home/hudson/tools/java/latest/bin:/home/hudson/tools/maven/latest/bin:/home/hudson/tools/java/latest1.6/bin:/home/hudson/tools/java/latest1.6/bin:/usr/local/sbin:/usr/local/bin:/usr/sbin:/usr/bin:/sbin:/bin:/usr/games
MAIL=/var/mail/jenkins
PWD=<https://builds.apache.org/job/Tez-Build/ws/>
JAVA_HOME=/home/hudson/tools/java/latest
HUDSON_URL=https://builds.apache.org/
LANG=en_US
JOB_NAME=Tez-Build
XFILESEARCHPATH=/usr/dt/app-defaults/%L/Dt
JENKINS_URL=https://builds.apache.org/
BUILD_ID=2013-06-10_05-01-16
SHLVL=1
HOME=/home/jenkins
GIT_BRANCH=master
JENKINS_SERVER_COOKIE=f4ebd1e6b0d976e8
EXECUTOR_NUMBER=0
NODE_LABELS=Hadoop Hcat Hdfs Pig hadoop1
LOGNAME=jenkins
HUDSON_HOME=/home/hudson/hudson
SSH_CONNECTION=140.211.11.8 48934 67.195.138.24 22
NODE_NAME=hadoop1
BUILD_NUMBER=21
HUDSON_COOKIE=09c0e106-24ab-42b7-86a5-f3e924a07699
_=/usr/bin/env
+ export MAVEN_OPTS=-Xmx2048m
+ MAVEN_OPTS=-Xmx2048m
+ /home/hudson/tools/maven/latest/bin/mvn clean package -Pdist -Dmaven.test.failure.ignore=true
-Dtar
[INFO] Scanning for projects...
[INFO] ------------------------------------------------------------------------
[INFO] Reactor Build Order:
[INFO] 
[INFO] tez
[INFO] tez-dag-api
[INFO] tez-common
[INFO] tez-engine-api
[INFO] tez-engine
[INFO] tez-mapreduce
[INFO] tez-yarn-client
[INFO] tez-dag
[INFO] tez-mapreduce-examples
[INFO] tez-mapreduce-tests
[INFO] tez-dist
[INFO]                                                                         
[INFO] ------------------------------------------------------------------------
[INFO] Building tez 0.2.0-SNAPSHOT
[INFO] ------------------------------------------------------------------------
Downloading: https://maven.atlassian.com/repository/public/org/apache/maven/plugins/maven-clean-plugin/2.4.1/maven-clean-plugin-2.4.1.pom
4 KB   
5 KB   
       
Downloaded: https://maven.atlassian.com/repository/public/org/apache/maven/plugins/maven-clean-plugin/2.4.1/maven-clean-plugin-2.4.1.pom
(5 KB at 4.6 KB/sec)
Downloading: https://maven.atlassian.com/repository/public/org/apache/maven/plugins/maven-plugins/18/maven-plugins-18.pom
4 KB   
8 KB   
12 KB   
13 KB   
        
Downloaded: https://maven.atlassian.com/repository/public/org/apache/maven/plugins/maven-plugins/18/maven-plugins-18.pom
(13 KB at 61.9 KB/sec)
Downloading: https://maven.atlassian.com/repository/public/org/apache/maven/maven-parent/16/maven-parent-16.pom
4 KB    
8 KB   
12 KB   
14 KB   
18 KB   
22 KB   
23 KB   
        
Downloaded: https://maven.atlassian.com/repository/public/org/apache/maven/maven-parent/16/maven-parent-16.pom
(23 KB at 61.8 KB/sec)
Downloading: https://maven.atlassian.com/repository/public/org/apache/apache/7/apache-7.pom
4 KB    
6 KB   
10 KB   
14 KB   
14 KB   
15 KB   
        
Downloaded: https://maven.atlassian.com/repository/public/org/apache/apache/7/apache-7.pom
(15 KB at 66.2 KB/sec)
Downloading: https://maven.atlassian.com/repository/public/org/apache/maven/plugins/maven-clean-plugin/2.4.1/maven-clean-plugin-2.4.1.jar
4 KB    
8 KB   
12 KB   
14 KB   
18 KB   
22 KB   
23 KB   
        
Downloaded: https://maven.atlassian.com/repository/public/org/apache/maven/plugins/maven-clean-plugin/2.4.1/maven-clean-plugin-2.4.1.jar
(23 KB at 85.2 KB/sec)
[INFO] 
[INFO] --- maven-clean-plugin:2.4.1:clean (default-clean) @ tez ---
Downloading: https://maven.atlassian.com/repository/public/org/apache/maven/maven-plugin-api/2.0.6/maven-plugin-api-2.0.6.pom
2 KB    
       
Downloaded: https://maven.atlassian.com/repository/public/org/apache/maven/maven-plugin-api/2.0.6/maven-plugin-api-2.0.6.pom
(2 KB at 6.0 KB/sec)
Downloading: https://maven.atlassian.com/repository/public/org/apache/maven/maven/2.0.6/maven-2.0.6.pom
4 KB   
6 KB   
9 KB   
9 KB   
       
Downloaded: https://maven.atlassian.com/repository/public/org/apache/maven/maven/2.0.6/maven-2.0.6.pom
(9 KB at 51.1 KB/sec)
Downloading: https://maven.atlassian.com/repository/public/org/apache/maven/maven-parent/5/maven-parent-5.pom
4 KB   
8 KB   
12 KB   
14 KB   
15 KB   
        
Downloaded: https://maven.atlassian.com/repository/public/org/apache/maven/maven-parent/5/maven-parent-5.pom
(15 KB at 77.5 KB/sec)
Downloading: https://maven.atlassian.com/repository/public/org/apache/apache/3/apache-3.pom
4 KB    
       
Downloaded: https://maven.atlassian.com/repository/public/org/apache/apache/3/apache-3.pom
(4 KB at 19.0 KB/sec)
Downloading: https://maven.atlassian.com/repository/public/org/codehaus/plexus/plexus-utils/2.0.5/plexus-utils-2.0.5.pom
4 KB   
       
Downloaded: https://maven.atlassian.com/repository/public/org/codehaus/plexus/plexus-utils/2.0.5/plexus-utils-2.0.5.pom
(4 KB at 16.9 KB/sec)
Downloading: https://maven.atlassian.com/repository/public/org/codehaus/plexus/plexus/2.0.6/plexus-2.0.6.pom
4 KB   
8 KB   
12 KB   
14 KB   
17 KB   
        
Downloaded: https://maven.atlassian.com/repository/public/org/codehaus/plexus/plexus/2.0.6/plexus-2.0.6.pom
(17 KB at 87.1 KB/sec)
Downloading: https://maven.atlassian.com/repository/public/org/codehaus/plexus/plexus-utils/2.0.5/plexus-utils-2.0.5.jar
4 KB    
8 KB   
12 KB   
14 KB   
18 KB   
22 KB   
26 KB   
30 KB   
34 KB   
38 KB   
42 KB   
44 KB   
48 KB   
52 KB   
56 KB   
60 KB   
64 KB   
68 KB   
72 KB   
76 KB   
80 KB   
84 KB   
88 KB   
92 KB   
96 KB   
100 KB   
104 KB   
108 KB   
112 KB   
116 KB   
120 KB   
124 KB   
128 KB   
132 KB   
136 KB   
140 KB   
144 KB   
148 KB   
152 KB   
156 KB   
160 KB   
164 KB   
168 KB   
172 KB   
176 KB   
180 KB   
184 KB   
188 KB   
192 KB   
196 KB   
200 KB   
204 KB   
208 KB   
212 KB   
216 KB   
218 KB   
         
Downloaded: https://maven.atlassian.com/repository/public/org/codehaus/plexus/plexus-utils/2.0.5/plexus-utils-2.0.5.jar
(218 KB at 412.8 KB/sec)
[INFO]                                                                         
[INFO] ------------------------------------------------------------------------
[INFO] Building tez-dag-api 0.2.0-SNAPSHOT
[INFO] ------------------------------------------------------------------------
Downloading: https://maven.atlassian.com/repository/public/org/apache/hadoop/hadoop-maven-plugins/3.0.0-SNAPSHOT/maven-metadata.xml
         
Downloading: https://maven.atlassian.com/repository/public/org/apache/hadoop/hadoop-maven-plugins/3.0.0-SNAPSHOT/hadoop-maven-plugins-3.0.0-SNAPSHOT.pom
         
[WARNING] The POM for org.apache.hadoop:hadoop-maven-plugins:jar:3.0.0-SNAPSHOT is missing,
no dependency information available
[INFO] ------------------------------------------------------------------------
[INFO] Reactor Summary:
[INFO] 
[INFO] tez ............................................... SUCCESS [3.863s]
[INFO] tez-dag-api ....................................... FAILURE [0.460s]
[INFO] tez-common ........................................ SKIPPED
[INFO] tez-engine-api .................................... SKIPPED
[INFO] tez-engine ........................................ SKIPPED
[INFO] tez-mapreduce ..................................... SKIPPED
[INFO] tez-yarn-client ................................... SKIPPED
[INFO] tez-dag ........................................... SKIPPED
[INFO] tez-mapreduce-examples ............................ SKIPPED
[INFO] tez-mapreduce-tests ............................... SKIPPED
[INFO] tez-dist .......................................... SKIPPED
[INFO] ------------------------------------------------------------------------
[INFO] BUILD FAILURE
[INFO] ------------------------------------------------------------------------
[INFO] Total time: 4.612s
[INFO] Finished at: Mon Jun 10 05:01:24 UTC 2013
[INFO] Final Memory: 4M/61M
[INFO] ------------------------------------------------------------------------
[WARNING] The requested profile "dist" could not be activated because it does not exist.
[ERROR] Plugin org.apache.hadoop:hadoop-maven-plugins:3.0.0-SNAPSHOT or one of its dependencies
could not be resolved: Failed to read artifact descriptor for org.apache.hadoop:hadoop-maven-plugins:jar:3.0.0-SNAPSHOT:
Could not find artifact org.apache.hadoop:hadoop-maven-plugins:pom:3.0.0-SNAPSHOT in maven2-repository.atlassian
(https://maven.atlassian.com/repository/public) -> [Help 1]
[ERROR] 
[ERROR] To see the full stack trace of the errors, re-run Maven with the -e switch.
[ERROR] Re-run Maven using the -X switch to enable full debug logging.
[ERROR] 
[ERROR] For more information about the errors and possible solutions, please read the following
articles:
[ERROR] [Help 1] http://cwiki.apache.org/confluence/display/MAVEN/PluginResolutionException
Build step 'Execute shell' marked build as failure
Archiving artifacts
Recording test results

Mime
View raw message