tez-dev mailing list archives

Site index · List index
Message view « Date » · « Thread »
Top « Date » · « Thread »
From Apache Jenkins Server <jenk...@builds.apache.org>
Subject Build failed in Jenkins: Tez-Build #18
Date Sat, 08 Jun 2013 02:01:48 GMT
See <https://builds.apache.org/job/Tez-Build/18/changes>

Changes:

[hitesh] TEZ-195. Add helper api to generate jvm options for map and reduce vertices from
MR configs. (hitesh)

------------------------------------------
[...truncated 1216 lines...]
1096 KB   
1100 KB   
1104 KB   
1108 KB   
1112 KB   
1116 KB   
1120 KB   
1124 KB   
1128 KB   
1132 KB   
1136 KB   
1140 KB   
1144 KB   
1148 KB   
1152 KB   
1156 KB   
1160 KB   
1164 KB   
1168 KB   
1172 KB   
1176 KB   
1180 KB   
1184 KB   
1188 KB   
1192 KB   
1196 KB   
1200 KB   
1204 KB   
1206 KB   
1210 KB   
1214 KB   
1218 KB   
1222 KB   
1226 KB   
1230 KB   
1234 KB   
1238 KB   
1242 KB   
1246 KB   
1250 KB   
1254 KB   
1258 KB   
1262 KB   
1266 KB   
1270 KB   
1274 KB   
1278 KB   
1282 KB   
1286 KB   
1290 KB   
1294 KB   
1298 KB   
1302 KB   
1306 KB   
1310 KB   
1314 KB   
1318 KB   
1322 KB   
1326 KB   
1330 KB   
1334 KB   
1338 KB   
1342 KB   
1346 KB   
1350 KB   
1354 KB   
1358 KB   
1362 KB   
1366 KB   
1370 KB   
1374 KB   
1378 KB   
1382 KB   
1386 KB   
1390 KB   
1394 KB   
1398 KB   
1402 KB   
1406 KB   
1410 KB   
1414 KB   
1418 KB   
1422 KB   
1426 KB   
1430 KB   
1434 KB   
1438 KB   
1442 KB   
1446 KB   
1450 KB   
1454 KB   
1458 KB   
1462 KB   
1466 KB   
1470 KB   
1474 KB   
1478 KB   
1482 KB   
1486 KB   
1490 KB   
1494 KB   
1498 KB   
1502 KB   
1506 KB   
1510 KB   
1514 KB   
1518 KB   
1522 KB   
1526 KB   
1530 KB   
1534 KB   
1538 KB   
1542 KB   
1545 KB   
          
Downloaded: http://repo1.maven.org/maven2/org/mockito/mockito-all/1.9.5/mockito-all-1.9.5.jar
(1545 KB at 4980.7 KB/sec)
[INFO] 
[INFO] --- maven-clean-plugin:2.4.1:clean (default-clean) @ tez-mapreduce ---
[INFO] 
[INFO] --- maven-resources-plugin:2.4.3:resources (default-resources) @ tez-mapreduce ---
[WARNING] Using platform encoding (ISO-8859-1 actually) to copy filtered resources, i.e. build
is platform dependent!
[INFO] skip non existing resourceDirectory <https://builds.apache.org/job/Tez-Build/ws/tez-mapreduce/src/main/resources>
[INFO] 
[INFO] --- maven-compiler-plugin:2.3.2:compile (default-compile) @ tez-mapreduce ---
[WARNING] File encoding has not been set, using platform encoding ISO-8859-1, i.e. build is
platform dependent!
[INFO] Compiling 35 source files to <https://builds.apache.org/job/Tez-Build/ws/tez-mapreduce/target/classes>
[INFO] 
[INFO] --- maven-resources-plugin:2.4.3:testResources (default-testResources) @ tez-mapreduce
---
[WARNING] Using platform encoding (ISO-8859-1 actually) to copy filtered resources, i.e. build
is platform dependent!
[INFO] Copying 1 resource
[INFO] 
[INFO] --- maven-compiler-plugin:2.3.2:testCompile (default-testCompile) @ tez-mapreduce ---
[WARNING] File encoding has not been set, using platform encoding ISO-8859-1, i.e. build is
platform dependent!
[INFO] Compiling 7 source files to <https://builds.apache.org/job/Tez-Build/ws/tez-mapreduce/target/test-classes>
[INFO] 
[INFO] --- maven-surefire-plugin:2.14.1:test (default-test) @ tez-mapreduce ---
[INFO] Surefire report directory: <https://builds.apache.org/job/Tez-Build/ws/tez-mapreduce/target/surefire-reports>

-------------------------------------------------------
 T E S T S
-------------------------------------------------------

-------------------------------------------------------
 T E S T S
-------------------------------------------------------
Running org.apache.tez.mapreduce.hadoop.TestMRHelpers
Tests run: 4, Failures: 0, Errors: 0, Skipped: 0, Time elapsed: 3.731 sec
Running org.apache.tez.mapreduce.processor.reduce.TestReduceProcessor
Tests run: 1, Failures: 0, Errors: 0, Skipped: 0, Time elapsed: 1.447 sec
Running org.apache.tez.mapreduce.processor.map.TestMapProcessor
Tests run: 2, Failures: 0, Errors: 0, Skipped: 1, Time elapsed: 1.315 sec

Results :

Tests run: 7, Failures: 0, Errors: 0, Skipped: 1

[INFO] 
[INFO] --- maven-jar-plugin:2.3.1:jar (default-jar) @ tez-mapreduce ---
[INFO] Building jar: <https://builds.apache.org/job/Tez-Build/ws/tez-mapreduce/target/tez-mapreduce-0.2.0-SNAPSHOT.jar>
[INFO]                                                                         
[INFO] ------------------------------------------------------------------------
[INFO] Building tez-yarn-client 0.2.0-SNAPSHOT
[INFO] ------------------------------------------------------------------------
[INFO] 
[INFO] --- maven-clean-plugin:2.4.1:clean (default-clean) @ tez-yarn-client ---
[INFO] 
[INFO] --- maven-resources-plugin:2.4.3:resources (default-resources) @ tez-yarn-client ---
[WARNING] Using platform encoding (ISO-8859-1 actually) to copy filtered resources, i.e. build
is platform dependent!
[INFO] Copying 1 resource
[INFO] 
[INFO] --- maven-compiler-plugin:2.3.2:compile (default-compile) @ tez-yarn-client ---
[WARNING] File encoding has not been set, using platform encoding ISO-8859-1, i.e. build is
platform dependent!
[INFO] Compiling 7 source files to <https://builds.apache.org/job/Tez-Build/ws/tez-yarn-client/target/classes>
[INFO] 
[INFO] --- maven-resources-plugin:2.4.3:testResources (default-testResources) @ tez-yarn-client
---
[WARNING] Using platform encoding (ISO-8859-1 actually) to copy filtered resources, i.e. build
is platform dependent!
[INFO] skip non existing resourceDirectory <https://builds.apache.org/job/Tez-Build/ws/tez-yarn-client/src/test/resources>
[INFO] 
[INFO] --- maven-compiler-plugin:2.3.2:testCompile (default-testCompile) @ tez-yarn-client
---
[INFO] No sources to compile
[INFO] 
[INFO] --- maven-surefire-plugin:2.14.1:test (default-test) @ tez-yarn-client ---
[INFO] No tests to run.
[INFO] 
[INFO] --- maven-jar-plugin:2.3.1:jar (default-jar) @ tez-yarn-client ---
[INFO] Building jar: <https://builds.apache.org/job/Tez-Build/ws/tez-yarn-client/target/tez-yarn-client-0.2.0-SNAPSHOT.jar>
[INFO]                                                                         
[INFO] ------------------------------------------------------------------------
[INFO] Building tez-dag 0.2.0-SNAPSHOT
[INFO] ------------------------------------------------------------------------
[INFO] 
[INFO] --- maven-clean-plugin:2.4.1:clean (default-clean) @ tez-dag ---
[INFO] 
[INFO] --- avro-maven-plugin:1.5.3:protocol (default) @ tez-dag ---
[INFO] 
[INFO] --- maven-resources-plugin:2.4.3:resources (default-resources) @ tez-dag ---
[WARNING] Using platform encoding (ISO-8859-1 actually) to copy filtered resources, i.e. build
is platform dependent!
[INFO] Copying 1 resource
[INFO] 
[INFO] --- maven-compiler-plugin:2.3.2:compile (default-compile) @ tez-dag ---
[WARNING] File encoding has not been set, using platform encoding ISO-8859-1, i.e. build is
platform dependent!
[INFO] Compiling 190 source files to <https://builds.apache.org/job/Tez-Build/ws/tez-dag/target/classes>
[INFO] -------------------------------------------------------------
[ERROR] COMPILATION ERROR : 
[INFO] -------------------------------------------------------------
[ERROR] <https://builds.apache.org/job/Tez-Build/ws/tez-dag/src/main/java/org/apache/tez/dag/app/rm/node/AMNodeEventStateChanged.java>:[27,44]
cannot find symbol
symbol  : method getNodeHealthStatus()
location: class org.apache.hadoop.yarn.api.records.NodeReport
[INFO] 1 error
[INFO] -------------------------------------------------------------
[INFO] ------------------------------------------------------------------------
[INFO] Reactor Summary:
[INFO] 
[INFO] tez ............................................... SUCCESS [0.158s]
[INFO] tez-dag-api ....................................... SUCCESS [14.903s]
[INFO] tez-common ........................................ SUCCESS [1.211s]
[INFO] tez-engine-api .................................... SUCCESS [0.740s]
[INFO] tez-engine ........................................ SUCCESS [2.593s]
[INFO] tez-mapreduce ..................................... SUCCESS [11.704s]
[INFO] tez-yarn-client ................................... SUCCESS [1.059s]
[INFO] tez-dag ........................................... FAILURE [2.906s]
[INFO] tez-mapreduce-examples ............................ SKIPPED
[INFO] tez-mapreduce-tests ............................... SKIPPED
[INFO] tez-dist .......................................... SKIPPED
[INFO] ------------------------------------------------------------------------
[INFO] BUILD FAILURE
[INFO] ------------------------------------------------------------------------
[INFO] Total time: 35.564s
[INFO] Finished at: Sat Jun 08 02:01:46 UTC 2013
[INFO] Final Memory: 69M/233M
[INFO] ------------------------------------------------------------------------
[WARNING] The requested profile "dist" could not be activated because it does not exist.
[ERROR] Failed to execute goal org.apache.maven.plugins:maven-compiler-plugin:2.3.2:compile
(default-compile) on project tez-dag: Compilation failure
[ERROR] <https://builds.apache.org/job/Tez-Build/ws/tez-dag/src/main/java/org/apache/tez/dag/app/rm/node/AMNodeEventStateChanged.java>:[27,44]
cannot find symbol
[ERROR] symbol  : method getNodeHealthStatus()
[ERROR] location: class org.apache.hadoop.yarn.api.records.NodeReport
[ERROR] -> [Help 1]
[ERROR] 
[ERROR] To see the full stack trace of the errors, re-run Maven with the -e switch.
[ERROR] Re-run Maven using the -X switch to enable full debug logging.
[ERROR] 
[ERROR] For more information about the errors and possible solutions, please read the following
articles:
[ERROR] [Help 1] http://cwiki.apache.org/confluence/display/MAVEN/MojoFailureException
[ERROR] 
[ERROR] After correcting the problems, you can resume the build with the command
[ERROR]   mvn <goals> -rf :tez-dag
Build step 'Execute shell' marked build as failure
Archiving artifacts
Recording test results

Mime
View raw message