tez-dev mailing list archives

Site index · List index
Message view « Date » · « Thread »
Top « Date » · « Thread »
From Apache Jenkins Server <jenk...@builds.apache.org>
Subject Build failed in Jenkins: Tez-Build #43
Date Mon, 17 Jun 2013 07:07:17 GMT
See <https://builds.apache.org/job/Tez-Build/43/changes>

Changes:

[sseth] Update TEZ to reflect YARN protocol renames after YARN-387. (vinodkv)

[sseth] Fix build break caused by YARN-825 changes. (sseth)

------------------------------------------
[...truncated 1022 lines...]
[INFO] Building tez-dag 0.2.0-SNAPSHOT
[INFO] ------------------------------------------------------------------------
[INFO] 
[INFO] --- maven-clean-plugin:2.4.1:clean (default-clean) @ tez-dag ---
[INFO] Deleting <https://builds.apache.org/job/Tez-Build/ws/tez-dag/target>
[INFO] 
[INFO] --- avro-maven-plugin:1.5.3:protocol (default) @ tez-dag ---
[INFO] 
[INFO] --- maven-resources-plugin:2.4.3:resources (default-resources) @ tez-dag ---
[WARNING] Using platform encoding (ISO-8859-1 actually) to copy filtered resources, i.e. build
is platform dependent!
[INFO] Copying 1 resource
[INFO] 
[INFO] --- maven-compiler-plugin:2.3.2:compile (default-compile) @ tez-dag ---
[WARNING] File encoding has not been set, using platform encoding ISO-8859-1, i.e. build is
platform dependent!
[INFO] Compiling 190 source files to <https://builds.apache.org/job/Tez-Build/ws/tez-dag/target/classes>
[INFO] -------------------------------------------------------------
[ERROR] COMPILATION ERROR : 
[INFO] -------------------------------------------------------------
[ERROR] <https://builds.apache.org/job/Tez-Build/ws/tez-dag/src/main/java/org/apache/tez/dag/app/dag/impl/TaskAttemptImpl.java>:[50,34]
cannot find symbol
symbol  : class Clock
location: package org.apache.hadoop.yarn.util
[ERROR] <https://builds.apache.org/job/Tez-Build/ws/tez-dag/src/main/java/org/apache/tez/dag/app/dag/impl/TaskAttemptImpl.java>:[120,16]
cannot find symbol
symbol  : class Clock
location: class org.apache.tez.dag.app.dag.impl.TaskAttemptImpl
[ERROR] <https://builds.apache.org/job/Tez-Build/ws/tez-dag/src/main/java/org/apache/tez/dag/app/AppContext.java>:[29,34]
cannot find symbol
symbol  : class Clock
location: package org.apache.hadoop.yarn.util
[ERROR] <https://builds.apache.org/job/Tez-Build/ws/tez-dag/src/main/java/org/apache/tez/dag/app/HeartbeatHandlerBase.java>:[29,34]
cannot find symbol
symbol  : class Clock
location: package org.apache.hadoop.yarn.util
[ERROR] <https://builds.apache.org/job/Tez-Build/ws/tez-dag/src/main/java/org/apache/tez/dag/app/dag/impl/TaskAttemptImpl.java>:[258,67]
cannot find symbol
symbol  : class Clock
location: class org.apache.tez.dag.app.dag.impl.TaskAttemptImpl
[ERROR] <https://builds.apache.org/job/Tez-Build/ws/tez-dag/src/main/java/org/apache/tez/dag/app/DAGAppMaster.java>:[63,34]
cannot find symbol
symbol  : class Clock
location: package org.apache.hadoop.yarn.util
[ERROR] <https://builds.apache.org/job/Tez-Build/ws/tez-dag/src/main/java/org/apache/tez/dag/app/DAGAppMaster.java>:[65,34]
cannot find symbol
symbol  : class SystemClock
location: package org.apache.hadoop.yarn.util
[ERROR] <https://builds.apache.org/job/Tez-Build/ws/tez-dag/src/main/java/org/apache/tez/dag/app/AppContext.java>:[65,2]
cannot find symbol
symbol  : class Clock
location: interface org.apache.tez.dag.app.AppContext
[ERROR] <https://builds.apache.org/job/Tez-Build/ws/tez-dag/src/main/java/org/apache/tez/dag/app/HeartbeatHandlerBase.java>:[41,18]
cannot find symbol
symbol  : class Clock
location: class org.apache.tez.dag.app.HeartbeatHandlerBase<T>
[ERROR] <https://builds.apache.org/job/Tez-Build/ws/tez-dag/src/main/java/org/apache/tez/dag/app/DAGAppMaster.java>:[138,10]
cannot find symbol
symbol  : class Clock
location: class org.apache.tez.dag.app.DAGAppMaster
[ERROR] <https://builds.apache.org/job/Tez-Build/ws/tez-dag/src/main/java/org/apache/tez/dag/app/DAGAppMaster.java>:[195,6]
cannot find symbol
symbol  : class Clock
location: class org.apache.tez.dag.app.DAGAppMaster
[ERROR] <https://builds.apache.org/job/Tez-Build/ws/tez-dag/src/main/java/org/apache/tez/dag/app/launcher/ContainerLauncherImpl.java>:[50,34]
cannot find symbol
symbol  : class Clock
location: package org.apache.hadoop.yarn.util
[ERROR] <https://builds.apache.org/job/Tez-Build/ws/tez-dag/src/main/java/org/apache/tez/dag/app/launcher/ContainerLauncherImpl.java>:[93,10]
cannot find symbol
symbol  : class Clock
location: class org.apache.tez.dag.app.launcher.ContainerLauncherImpl
[ERROR] <https://builds.apache.org/job/Tez-Build/ws/tez-dag/src/main/java/org/apache/tez/dag/app/DAGAppMaster.java>:[804,11]
cannot find symbol
symbol  : class Clock
location: class org.apache.tez.dag.app.DAGAppMaster.RunningAppContext
[ERROR] <https://builds.apache.org/job/Tez-Build/ws/tez-dag/src/main/java/org/apache/tez/dag/app/dag/impl/VertexImpl.java>:[55,34]
cannot find symbol
symbol  : class Clock
location: package org.apache.hadoop.yarn.util
[ERROR] <https://builds.apache.org/job/Tez-Build/ws/tez-dag/src/main/java/org/apache/tez/dag/app/dag/impl/VertexImpl.java>:[134,16]
cannot find symbol
symbol  : class Clock
location: class org.apache.tez.dag.app.dag.impl.VertexImpl
[ERROR] <https://builds.apache.org/job/Tez-Build/ws/tez-dag/src/main/java/org/apache/tez/dag/app/dag/impl/VertexImpl.java>:[363,38]
cannot find symbol
symbol  : class Clock
location: class org.apache.tez.dag.app.dag.impl.VertexImpl
[ERROR] <https://builds.apache.org/job/Tez-Build/ws/tez-dag/src/main/java/org/apache/tez/dag/app/speculate/DefaultSpeculator.java>:[39,34]
cannot find symbol
symbol  : class Clock
location: package org.apache.hadoop.yarn.util
[ERROR] <https://builds.apache.org/job/Tez-Build/ws/tez-dag/src/main/java/org/apache/tez/dag/app/speculate/DefaultSpeculator.java>:[99,16]
cannot find symbol
symbol  : class Clock
location: class org.apache.tez.dag.app.speculate.DefaultSpeculator
[ERROR] <https://builds.apache.org/job/Tez-Build/ws/tez-dag/src/main/java/org/apache/tez/dag/app/speculate/DefaultSpeculator.java>:[107,67]
cannot find symbol
symbol  : class Clock
location: class org.apache.tez.dag.app.speculate.DefaultSpeculator
[ERROR] <https://builds.apache.org/job/Tez-Build/ws/tez-dag/src/main/java/org/apache/tez/dag/app/speculate/DefaultSpeculator.java>:[150,39]
cannot find symbol
symbol  : class Clock
location: class org.apache.tez.dag.app.speculate.DefaultSpeculator
[ERROR] <https://builds.apache.org/job/Tez-Build/ws/tez-dag/src/main/java/org/apache/tez/dag/app/dag/impl/DAGImpl.java>:[53,34]
cannot find symbol
symbol  : class Clock
location: package org.apache.hadoop.yarn.util
[ERROR] <https://builds.apache.org/job/Tez-Build/ws/tez-dag/src/main/java/org/apache/tez/dag/app/dag/impl/DAGImpl.java>:[112,16]
cannot find symbol
symbol  : class Clock
location: class org.apache.tez.dag.app.dag.impl.DAGImpl
[ERROR] <https://builds.apache.org/job/Tez-Build/ws/tez-dag/src/main/java/org/apache/tez/dag/app/dag/impl/DAGImpl.java>:[325,38]
cannot find symbol
symbol  : class Clock
location: class org.apache.tez.dag.app.dag.impl.DAGImpl
[ERROR] <https://builds.apache.org/job/Tez-Build/ws/tez-dag/src/main/java/org/apache/tez/dag/app/ControlledClock.java>:[20,34]
cannot find symbol
symbol  : class Clock
location: package org.apache.hadoop.yarn.util
[ERROR] <https://builds.apache.org/job/Tez-Build/ws/tez-dag/src/main/java/org/apache/tez/dag/app/ControlledClock.java>:[22,40]
cannot find symbol
symbol: class Clock
public class ControlledClock implements Clock {
[ERROR] <https://builds.apache.org/job/Tez-Build/ws/tez-dag/src/main/java/org/apache/tez/dag/app/ControlledClock.java>:[24,16]
cannot find symbol
symbol  : class Clock
location: class org.apache.tez.dag.app.ControlledClock
[ERROR] <https://builds.apache.org/job/Tez-Build/ws/tez-dag/src/main/java/org/apache/tez/dag/app/ControlledClock.java>:[25,25]
cannot find symbol
symbol  : class Clock
location: class org.apache.tez.dag.app.ControlledClock
[ERROR] <https://builds.apache.org/job/Tez-Build/ws/tez-dag/src/main/java/org/apache/tez/dag/app/dag/impl/TaskImpl.java>:[41,34]
cannot find symbol
symbol  : class Clock
location: package org.apache.hadoop.yarn.util
[ERROR] <https://builds.apache.org/job/Tez-Build/ws/tez-dag/src/main/java/org/apache/tez/dag/app/dag/impl/TaskImpl.java>:[94,18]
cannot find symbol
symbol  : class Clock
location: class org.apache.tez.dag.app.dag.impl.TaskImpl
[ERROR] <https://builds.apache.org/job/Tez-Build/ws/tez-dag/src/main/java/org/apache/tez/dag/app/dag/impl/TaskImpl.java>:[273,31]
cannot find symbol
symbol  : class Clock
location: class org.apache.tez.dag.app.dag.impl.TaskImpl
[ERROR] <https://builds.apache.org/job/Tez-Build/ws/tez-dag/src/main/java/org/apache/tez/dag/app/DAGAppMaster.java>:[190,12]
cannot find symbol
symbol  : class SystemClock
location: class org.apache.tez.dag.app.DAGAppMaster
[ERROR] <https://builds.apache.org/job/Tez-Build/ws/tez-dag/src/main/java/org/apache/tez/dag/app/ControlledClock.java>:[35,2]
method does not override or implement a method from a supertype
[INFO] 33 errors 
[INFO] -------------------------------------------------------------
[INFO] ------------------------------------------------------------------------
[INFO] Reactor Summary:
[INFO] 
[INFO] tez ............................................... SUCCESS [2.932s]
[INFO] tez-dag-api ....................................... SUCCESS [16.019s]
[INFO] tez-common ........................................ SUCCESS [4.534s]
[INFO] tez-engine-api .................................... SUCCESS [3.780s]
[INFO] tez-engine ........................................ SUCCESS [5.702s]
[INFO] tez-mapreduce ..................................... SUCCESS [18.804s]
[INFO] tez-yarn-client ................................... SUCCESS [7.164s]
[INFO] tez-dag ........................................... FAILURE [3.087s]
[INFO] tez-mapreduce-examples ............................ SKIPPED
[INFO] tez-mapreduce-tests ............................... SKIPPED
[INFO] tez-dist .......................................... SKIPPED
[INFO] ------------------------------------------------------------------------
[INFO] BUILD FAILURE
[INFO] ------------------------------------------------------------------------
[INFO] Total time: 1:02.338s
[INFO] Finished at: Mon Jun 17 07:07:08 UTC 2013
[INFO] Final Memory: 92M/428M
[INFO] ------------------------------------------------------------------------
[ERROR] Failed to execute goal org.apache.maven.plugins:maven-compiler-plugin:2.3.2:compile
(default-compile) on project tez-dag: Compilation failure: Compilation failure:
[ERROR] <https://builds.apache.org/job/Tez-Build/ws/tez-dag/src/main/java/org/apache/tez/dag/app/dag/impl/TaskAttemptImpl.java>:[50,34]
cannot find symbol
[ERROR] symbol  : class Clock
[ERROR] location: package org.apache.hadoop.yarn.util
[ERROR] <https://builds.apache.org/job/Tez-Build/ws/tez-dag/src/main/java/org/apache/tez/dag/app/dag/impl/TaskAttemptImpl.java>:[120,16]
cannot find symbol
[ERROR] symbol  : class Clock
[ERROR] location: class org.apache.tez.dag.app.dag.impl.TaskAttemptImpl
[ERROR] <https://builds.apache.org/job/Tez-Build/ws/tez-dag/src/main/java/org/apache/tez/dag/app/AppContext.java>:[29,34]
cannot find symbol
[ERROR] symbol  : class Clock
[ERROR] location: package org.apache.hadoop.yarn.util
[ERROR] <https://builds.apache.org/job/Tez-Build/ws/tez-dag/src/main/java/org/apache/tez/dag/app/HeartbeatHandlerBase.java>:[29,34]
cannot find symbol
[ERROR] symbol  : class Clock
[ERROR] location: package org.apache.hadoop.yarn.util
[ERROR] <https://builds.apache.org/job/Tez-Build/ws/tez-dag/src/main/java/org/apache/tez/dag/app/dag/impl/TaskAttemptImpl.java>:[258,67]
cannot find symbol
[ERROR] symbol  : class Clock
[ERROR] location: class org.apache.tez.dag.app.dag.impl.TaskAttemptImpl
[ERROR] <https://builds.apache.org/job/Tez-Build/ws/tez-dag/src/main/java/org/apache/tez/dag/app/DAGAppMaster.java>:[63,34]
cannot find symbol
[ERROR] symbol  : class Clock
[ERROR] location: package org.apache.hadoop.yarn.util
[ERROR] <https://builds.apache.org/job/Tez-Build/ws/tez-dag/src/main/java/org/apache/tez/dag/app/DAGAppMaster.java>:[65,34]
cannot find symbol
[ERROR] symbol  : class SystemClock
[ERROR] location: package org.apache.hadoop.yarn.util
[ERROR] <https://builds.apache.org/job/Tez-Build/ws/tez-dag/src/main/java/org/apache/tez/dag/app/AppContext.java>:[65,2]
cannot find symbol
[ERROR] symbol  : class Clock
[ERROR] location: interface org.apache.tez.dag.app.AppContext
[ERROR] <https://builds.apache.org/job/Tez-Build/ws/tez-dag/src/main/java/org/apache/tez/dag/app/HeartbeatHandlerBase.java>:[41,18]
cannot find symbol
[ERROR] symbol  : class Clock
[ERROR] location: class org.apache.tez.dag.app.HeartbeatHandlerBase<T>
[ERROR] <https://builds.apache.org/job/Tez-Build/ws/tez-dag/src/main/java/org/apache/tez/dag/app/DAGAppMaster.java>:[138,10]
cannot find symbol
[ERROR] symbol  : class Clock
[ERROR] location: class org.apache.tez.dag.app.DAGAppMaster
[ERROR] <https://builds.apache.org/job/Tez-Build/ws/tez-dag/src/main/java/org/apache/tez/dag/app/DAGAppMaster.java>:[195,6]
cannot find symbol
[ERROR] symbol  : class Clock
[ERROR] location: class org.apache.tez.dag.app.DAGAppMaster
[ERROR] <https://builds.apache.org/job/Tez-Build/ws/tez-dag/src/main/java/org/apache/tez/dag/app/launcher/ContainerLauncherImpl.java>:[50,34]
cannot find symbol
[ERROR] symbol  : class Clock
[ERROR] location: package org.apache.hadoop.yarn.util
[ERROR] <https://builds.apache.org/job/Tez-Build/ws/tez-dag/src/main/java/org/apache/tez/dag/app/launcher/ContainerLauncherImpl.java>:[93,10]
cannot find symbol
[ERROR] symbol  : class Clock
[ERROR] location: class org.apache.tez.dag.app.launcher.ContainerLauncherImpl
[ERROR] <https://builds.apache.org/job/Tez-Build/ws/tez-dag/src/main/java/org/apache/tez/dag/app/DAGAppMaster.java>:[804,11]
cannot find symbol
[ERROR] symbol  : class Clock
[ERROR] location: class org.apache.tez.dag.app.DAGAppMaster.RunningAppContext
[ERROR] <https://builds.apache.org/job/Tez-Build/ws/tez-dag/src/main/java/org/apache/tez/dag/app/dag/impl/VertexImpl.java>:[55,34]
cannot find symbol
[ERROR] symbol  : class Clock
[ERROR] location: package org.apache.hadoop.yarn.util
[ERROR] <https://builds.apache.org/job/Tez-Build/ws/tez-dag/src/main/java/org/apache/tez/dag/app/dag/impl/VertexImpl.java>:[134,16]
cannot find symbol
[ERROR] symbol  : class Clock
[ERROR] location: class org.apache.tez.dag.app.dag.impl.VertexImpl
[ERROR] <https://builds.apache.org/job/Tez-Build/ws/tez-dag/src/main/java/org/apache/tez/dag/app/dag/impl/VertexImpl.java>:[363,38]
cannot find symbol
[ERROR] symbol  : class Clock
[ERROR] location: class org.apache.tez.dag.app.dag.impl.VertexImpl
[ERROR] <https://builds.apache.org/job/Tez-Build/ws/tez-dag/src/main/java/org/apache/tez/dag/app/speculate/DefaultSpeculator.java>:[39,34]
cannot find symbol
[ERROR] symbol  : class Clock
[ERROR] location: package org.apache.hadoop.yarn.util
[ERROR] <https://builds.apache.org/job/Tez-Build/ws/tez-dag/src/main/java/org/apache/tez/dag/app/speculate/DefaultSpeculator.java>:[99,16]
cannot find symbol
[ERROR] symbol  : class Clock
[ERROR] location: class org.apache.tez.dag.app.speculate.DefaultSpeculator
[ERROR] <https://builds.apache.org/job/Tez-Build/ws/tez-dag/src/main/java/org/apache/tez/dag/app/speculate/DefaultSpeculator.java>:[107,67]
cannot find symbol
[ERROR] symbol  : class Clock
[ERROR] location: class org.apache.tez.dag.app.speculate.DefaultSpeculator
[ERROR] <https://builds.apache.org/job/Tez-Build/ws/tez-dag/src/main/java/org/apache/tez/dag/app/speculate/DefaultSpeculator.java>:[150,39]
cannot find symbol
[ERROR] symbol  : class Clock
[ERROR] location: class org.apache.tez.dag.app.speculate.DefaultSpeculator
[ERROR] <https://builds.apache.org/job/Tez-Build/ws/tez-dag/src/main/java/org/apache/tez/dag/app/dag/impl/DAGImpl.java>:[53,34]
cannot find symbol
[ERROR] symbol  : class Clock
[ERROR] location: package org.apache.hadoop.yarn.util
[ERROR] <https://builds.apache.org/job/Tez-Build/ws/tez-dag/src/main/java/org/apache/tez/dag/app/dag/impl/DAGImpl.java>:[112,16]
cannot find symbol
[ERROR] symbol  : class Clock
[ERROR] location: class org.apache.tez.dag.app.dag.impl.DAGImpl
[ERROR] <https://builds.apache.org/job/Tez-Build/ws/tez-dag/src/main/java/org/apache/tez/dag/app/dag/impl/DAGImpl.java>:[325,38]
cannot find symbol
[ERROR] symbol  : class Clock
[ERROR] location: class org.apache.tez.dag.app.dag.impl.DAGImpl
[ERROR] <https://builds.apache.org/job/Tez-Build/ws/tez-dag/src/main/java/org/apache/tez/dag/app/ControlledClock.java>:[20,34]
cannot find symbol
[ERROR] symbol  : class Clock
[ERROR] location: package org.apache.hadoop.yarn.util
[ERROR] <https://builds.apache.org/job/Tez-Build/ws/tez-dag/src/main/java/org/apache/tez/dag/app/ControlledClock.java>:[22,40]
cannot find symbol
[ERROR] symbol: class Clock
[ERROR] public class ControlledClock implements Clock {
[ERROR] <https://builds.apache.org/job/Tez-Build/ws/tez-dag/src/main/java/org/apache/tez/dag/app/ControlledClock.java>:[24,16]
cannot find symbol
[ERROR] symbol  : class Clock
[ERROR] location: class org.apache.tez.dag.app.ControlledClock
[ERROR] <https://builds.apache.org/job/Tez-Build/ws/tez-dag/src/main/java/org/apache/tez/dag/app/ControlledClock.java>:[25,25]
cannot find symbol
[ERROR] symbol  : class Clock
[ERROR] location: class org.apache.tez.dag.app.ControlledClock
[ERROR] <https://builds.apache.org/job/Tez-Build/ws/tez-dag/src/main/java/org/apache/tez/dag/app/dag/impl/TaskImpl.java>:[41,34]
cannot find symbol
[ERROR] symbol  : class Clock
[ERROR] location: package org.apache.hadoop.yarn.util
[ERROR] <https://builds.apache.org/job/Tez-Build/ws/tez-dag/src/main/java/org/apache/tez/dag/app/dag/impl/TaskImpl.java>:[94,18]
cannot find symbol
[ERROR] symbol  : class Clock
[ERROR] location: class org.apache.tez.dag.app.dag.impl.TaskImpl
[ERROR] <https://builds.apache.org/job/Tez-Build/ws/tez-dag/src/main/java/org/apache/tez/dag/app/dag/impl/TaskImpl.java>:[273,31]
cannot find symbol
[ERROR] symbol  : class Clock
[ERROR] location: class org.apache.tez.dag.app.dag.impl.TaskImpl
[ERROR] <https://builds.apache.org/job/Tez-Build/ws/tez-dag/src/main/java/org/apache/tez/dag/app/DAGAppMaster.java>:[190,12]
cannot find symbol
[ERROR] symbol  : class SystemClock
[ERROR] location: class org.apache.tez.dag.app.DAGAppMaster
[ERROR] <https://builds.apache.org/job/Tez-Build/ws/tez-dag/src/main/java/org/apache/tez/dag/app/ControlledClock.java>:[35,2]
method does not override or implement a method from a supertype
[ERROR] -> [Help 1]
[ERROR] 
[ERROR] To see the full stack trace of the errors, re-run Maven with the -e switch.
[ERROR] Re-run Maven using the -X switch to enable full debug logging.
[ERROR] 
[ERROR] For more information about the errors and possible solutions, please read the following
articles:
[ERROR] [Help 1] http://cwiki.apache.org/confluence/display/MAVEN/MojoFailureException
[ERROR] 
[ERROR] After correcting the problems, you can resume the build with the command
[ERROR]   mvn <goals> -rf :tez-dag
Build step 'Execute shell' marked build as failure
Archiving artifacts
Recording test results

Mime
View raw message