tez-dev mailing list archives

Site index · List index
Message view « Date » · « Thread »
Top « Date » · « Thread »
From Apache Jenkins Server <jenk...@builds.apache.org>
Subject Build failed in Jenkins: Tez-Build #44
Date Mon, 17 Jun 2013 08:02:21 GMT
See <https://builds.apache.org/job/Tez-Build/44/changes>

Changes:

[sseth] TEZ-252. Fix build break caused by HADOOP-9649 changes. (sseth)

------------------------------------------
[...truncated 396 lines...]
Downloaded: https://repository.apache.org/content/repositories/snapshots/org/apache/tez/tez-common/maven-metadata.xml
(284 B at 1.2 KB/sec)
Uploading: https://repository.apache.org/content/repositories/snapshots/org/apache/tez/tez-common/0.2.0-SNAPSHOT/maven-metadata.xml
989 B   
        
Uploaded: https://repository.apache.org/content/repositories/snapshots/org/apache/tez/tez-common/0.2.0-SNAPSHOT/maven-metadata.xml
(989 B at 4.1 KB/sec)
Uploading: https://repository.apache.org/content/repositories/snapshots/org/apache/tez/tez-common/maven-metadata.xml
284 B   
        
Uploaded: https://repository.apache.org/content/repositories/snapshots/org/apache/tez/tez-common/maven-metadata.xml
(284 B at 1.4 KB/sec)
Uploading: https://repository.apache.org/content/repositories/snapshots/org/apache/tez/tez-common/0.2.0-SNAPSHOT/tez-common-0.2.0-20130617.080154-10-tests.jar
2 KB    
       
Uploaded: https://repository.apache.org/content/repositories/snapshots/org/apache/tez/tez-common/0.2.0-SNAPSHOT/tez-common-0.2.0-20130617.080154-10-tests.jar
(2 KB at 9.0 KB/sec)
Uploading: https://repository.apache.org/content/repositories/snapshots/org/apache/tez/tez-common/0.2.0-SNAPSHOT/maven-metadata.xml
990 B   
        
Uploaded: https://repository.apache.org/content/repositories/snapshots/org/apache/tez/tez-common/0.2.0-SNAPSHOT/maven-metadata.xml
(990 B at 7.4 KB/sec)
[INFO] 
[INFO] --- maven-resources-plugin:2.4.3:resources (default-resources) @ tez-common ---
[WARNING] Using platform encoding (ISO-8859-1 actually) to copy filtered resources, i.e. build
is platform dependent!
[INFO] skip non existing resourceDirectory <https://builds.apache.org/job/Tez-Build/ws/tez-common/src/main/resources>
[INFO] 
[INFO] --- maven-compiler-plugin:2.3.2:compile (default-compile) @ tez-common ---
[INFO] Nothing to compile - all classes are up to date
[INFO] 
[INFO] --- maven-resources-plugin:2.4.3:testResources (default-testResources) @ tez-common
---
[WARNING] Using platform encoding (ISO-8859-1 actually) to copy filtered resources, i.e. build
is platform dependent!
[INFO] skip non existing resourceDirectory <https://builds.apache.org/job/Tez-Build/ws/tez-common/src/test/resources>
[INFO] 
[INFO] --- maven-compiler-plugin:2.3.2:testCompile (default-testCompile) @ tez-common ---
[INFO] No sources to compile
[INFO] 
[INFO] --- maven-surefire-plugin:2.14.1:test (default-test) @ tez-common ---
[INFO] No tests to run.
[INFO] Skipping execution of surefire because it has already been run for this configuration
[INFO] 
[INFO] --- maven-jar-plugin:2.3.1:jar (default-jar) @ tez-common ---
[INFO] Building jar: <https://builds.apache.org/job/Tez-Build/ws/tez-common/target/tez-common-0.2.0-SNAPSHOT.jar>
[INFO] 
[INFO] --- maven-jar-plugin:2.3.1:test-jar (default) @ tez-common ---
[WARNING] JAR will be empty - no content was marked for inclusion!
[INFO] Building jar: <https://builds.apache.org/job/Tez-Build/ws/tez-common/target/tez-common-0.2.0-SNAPSHOT-tests.jar>
[INFO]                                                                         
[INFO] ------------------------------------------------------------------------
[INFO] Building tez-engine-api 0.2.0-SNAPSHOT
[INFO] ------------------------------------------------------------------------
[INFO] 
[INFO] --- maven-clean-plugin:2.4.1:clean (default-clean) @ tez-engine-api ---
[INFO] Deleting <https://builds.apache.org/job/Tez-Build/ws/tez-engine-api/target>
[INFO] 
[INFO] --- maven-resources-plugin:2.4.3:resources (default-resources) @ tez-engine-api ---
[WARNING] Using platform encoding (ISO-8859-1 actually) to copy filtered resources, i.e. build
is platform dependent!
[INFO] skip non existing resourceDirectory <https://builds.apache.org/job/Tez-Build/ws/tez-engine-api/src/main/resources>
[INFO] 
[INFO] --- maven-compiler-plugin:2.3.2:compile (default-compile) @ tez-engine-api ---
[WARNING] File encoding has not been set, using platform encoding ISO-8859-1, i.e. build is
platform dependent!
[INFO] Compiling 9 source files to <https://builds.apache.org/job/Tez-Build/ws/tez-engine-api/target/classes>
[INFO] 
[INFO] --- maven-resources-plugin:2.4.3:testResources (default-testResources) @ tez-engine-api
---
[WARNING] Using platform encoding (ISO-8859-1 actually) to copy filtered resources, i.e. build
is platform dependent!
[INFO] skip non existing resourceDirectory <https://builds.apache.org/job/Tez-Build/ws/tez-engine-api/src/test/resources>
[INFO] 
[INFO] --- maven-compiler-plugin:2.3.2:testCompile (default-testCompile) @ tez-engine-api
---
[INFO] No sources to compile
[INFO] 
[INFO] --- maven-surefire-plugin:2.14.1:test (default-test) @ tez-engine-api ---
[INFO] No tests to run.
[INFO] 
[INFO] --- maven-resources-plugin:2.4.3:resources (default-resources) @ tez-engine-api ---
[WARNING] Using platform encoding (ISO-8859-1 actually) to copy filtered resources, i.e. build
is platform dependent!
[INFO] skip non existing resourceDirectory <https://builds.apache.org/job/Tez-Build/ws/tez-engine-api/src/main/resources>
[INFO] 
[INFO] --- maven-compiler-plugin:2.3.2:compile (default-compile) @ tez-engine-api ---
[INFO] Nothing to compile - all classes are up to date
[INFO] 
[INFO] --- maven-resources-plugin:2.4.3:testResources (default-testResources) @ tez-engine-api
---
[WARNING] Using platform encoding (ISO-8859-1 actually) to copy filtered resources, i.e. build
is platform dependent!
[INFO] skip non existing resourceDirectory <https://builds.apache.org/job/Tez-Build/ws/tez-engine-api/src/test/resources>
[INFO] 
[INFO] --- maven-compiler-plugin:2.3.2:testCompile (default-testCompile) @ tez-engine-api
---
[INFO] No sources to compile
[INFO] 
[INFO] --- maven-surefire-plugin:2.14.1:test (default-test) @ tez-engine-api ---
[INFO] No tests to run.
[INFO] Skipping execution of surefire because it has already been run for this configuration
[INFO] 
[INFO] --- maven-jar-plugin:2.3.1:jar (default-jar) @ tez-engine-api ---
[INFO] Building jar: <https://builds.apache.org/job/Tez-Build/ws/tez-engine-api/target/tez-engine-api-0.2.0-SNAPSHOT.jar>
[INFO] 
[INFO] --- maven-jar-plugin:2.3.1:test-jar (default) @ tez-engine-api ---
[WARNING] JAR will be empty - no content was marked for inclusion!
[INFO] Building jar: <https://builds.apache.org/job/Tez-Build/ws/tez-engine-api/target/tez-engine-api-0.2.0-SNAPSHOT-tests.jar>
[INFO] 
[INFO] --- maven-install-plugin:2.3.1:install (default-install) @ tez-engine-api ---
[INFO] Installing <https://builds.apache.org/job/Tez-Build/ws/tez-engine-api/target/tez-engine-api-0.2.0-SNAPSHOT.jar>
to /home/jenkins/.m2/repository/org/apache/tez/tez-engine-api/0.2.0-SNAPSHOT/tez-engine-api-0.2.0-SNAPSHOT.jar
[INFO] Installing <https://builds.apache.org/job/Tez-Build/ws/tez-engine-api/pom.xml>
to /home/jenkins/.m2/repository/org/apache/tez/tez-engine-api/0.2.0-SNAPSHOT/tez-engine-api-0.2.0-SNAPSHOT.pom
[INFO] Installing <https://builds.apache.org/job/Tez-Build/ws/tez-engine-api/target/tez-engine-api-0.2.0-SNAPSHOT-tests.jar>
to /home/jenkins/.m2/repository/org/apache/tez/tez-engine-api/0.2.0-SNAPSHOT/tez-engine-api-0.2.0-SNAPSHOT-tests.jar
[INFO] 
[INFO] --- maven-deploy-plugin:2.5:deploy (default-deploy) @ tez-engine-api ---
Downloading: https://repository.apache.org/content/repositories/snapshots/org/apache/tez/tez-engine-api/0.2.0-SNAPSHOT/maven-metadata.xml
990 B   
        
Downloaded: https://repository.apache.org/content/repositories/snapshots/org/apache/tez/tez-engine-api/0.2.0-SNAPSHOT/maven-metadata.xml
(990 B at 0.8 KB/sec)
Uploading: https://repository.apache.org/content/repositories/snapshots/org/apache/tez/tez-engine-api/0.2.0-SNAPSHOT/tez-engine-api-0.2.0-20130617.080157-10.jar
4 KB    
8 KB   
10 KB   
        
Uploaded: https://repository.apache.org/content/repositories/snapshots/org/apache/tez/tez-engine-api/0.2.0-SNAPSHOT/tez-engine-api-0.2.0-20130617.080157-10.jar
(10 KB at 32.3 KB/sec)
Uploading: https://repository.apache.org/content/repositories/snapshots/org/apache/tez/tez-engine-api/0.2.0-SNAPSHOT/tez-engine-api-0.2.0-20130617.080157-10.pom
2 KB    
       
Uploaded: https://repository.apache.org/content/repositories/snapshots/org/apache/tez/tez-engine-api/0.2.0-SNAPSHOT/tez-engine-api-0.2.0-20130617.080157-10.pom
(2 KB at 10.7 KB/sec)
Downloading: https://repository.apache.org/content/repositories/snapshots/org/apache/tez/tez-engine-api/maven-metadata.xml
288 B   
        
Downloaded: https://repository.apache.org/content/repositories/snapshots/org/apache/tez/tez-engine-api/maven-metadata.xml
(288 B at 0.8 KB/sec)
Uploading: https://repository.apache.org/content/repositories/snapshots/org/apache/tez/tez-engine-api/0.2.0-SNAPSHOT/maven-metadata.xml
993 B   
        
Uploaded: https://repository.apache.org/content/repositories/snapshots/org/apache/tez/tez-engine-api/0.2.0-SNAPSHOT/maven-metadata.xml
(993 B at 4.3 KB/sec)
Uploading: https://repository.apache.org/content/repositories/snapshots/org/apache/tez/tez-engine-api/maven-metadata.xml
288 B   
        
Uploaded: https://repository.apache.org/content/repositories/snapshots/org/apache/tez/tez-engine-api/maven-metadata.xml
(288 B at 1.4 KB/sec)
Uploading: https://repository.apache.org/content/repositories/snapshots/org/apache/tez/tez-engine-api/0.2.0-SNAPSHOT/tez-engine-api-0.2.0-20130617.080157-10-tests.jar
2 KB    
       
Uploaded: https://repository.apache.org/content/repositories/snapshots/org/apache/tez/tez-engine-api/0.2.0-SNAPSHOT/tez-engine-api-0.2.0-20130617.080157-10-tests.jar
(2 KB at 13.5 KB/sec)
Uploading: https://repository.apache.org/content/repositories/snapshots/org/apache/tez/tez-engine-api/0.2.0-SNAPSHOT/maven-metadata.xml
994 B   
        
Uploaded: https://repository.apache.org/content/repositories/snapshots/org/apache/tez/tez-engine-api/0.2.0-SNAPSHOT/maven-metadata.xml
(994 B at 7.4 KB/sec)
[INFO] 
[INFO] --- maven-resources-plugin:2.4.3:resources (default-resources) @ tez-engine-api ---
[WARNING] Using platform encoding (ISO-8859-1 actually) to copy filtered resources, i.e. build
is platform dependent!
[INFO] skip non existing resourceDirectory <https://builds.apache.org/job/Tez-Build/ws/tez-engine-api/src/main/resources>
[INFO] 
[INFO] --- maven-compiler-plugin:2.3.2:compile (default-compile) @ tez-engine-api ---
[INFO] Nothing to compile - all classes are up to date
[INFO] 
[INFO] --- maven-resources-plugin:2.4.3:testResources (default-testResources) @ tez-engine-api
---
[WARNING] Using platform encoding (ISO-8859-1 actually) to copy filtered resources, i.e. build
is platform dependent!
[INFO] skip non existing resourceDirectory <https://builds.apache.org/job/Tez-Build/ws/tez-engine-api/src/test/resources>
[INFO] 
[INFO] --- maven-compiler-plugin:2.3.2:testCompile (default-testCompile) @ tez-engine-api
---
[INFO] No sources to compile
[INFO] 
[INFO] --- maven-surefire-plugin:2.14.1:test (default-test) @ tez-engine-api ---
[INFO] No tests to run.
[INFO] Skipping execution of surefire because it has already been run for this configuration
[INFO] 
[INFO] --- maven-jar-plugin:2.3.1:jar (default-jar) @ tez-engine-api ---
[INFO] Building jar: <https://builds.apache.org/job/Tez-Build/ws/tez-engine-api/target/tez-engine-api-0.2.0-SNAPSHOT.jar>
[INFO] 
[INFO] --- maven-jar-plugin:2.3.1:test-jar (default) @ tez-engine-api ---
[WARNING] JAR will be empty - no content was marked for inclusion!
[INFO] Building jar: <https://builds.apache.org/job/Tez-Build/ws/tez-engine-api/target/tez-engine-api-0.2.0-SNAPSHOT-tests.jar>
[INFO]                                                                         
[INFO] ------------------------------------------------------------------------
[INFO] Building tez-engine 0.2.0-SNAPSHOT
[INFO] ------------------------------------------------------------------------
[INFO] 
[INFO] --- maven-clean-plugin:2.4.1:clean (default-clean) @ tez-engine ---
[INFO] Deleting <https://builds.apache.org/job/Tez-Build/ws/tez-engine/target>
[INFO] 
[INFO] --- maven-resources-plugin:2.4.3:resources (default-resources) @ tez-engine ---
[WARNING] Using platform encoding (ISO-8859-1 actually) to copy filtered resources, i.e. build
is platform dependent!
[INFO] skip non existing resourceDirectory <https://builds.apache.org/job/Tez-Build/ws/tez-engine/src/main/resources>
[INFO] 
[INFO] --- maven-compiler-plugin:2.3.2:compile (default-compile) @ tez-engine ---
[WARNING] File encoding has not been set, using platform encoding ISO-8859-1, i.e. build is
platform dependent!
[INFO] Compiling 57 source files to <https://builds.apache.org/job/Tez-Build/ws/tez-engine/target/classes>
[INFO] -------------------------------------------------------------
[ERROR] COMPILATION ERROR : 
[INFO] -------------------------------------------------------------
[ERROR] <https://builds.apache.org/job/Tez-Build/ws/tez-engine/src/main/java/org/apache/tez/engine/common/shuffle/server/ShuffleHandler.java>:[62,32]
package org.apache.hadoop.service does not exist
[ERROR] <https://builds.apache.org/job/Tez-Build/ws/tez-engine/src/main/java/org/apache/tez/engine/common/shuffle/server/ShuffleHandler.java>:[104,36]
cannot find symbol
symbol: class AbstractService
public class ShuffleHandler extends AbstractService
[ERROR] <https://builds.apache.org/job/Tez-Build/ws/tez-engine/src/main/java/org/apache/tez/engine/common/sort/impl/dflt/InMemoryShuffleSorter.java>:[70,18]
cannot find symbol
symbol  : method start()
location: class org.apache.tez.engine.common.shuffle.server.ShuffleHandler
[ERROR] <https://builds.apache.org/job/Tez-Build/ws/tez-engine/src/main/java/org/apache/tez/engine/common/shuffle/server/ShuffleHandler.java>:[104,7]
org.apache.tez.engine.common.shuffle.server.ShuffleHandler is not abstract and does not override
abstract method getBlockers() in org.apache.hadoop.yarn.service.Service
[ERROR] <https://builds.apache.org/job/Tez-Build/ws/tez-engine/src/main/java/org/apache/tez/engine/common/shuffle/server/ShuffleHandler.java>:[245,8]
init(org.apache.hadoop.conf.Configuration,org.apache.tez.common.RunningTaskContext) in org.apache.tez.engine.common.shuffle.server.ShuffleHandler
cannot be applied to (org.apache.hadoop.conf.Configuration)
[ERROR] <https://builds.apache.org/job/Tez-Build/ws/tez-engine/src/main/java/org/apache/tez/engine/common/shuffle/server/ShuffleHandler.java>:[249,2]
method does not override or implement a method from a supertype
[ERROR] <https://builds.apache.org/job/Tez-Build/ws/tez-engine/src/main/java/org/apache/tez/engine/common/shuffle/server/ShuffleHandler.java>:[266,25]
cannot find symbol
symbol  : method getConfig()
location: class org.apache.tez.engine.common.shuffle.server.ShuffleHandler
[ERROR] <https://builds.apache.org/job/Tez-Build/ws/tez-engine/src/main/java/org/apache/tez/engine/common/shuffle/server/ShuffleHandler.java>:[280,13]
cannot find symbol
symbol  : method getName()
location: class org.apache.tez.engine.common.shuffle.server.ShuffleHandler
[ERROR] <https://builds.apache.org/job/Tez-Build/ws/tez-engine/src/main/java/org/apache/tez/engine/common/shuffle/server/ShuffleHandler.java>:[264,2]
method does not override or implement a method from a supertype
[ERROR] <https://builds.apache.org/job/Tez-Build/ws/tez-engine/src/main/java/org/apache/tez/engine/common/shuffle/server/ShuffleHandler.java>:[286,2]
method does not override or implement a method from a supertype
[INFO] 10 errors 
[INFO] -------------------------------------------------------------
[INFO] ------------------------------------------------------------------------
[INFO] Reactor Summary:
[INFO] 
[INFO] tez ............................................... SUCCESS [3.330s]
[INFO] tez-dag-api ....................................... SUCCESS [18.067s]
[INFO] tez-common ........................................ SUCCESS [3.263s]
[INFO] tez-engine-api .................................... SUCCESS [3.509s]
[INFO] tez-engine ........................................ FAILURE [1.667s]
[INFO] tez-mapreduce ..................................... SKIPPED
[INFO] tez-yarn-client ................................... SKIPPED
[INFO] tez-dag ........................................... SKIPPED
[INFO] tez-mapreduce-examples ............................ SKIPPED
[INFO] tez-mapreduce-tests ............................... SKIPPED
[INFO] tez-dist .......................................... SKIPPED
[INFO] ------------------------------------------------------------------------
[INFO] BUILD FAILURE
[INFO] ------------------------------------------------------------------------
[INFO] Total time: 30.136s
[INFO] Finished at: Mon Jun 17 08:02:01 UTC 2013
[INFO] Final Memory: 52M/359M
[INFO] ------------------------------------------------------------------------
[ERROR] Failed to execute goal org.apache.maven.plugins:maven-compiler-plugin:2.3.2:compile
(default-compile) on project tez-engine: Compilation failure: Compilation failure:
[ERROR] <https://builds.apache.org/job/Tez-Build/ws/tez-engine/src/main/java/org/apache/tez/engine/common/shuffle/server/ShuffleHandler.java>:[62,32]
package org.apache.hadoop.service does not exist
[ERROR] <https://builds.apache.org/job/Tez-Build/ws/tez-engine/src/main/java/org/apache/tez/engine/common/shuffle/server/ShuffleHandler.java>:[104,36]
cannot find symbol
[ERROR] symbol: class AbstractService
[ERROR] public class ShuffleHandler extends AbstractService
[ERROR] <https://builds.apache.org/job/Tez-Build/ws/tez-engine/src/main/java/org/apache/tez/engine/common/sort/impl/dflt/InMemoryShuffleSorter.java>:[70,18]
cannot find symbol
[ERROR] symbol  : method start()
[ERROR] location: class org.apache.tez.engine.common.shuffle.server.ShuffleHandler
[ERROR] <https://builds.apache.org/job/Tez-Build/ws/tez-engine/src/main/java/org/apache/tez/engine/common/shuffle/server/ShuffleHandler.java>:[104,7]
org.apache.tez.engine.common.shuffle.server.ShuffleHandler is not abstract and does not override
abstract method getBlockers() in org.apache.hadoop.yarn.service.Service
[ERROR] <https://builds.apache.org/job/Tez-Build/ws/tez-engine/src/main/java/org/apache/tez/engine/common/shuffle/server/ShuffleHandler.java>:[245,8]
init(org.apache.hadoop.conf.Configuration,org.apache.tez.common.RunningTaskContext) in org.apache.tez.engine.common.shuffle.server.ShuffleHandler
cannot be applied to (org.apache.hadoop.conf.Configuration)
[ERROR] <https://builds.apache.org/job/Tez-Build/ws/tez-engine/src/main/java/org/apache/tez/engine/common/shuffle/server/ShuffleHandler.java>:[249,2]
method does not override or implement a method from a supertype
[ERROR] <https://builds.apache.org/job/Tez-Build/ws/tez-engine/src/main/java/org/apache/tez/engine/common/shuffle/server/ShuffleHandler.java>:[266,25]
cannot find symbol
[ERROR] symbol  : method getConfig()
[ERROR] location: class org.apache.tez.engine.common.shuffle.server.ShuffleHandler
[ERROR] <https://builds.apache.org/job/Tez-Build/ws/tez-engine/src/main/java/org/apache/tez/engine/common/shuffle/server/ShuffleHandler.java>:[280,13]
cannot find symbol
[ERROR] symbol  : method getName()
[ERROR] location: class org.apache.tez.engine.common.shuffle.server.ShuffleHandler
[ERROR] <https://builds.apache.org/job/Tez-Build/ws/tez-engine/src/main/java/org/apache/tez/engine/common/shuffle/server/ShuffleHandler.java>:[264,2]
method does not override or implement a method from a supertype
[ERROR] <https://builds.apache.org/job/Tez-Build/ws/tez-engine/src/main/java/org/apache/tez/engine/common/shuffle/server/ShuffleHandler.java>:[286,2]
method does not override or implement a method from a supertype
[ERROR] -> [Help 1]
[ERROR] 
[ERROR] To see the full stack trace of the errors, re-run Maven with the -e switch.
[ERROR] Re-run Maven using the -X switch to enable full debug logging.
[ERROR] 
[ERROR] For more information about the errors and possible solutions, please read the following
articles:
[ERROR] [Help 1] http://cwiki.apache.org/confluence/display/MAVEN/MojoFailureException
[ERROR] 
[ERROR] After correcting the problems, you can resume the build with the command
[ERROR]   mvn <goals> -rf :tez-engine
Build step 'Execute shell' marked build as failure
Archiving artifacts
Recording test results

Mime
View raw message